"molecule_id","AMW","C.","H.","Me","Mi","Mp","Mv","MW","N.","nAB","nAT","nB","nBM","nBO","nBR","nBT","nC","nCL","nCsp","nCsp2","nCsp3","nDB","nF","nH","nHet","nHM","nI","nN","nO","nP","nS","nSK","nTB","nX","O.","RBF","RBN","SCBO","Se","Si","Sp","Sv","X.","pXC50"
{1 8.233,2 32.7,3 42.9,4 1.042,5 1.179,6 0.614,7 0.615,8 403.44,9 14.3,10 6,11 49,13 7,14 31,16 52,17 16,20 4,21 12,22 1,23 4,24 21,25 12,28 7,29 1,32 28,34 4,35 2,36 0.058,37 3,38 35,39 51.043,40 57.793,41 30.097,42 30.139,43 8.2,44 4.523}
{0 CHEMBL207912,1 6.843,2 37.5,3 50,4 0.998,5 1.137,6 0.636,7 0.6,8 328.46,9 8.3,11 48,13 3,14 27,16 51,17 18,19 2,20 1,21 15,22 1,24 24,25 6,28 4,29 2,32 24,33 2,35 4.2,36 0.059,37 3,38 32,39 47.898,40 54.564,41 30.546,42 28.783,44 4.523}
{0 CHEMBL207980,1 6.648,2 38.3,3 51.1,4 0.991,5 1.135,6 0.64,7 0.597,8 312.46,9 8.5,11 47,13 3,14 26,16 50,17 18,19 2,20 1,21 15,22 1,24 24,25 5,28 4,29 1,32 23,33 2,35 2.1,36 0.06,37 3,38 31,39 46.571,40 53.355,41 30.091,42 28.068,44 4.523}
{0 CHEMBL209191,1 6.618,2 34.8,3 52.2,4 0.998,5 1.143,6 0.621,7 0.582,8 304.44,9 8.7,11 46,13 3,14 23,16 47,17 16,19 2,20 1,21 13,22 1,24 24,25 6,28 4,29 2,32 22,33 2,35 4.3,36 0.128,37 6,38 28,39 45.898,40 52.564,41 28.546,42 26.783,44 4.523}
{0 CHEMBL209994,1 6.394,2 34.6,3 53.8,4 0.994,5 1.142,6 0.617,7 0.574,8 332.5,9 7.7,11 52,13 3,14 25,16 53,17 18,19 2,20 1,21 15,22 1,24 28,25 6,28 4,29 2,32 24,33 2,35 3.8,36 0.151,37 8,38 30,39 51.665,40 59.394,41 32.069,42 29.837,44 4.523}
{0 CHEMBL237786,1 8.541,2 42.6,3 38.3,4 1.031,5 1.15,6 0.668,7 0.664,8 401.43,9 10.6,10 18,11 47,13 18,14 32,16 50,17 20,20 15,21 5,23 3,24 18,25 9,28 5,29 1,32 29,34 3,35 2.1,36 0.08,37 4,38 41,39 48.443,40 54.042,41 31.387,42 31.186,43 6.4,44 4.523}
{0 CHEMBL379086,1 6.754,2 34.9,3 51.2,4 1,5 1.143,6 0.623,7 0.587,8 290.41,9 9.3,11 43,13 3,14 22,16 44,17 15,19 2,20 1,21 12,22 1,24 22,25 6,28 4,29 2,32 21,33 2,35 4.7,36 0.114,37 5,38 27,39 43.014,40 49.149,41 26.784,42 25.256,44 4.523}
{0 CHEMBL379522,1 6.909,2 35,3 50,4 1.003,5 1.143,6 0.626,7 0.593,8 276.38,9 10,11 40,13 3,14 21,16 41,17 14,19 2,20 1,21 11,22 1,24 20,25 6,28 4,29 2,32 20,33 2,35 5,36 0.098,37 4,38 26,39 40.131,40 45.734,41 25.023,42 23.73,44 4.523}
{0 CHEMBL383488,1 6.782,2 38.6,3 50,4 0.993,5 1.135,6 0.644,7 0.603,8 298.43,9 9.1,11 44,13 3,14 25,16 47,17 17,19 2,20 1,21 14,22 1,24 22,25 5,28 4,29 1,32 22,33 2,35 2.3,36 0.064,37 3,38 30,39 43.687,40 49.939,41 28.33,42 26.542,44 4.523}
{0 CHEMBL515387,1 7.329,2 34,3 48,4 1.016,5 1.161,6 0.62,7 0.598,8 366.47,9 12,10 6,11 50,13 7,14 29,16 53,17 17,20 5,21 12,22 1,23 2,24 24,25 9,28 6,29 1,32 26,34 2,35 2,36 0.057,37 3,38 33,39 50.8,40 58.031,41 30.978,42 29.878,43 4,44 4.523}
