"molecule_id","AMW","C.","H.","Me","Mi","Mp","Mv","MW","N.","nAB","nAT","nB","nBM","nBO","nBR","nBT","nC","nCL","nCsp","nCsp2","nCsp3","nDB","nF","nH","nHet","nHM","nI","nN","nO","nP","nS","nSK","nTB","nX","O.","RBF","RBN","SCBO","Se","Si","Sp","Sv","X.","pXC50"
{1 8.211,2 52.4,3 40.5,4 0.99,5 1.101,6 0.737,7 0.692,8 344.86,9 4.8,10 23,11 42,13 23,14 28,16 45,17 22,18 1,20 21,21 1,24 17,25 3,26 1,28 2,32 25,34 1,36 0.089,37 4,38 39.5,39 41.596,40 46.262,41 30.961,42 29.085,43 2.4,44 5.229}
{0 CHEMBL1221,1 10.199,2 46.2,3 38.5,4 1.008,5 1.104,6 0.778,7 0.716,8 397.77,9 5.1,10 17,11 39,13 17,14 26,16 41,17 18,18 3,20 15,21 3,24 15,25 6,26 4,28 2,31 1,32 24,34 3,36 0.146,37 6,38 34.5,39 39.32,40 43.07,41 30.324,42 27.927,43 7.7,44 4.996}
{0 CHEMBL1475252,1 8.249,2 38.1,3 42.9,4 1.015,5 1.13,6 0.675,7 0.645,8 346.45,9 9.5,10 16,11 42,13 17,14 26,16 44,17 16,20 11,21 5,22 1,24 18,25 8,26 1,28 4,29 3,31 1,32 24,35 7.1,36 0.114,37 5,38 35,39 42.651,40 47.448,41 28.364,42 27.105,44 5.745}
{0 CHEMBL1502,1 9.351,2 39,3 36.6,4 1.046,5 1.142,6 0.675,7 0.672,8 383.41,9 7.3,10 16,11 41,13 17,14 28,16 43,17 16,20 12,21 4,22 1,23 2,24 15,25 10,26 1,28 3,29 4,31 1,32 26,34 2,35 9.8,36 0.14,37 6,38 37,39 42.902,40 46.838,41 27.688,42 27.565,43 4.9,44 4.9}
{0 CHEMBL192,1 7.534,2 34.9,3 47.6,4 1.01,5 1.139,6 0.645,7 0.611,8 474.65,9 9.5,10 11,11 63,13 15,14 36,16 66,17 22,20 11,21 11,22 4,24 30,25 11,26 1,28 6,29 4,31 1,32 33,35 6.3,36 0.106,37 7,38 45.5,39 63.6,40 71.73,41 40.637,42 38.496,44 5.347}
{0 CHEMBL193,1 8.055,2 39.5,3 41.9,4 1.029,5 1.13,6 0.647,7 0.641,8 346.37,9 4.7,10 6,11 43,13 12,14 26,16 44,17 17,20 12,21 5,22 6,24 18,25 8,28 2,29 6,32 25,35 14,36 0.114,37 5,38 35,39 44.236,40 48.575,41 27.83,42 27.546,44 5.824}
{0 CHEMBL38,1 6.01,2 40,3 56,4 0.981,5 1.125,6 0.631,7 0.576,8 300.48,11 50,13 6,14 22,16 50,17 20,20 11,21 9,22 6,24 28,25 2,29 2,32 22,35 4,36 0.1,37 5,38 28,39 49.025,40 56.232,41 31.569,42 28.805,44 4.542}
{0 CHEMBL408,1 7.614,2 41.4,3 46.6,4 1.005,5 1.118,6 0.669,7 0.632,8 441.59,9 1.7,10 12,11 58,13 14,14 34,16 61,17 24,20 14,21 10,22 2,24 27,25 7,26 1,28 1,29 5,31 1,32 31,35 8.6,36 0.082,37 5,38 42,39 58.302,40 64.863,41 38.824,42 36.631,44 5.347}
{0 CHEMBL480,1 9.472,2 41,3 35.9,4 1.045,5 1.148,6 0.685,7 0.68,8 369.4,9 7.7,10 16,11 39,13 17,14 27,16 41,17 16,20 12,21 4,22 1,23 3,24 14,25 9,26 1,28 3,29 2,31 1,32 25,34 3,35 5.1,36 0.122,37 5,38 36,39 40.76,40 44.759,41 26.716,42 26.518,43 7.7,44 5.086}
{0 CHEMBL7301,1 6.316,2 41.9,3 53.2,4 0.982,5 1.122,6 0.647,7 0.595,8 391.6,9 1.6,10 6,11 62,13 12,14 30,16 63,17 26,20 17,21 9,22 6,24 33,25 3,28 1,29 2,32 29,35 3.2,36 0.095,37 6,38 39,39 60.894,40 69.56,41 40.097,42 36.88,44 4.728}
{0 CHEMBL808,1 9.787,2 46.2,3 38.5,4 1.015,5 1.112,6 0.747,7 0.704,8 381.7,9 5.1,10 17,11 39,13 17,14 26,16 41,17 18,18 3,20 15,21 3,24 15,25 6,26 3,28 2,29 1,32 24,34 3,35 2.6,36 0.146,37 6,38 34.5,39 39.571,40 43.36,41 29.131,42 27.455,43 7.7,44 5.119}
{0 CHEMBL91,1 10.67,2 46.2,3 35.9,4 1.023,5 1.11,6 0.769,7 0.725,8 416.14,9 5.1,10 17,11 39,13 17,14 27,16 41,17 18,18 4,20 15,21 3,24 14,25 7,26 4,28 2,29 1,32 25,34 4,35 2.6,36 0.146,37 6,38 35.5,39 39.895,40 43.304,41 29.989,42 28.282,43 10.3,44 5.174}
