{
  "data_set_description": {
    "collection_date": "November 2013",
    "creator": "Dr Jeremy Besnard, Dr Ivan Olier, Dr Noureddin Sadawi, Dr Larisa Soldatova, Dr Crina Grosan, Prof Ross King, Dr Richard Bickerton, Prof Andrew Hopkins and Dr Willem van Hoorn",
    "default_target_attribute": "pXC50",
    "description": "This dataset contains QSAR data (from ChEMBL version 17) showing activity values (unit is pseudo-pCI50) of several compounds on drug target ChEMBL_ID: CHEMBL2189159 (TID: 105489), and it has 12 rows and 43 features (not including molecule IDs and class feature: molecule_id and pXC50). The features represent Basic Molecular Descriptors which were generated from SMILES strings.  Missing value imputation was applied to this dataset (By choosing the Median).",
    "description_version": "1",
    "file_id": "3254431",
    "format": "ARFF",
    "id": "24830",
    "licence": "Public",
    "md5_checksum": "4dcccb0b00eb2ade8b6510ca0e1e68a6",
    "minio_url": "https://data.openml.org/datasets/0002/24830/dataset_24830.pq",
    "name": "QSAR-DATASET-FOR-DRUG-TARGET-CHEMBL2189159",
    "original_data_url": "https://www.ebi.ac.uk/chembl/target/inspect/CHEMBL2189159",
    "parquet_url": "https://data.openml.org/datasets/0002/24830/dataset_24830.pq",
    "processing_date": "2018-10-03 23:05:19",
    "row_id_attribute": "molecule_id",
    "status": "deactivated",
    "tag": [
      "MetaQSAR",
      "study_13"
    ],
    "upload_date": "2016-07-14T15:31:22",
    "url": "https://api.openml.org/data/v1/download/3254431/QSAR-DATASET-FOR-DRUG-TARGET-CHEMBL2189159.arff",
    "version": "9",
    "visibility": "public"
  }
}