{
  "data_set_description": {
    "collection_date": "November 2013",
    "creator": "Dr Jeremy Besnard, Dr Ivan Olier, Dr Noureddin Sadawi, Dr Larisa Soldatova, Dr Crina Grosan, Prof Ross King, Dr Richard Bickerton, Prof Andrew Hopkins and Dr Willem van Hoorn",
    "default_target_attribute": "pXC50",
    "description": "This dataset contains QSAR data (from ChEMBL version 17) showing activity values (unit is pseudo-pCI50) of several compounds on drug target ChEMBL_ID: CHEMBL3520 (TID: 14044), and it has 91 rows and 43 features (not including molecule IDs and class feature: molecule_id and pXC50). The features represent Basic Molecular Descriptors which were generated from SMILES strings.  Missing value imputation was applied to this dataset (By choosing the Median).",
    "description_version": "1",
    "file_id": "3254362",
    "format": "ARFF",
    "id": "24825",
    "licence": "Public",
    "md5_checksum": "81e8eb78609aa184bdd80f185e6441d5",
    "minio_url": "https://data.openml.org/datasets/0002/24825/dataset_24825.pq",
    "name": "QSAR-DATASET-FOR-DRUG-TARGET-CHEMBL3520",
    "original_data_url": "https://www.ebi.ac.uk/chembl/target/inspect/CHEMBL3520",
    "parquet_url": "https://data.openml.org/datasets/0002/24825/dataset_24825.pq",
    "processing_date": "2018-10-03 23:01:19",
    "row_id_attribute": "molecule_id",
    "status": "deactivated",
    "tag": [
      "MetaQSAR",
      "study_13"
    ],
    "upload_date": "2016-07-14T15:30:43",
    "url": "https://api.openml.org/data/v1/download/3254362/QSAR-DATASET-FOR-DRUG-TARGET-CHEMBL3520.arff",
    "version": "7",
    "visibility": "public"
  }
}