"molecule_id","nAT","Si","nN","nH","nBM","nHet","Se","O.","nC","Mp","nCsp2","nAB","nCsp3","SCBO","Sv","pXC50"
{1 19,2 21.997,3 1,4 9,5 2,6 5,7 19.945,8 21.1,9 5,10 0.572,11 2,13 3,14 11,15 10.988,16 4}
{0 CHEMBL1215518,1 45,2 51.817,3 2,4 26,5 2,6 6,7 45.116,8 8.9,9 13,10 0.577,11 2,13 11,14 20,15 24.224,16 4}
{0 CHEMBL1215519,1 48,2 55.232,3 2,4 28,5 2,6 6,7 48,8 8.3,9 14,10 0.578,11 2,13 12,14 21,15 25.75,16 4}
{0 CHEMBL1215520,1 51,2 58.647,3 2,4 30,5 2,6 6,7 50.883,8 7.8,9 15,10 0.578,11 2,13 13,14 22,15 27.277,16 4}
{0 CHEMBL1215587,1 48,2 55.232,3 2,4 28,5 2,6 6,7 48,8 8.3,9 14,10 0.578,11 2,13 12,14 21,15 25.75,16 4}
{0 CHEMBL1215588,1 57,2 65.477,3 2,4 34,5 2,6 6,7 56.65,8 7,9 17,10 0.579,11 2,13 15,14 24,15 30.331,16 4}
{0 CHEMBL1229308,1 48,2 55.232,3 2,4 28,5 2,6 6,7 48,8 8.3,9 14,10 0.578,11 2,13 12,14 21,15 25.75,16 4}
{0 CHEMBL1229508,1 25,2 28.526,3 4,4 6,5 16,6 8,7 26.665,8 8,9 11,10 0.73,11 11,12 15,14 29.5,15 18.78,16 7.1}
{0 CHEMBL1230217,1 25,2 28.257,3 3,4 7,5 12,6 8,7 26.586,8 12,9 10,10 0.735,11 9,12 10,13 1,14 26,15 18.444,16 4.9}
{0 CHEMBL1230640,1 21,2 23.372,3 1,4 7,5 12,6 4,7 21.735,8 14.3,9 10,10 0.698,11 10,12 11,14 21.5,15 14.746,16 4.523}
{0 CHEMBL1234886,1 2,2 2.419,5 1,6 2,7 2.655,8 100,10 0.455,14 2,15 1.43,16 4}
{0 CHEMBL1435274,1 21,2 23.372,3 1,4 7,5 12,6 4,7 21.735,8 14.3,9 10,10 0.698,11 10,12 11,14 21.5,15 14.746,16 4.854}
{0 CHEMBL1686,1 16,2 18.293,4 6,5 3,6 5,7 17.287,8 31.3,9 5,10 0.597,11 3,13 2,14 12,15 10.154,16 5.699}
{0 CHEMBL1688395,1 25,2 28.369,3 3,4 9,5 12,6 6,7 25.938,8 12,9 10,10 0.667,11 9,12 10,13 1,14 24,15 16.789,16 4}
{0 CHEMBL1688396,1 25,2 28.21,3 3,4 8,5 12,6 7,7 26.167,8 12,9 10,10 0.721,11 9,12 10,13 1,14 25,15 17.814,16 4.6}
{0 CHEMBL1688397,1 25,2 28.708,3 3,4 8,5 12,6 7,7 26.451,8 12,9 10,10 0.664,11 9,12 10,13 1,14 25,15 17.172,16 4}
{0 CHEMBL1688398,1 29,2 32.993,3 3,4 11,5 12,6 7,7 30.149,8 13.8,9 11,10 0.651,11 9,12 10,13 2,14 26,15 19.031,16 4.3}
{0 CHEMBL1688399,1 31,2 37.237,3 3,4 7,5 12,6 12,7 34.782,8 9.7,9 12,10 0.639,11 9,12 10,13 3,14 32,15 22.142,16 4.7}
{0 CHEMBL1688400,1 34,2 40.653,3 3,4 9,5 12,6 12,7 37.665,8 8.8,9 13,10 0.635,11 9,12 10,13 4,14 33,15 23.669,16 4.3}
{0 CHEMBL1688401,1 34,2 40.653,3 3,4 9,5 12,6 12,7 37.665,8 8.8,9 13,10 0.635,11 9,12 10,13 4,14 33,15 23.669,16 4.1}
{0 CHEMBL1688402,1 25,2 28.242,3 4,4 8,5 16,6 6,7 25.829,8 8,9 11,10 0.698,11 11,12 15,14 27.5,15 17.569,16 6}
{0 CHEMBL1688403,1 25,2 28.084,3 4,4 7,5 16,6 7,7 26.058,8 8,9 11,10 0.752,11 11,12 15,14 28.5,15 18.594,16 6.4}
{0 CHEMBL1688404,1 29,2 32.867,3 4,4 10,5 16,6 7,7 30.04,8 10.3,9 12,10 0.678,11 11,12 15,13 1,14 29.5,15 19.81,16 6.4}
{0 CHEMBL1688405,1 29,2 33.886,3 4,4 7,5 16,6 10,7 31.578,8 10.3,9 12,10 0.672,11 11,12 15,13 1,14 32.5,15 20.96,16 6.5}
{0 CHEMBL1688406,1 29,2 33.728,3 4,4 6,5 16,6 11,7 31.807,8 10.3,9 12,10 0.718,11 11,12 15,13 1,14 33.5,15 21.986,16 6.8}
{0 CHEMBL1688407,1 28,2 32.621,3 4,4 6,5 16,6 10,7 30.574,8 7.1,9 12,10 0.71,11 11,12 15,13 1,14 32.5,15 21.073,16 7.1}
{0 CHEMBL1688408,1 28,2 33.016,3 4,4 6,5 16,6 10,7 30.763,8 7.1,9 12,10 0.677,11 11,12 15,13 1,14 32.5,15 20.629,16 7}
{0 CHEMBL1800368,1 16,2 18.083,3 1,4 7,5 2,6 4,7 16.484,8 12.5,9 5,10 0.678,11 2,13 3,14 11,15 10.219,16 4.157}
{0 CHEMBL1938900,1 65,2 73.149,3 3,4 29,5 21,6 9,7 65.756,8 9.2,9 27,10 0.656,11 21,12 17,13 6,14 50.5,15 41.201,16 4.081}
{0 CHEMBL196,1 20,2 22.917,4 8,5 2,6 6,7 21.498,8 30,9 6,10 0.589,11 3,13 3,14 14,15 12.396,16 3.745}
{0 CHEMBL2040854,1 72,2 81.102,3 7,4 29,5 27,6 12,7 73.069,8 6.9,9 31,10 0.676,11 23,12 24,13 8,14 63,15 47.519,16 9.222}
{0 CHEMBL2040865,1 55,2 61.438,3 5,4 23,5 24,6 6,7 54.789,8 1.8,9 26,10 0.697,11 20,12 23,13 6,14 49.5,15 36.563,16 4.301}
{0 CHEMBL2040894,1 69,2 78.185,3 8,4 28,5 25,6 13,7 70.287,8 7.2,9 28,10 0.666,11 19,12 23,13 9,14 59.5,15 45.013,16 7.959}
{0 CHEMBL2040895,1 64,2 72.351,3 8,4 26,5 25,6 11,7 64.749,8 4.7,9 27,10 0.676,11 20,12 23,13 7,14 56.5,15 42.057,16 7.119}
{0 CHEMBL2040896,1 63,2 71.063,3 7,4 25,5 25,6 11,7 63.974,8 6.3,9 27,10 0.678,11 20,12 23,13 7,14 56.5,15 41.75,16 8.032}
{0 CHEMBL2040897,1 69,2 77.604,3 7,4 29,5 25,6 11,7 69.491,8 4.3,9 29,10 0.687,11 20,12 23,13 9,14 58.5,15 45.276,16 9.046}
{0 CHEMBL2041010,1 70,2 78.524,3 6,4 28,5 26,6 12,7 71.043,8 7.1,9 30,10 0.69,11 22,12 23,13 8,14 61.5,15 46.684,16 9.222}
{0 CHEMBL2041164,1 70,2 78.524,3 6,4 28,5 26,6 12,7 71.043,8 7.1,9 30,10 0.69,11 22,12 23,13 8,14 61.5,15 46.684,16 8.553}
{0 CHEMBL2041165,1 70,2 78.813,3 6,4 28,5 26,6 12,7 71.294,8 8.6,9 30,10 0.673,11 22,12 23,13 8,14 61.5,15 46.212,16 8.31}
{0 CHEMBL2041166,1 65,2 73.351,3 8,4 26,5 26,6 11,7 65.749,8 4.6,9 28,10 0.681,11 21,12 24,13 7,14 58,15 43.057,16 7.854}
{0 CHEMBL2041167,1 66,2 74.561,3 8,4 26,5 26,6 12,7 67.076,8 6.1,9 28,10 0.678,11 21,12 24,13 7,14 59,15 43.772,16 8.409}
{0 CHEMBL2041168,1 77,2 86.597,3 8,4 32,5 31,6 11,7 77.4,8 3.9,9 34,10 0.682,11 26,12 29,13 8,14 67.5,15 50.637,16 8.268}
{0 CHEMBL2041169,1 74,2 83.182,3 8,4 30,5 31,6 11,7 74.516,8 4.1,9 33,10 0.686,11 26,12 29,13 7,14 66.5,15 49.11,16 9.699}
{0 CHEMBL2041170,1 80,2 90.139,3 7,4 35,5 26,6 11,7 80.392,8 5,9 34,10 0.669,11 23,12 24,13 11,14 65,15 51.384,16 9.222}
{0 CHEMBL2041171,1 78,2 87.806,3 8,4 32,5 31,6 12,7 78.727,8 5.1,9 34,10 0.679,11 26,12 29,13 8,14 68.5,15 51.352,16 8.959}
{0 CHEMBL2041172,1 73,2 82.182,3 8,4 30,5 30,6 11,7 73.516,8 4.1,9 32,10 0.682,11 24,12 28,13 8,14 65,15 48.11,16 8.699}
{0 CHEMBL2041173,1 73,2 82.182,3 8,4 30,5 30,6 11,7 73.516,8 4.1,9 32,10 0.682,11 24,12 28,13 8,14 65,15 48.11,16 8.638}
{0 CHEMBL2041174,1 73,2 82.182,3 8,4 30,5 30,6 11,7 73.516,8 4.1,9 32,10 0.682,11 24,12 28,13 8,14 65,15 48.11,16 8.824}
{0 CHEMBL2041175,1 69,2 77.188,3 7,4 27,5 30,6 11,7 69.607,8 4.3,9 31,10 0.705,11 24,12 28,13 7,14 64,15 46.749,16 9.699}
{0 CHEMBL2041176,1 71,2 79.684,3 7,4 29,5 27,6 10,7 71.414,8 4.2,9 32,10 0.687,11 23,12 24,13 8,14 63,15 47.089,16 8.796}
{0 CHEMBL2041177,1 74,2 83.308,3 7,4 31,5 27,6 11,7 74.625,8 5.4,9 32,10 0.676,11 24,12 24,13 8,14 63,15 48.331,16 9.097}
{0 CHEMBL2041178,1 77,2 86.723,3 7,4 33,5 27,6 11,7 77.509,8 5.2,9 33,10 0.672,11 24,12 24,13 9,14 64,15 49.857,16 9.301}
{0 CHEMBL2041179,1 80,2 90.139,3 7,4 35,5 27,6 11,7 80.392,8 5,9 34,10 0.669,11 24,12 24,13 10,14 65,15 51.384,16 8.328}
{0 CHEMBL2041180,1 72,2 81.102,3 7,4 29,5 27,6 12,7 73.069,8 6.9,9 31,10 0.676,11 23,12 24,13 8,14 63,15 47.519,16 8.796}
{0 CHEMBL2041181,1 75,2 84.518,3 7,4 31,5 27,6 12,7 75.952,8 6.7,9 32,10 0.673,11 23,12 24,13 9,14 64,15 49.045,16 8.721}
{0 CHEMBL2041182,1 75,2 84.225,3 6,4 32,5 27,6 10,7 75.407,8 5.3,9 33,10 0.677,11 24,12 24,13 9,14 63,15 48.836,16 9.699}
{0 CHEMBL2041183,1 75,2 85.244,3 6,4 29,5 27,6 13,7 76.945,8 5.3,9 33,10 0.674,11 24,12 24,13 9,14 66,15 49.986,16 9.301}
{0 CHEMBL2041184,1 75,2 84.225,3 6,4 32,5 27,6 10,7 75.407,8 5.3,9 33,10 0.677,11 24,12 24,13 9,14 63,15 48.836,16 9.699}
{0 CHEMBL2041185,1 76,2 85.434,3 6,4 32,5 27,6 11,7 76.734,8 6.6,9 33,10 0.674,11 24,12 24,13 9,14 64,15 49.551,16 9.699}
{0 CHEMBL2041186,1 75,2 84.225,3 6,4 32,5 27,6 10,7 75.407,8 5.3,9 33,10 0.677,11 24,12 24,13 9,14 63,15 48.836,16 9.699}
{0 CHEMBL2041187,1 69,2 77.395,3 6,4 28,5 27,6 10,7 69.64,8 5.8,9 31,10 0.684,11 24,12 24,13 7,14 61,15 45.782,16 9.097}
{0 CHEMBL2041188,1 72,2 80.81,3 6,4 30,5 27,6 10,7 72.523,8 5.6,9 32,10 0.68,11 24,12 24,13 8,14 62,15 47.309,16 9.398}
{0 CHEMBL2041189,1 69,2 77.395,3 6,4 28,5 27,6 10,7 69.64,8 5.8,9 31,10 0.684,11 24,12 24,13 7,14 61,15 45.782,16 9.398}
{0 CHEMBL2041190,1 72,2 80.81,3 6,4 30,5 27,6 10,7 72.523,8 5.6,9 32,10 0.68,11 24,12 24,13 8,14 62,15 47.309,16 9.699}
{0 CHEMBL2041191,1 71,2 79.893,3 7,4 29,5 27,6 11,7 71.741,8 5.6,9 31,10 0.679,11 23,12 24,13 8,14 62,15 46.804,16 9}
{0 CHEMBL2041192,1 69,2 77.395,3 6,4 28,5 27,6 10,7 69.64,8 5.8,9 31,10 0.684,11 24,12 24,13 7,14 61,15 45.782,16 9.699}
{0 CHEMBL2041193,1 72,2 80.81,3 6,4 30,5 27,6 10,7 72.523,8 5.6,9 32,10 0.68,11 24,12 24,13 8,14 62,15 47.309,16 9.699}
{0 CHEMBL2041194,1 71,2 79.893,3 7,4 29,5 27,6 11,7 71.741,8 5.6,9 31,10 0.679,11 23,12 24,13 8,14 62,15 46.804,16 9.097}
{0 CHEMBL2042126,1 55,2 61.77,3 4,4 26,5 18,6 5,7 54.454,8 1.8,9 24,10 0.67,11 16,12 17,13 8,14 42.5,15 34.595,16 5.18}
{0 CHEMBL2042127,1 67,2 76.45,3 4,4 31,5 18,6 8,7 67.527,8 1.5,9 28,10 0.652,11 16,12 17,13 12,14 49.5,15 41.852,16 5.658}
{0 CHEMBL2042128,1 49,2 54.859,3 4,4 22,5 17,6 6,7 48.763,8 2,9 21,10 0.693,11 14,12 16,13 7,14 40,15 31.729,16 5.921}
{0 CHEMBL2042129,1 49,2 54.859,3 4,4 22,5 17,6 6,7 48.763,8 2,9 21,10 0.693,11 14,12 16,13 7,14 40,15 31.729,16 6}
{0 CHEMBL2042130,1 52,2 58.355,3 4,4 24,5 18,6 5,7 51.571,8 1.9,9 23,10 0.675,11 16,12 17,13 7,14 41.5,15 33.068,16 6.194}
{0 CHEMBL2042131,1 61,2 68.6,3 4,4 30,5 18,6 5,7 60.221,8 1.6,9 26,10 0.662,11 16,12 17,13 10,14 44.5,15 37.649,16 6.167}
{0 CHEMBL2042132,1 60,2 67.683,3 5,4 29,5 18,6 6,7 59.44,8 1.7,9 25,10 0.66,11 15,12 17,13 10,14 44.5,15 37.143,16 5.108}
{0 CHEMBL2042133,1 57,2 63.853,3 5,4 25,5 23,6 6,7 56.672,8 1.8,9 26,10 0.686,11 19,12 22,13 7,14 49,15 37.09,16 6.432}
{0 CHEMBL2042134,1 51,2 56.856,3 3,4 23,5 19,6 4,7 50.469,8 2,9 24,10 0.688,11 18,12 18,13 6,14 42,15 33.047,16 5.585}
{0 CHEMBL2042267,1 56,2 62.355,3 4,4 24,5 24,6 5,7 55.571,8 1.8,9 27,10 0.698,11 21,12 23,13 6,14 49.5,15 37.068,16 6.102}
{0 CHEMBL2042268,1 56,2 62.936,3 6,4 24,5 23,6 7,7 55.891,8 1.8,9 25,10 0.685,11 18,12 22,13 7,14 49,15 36.584,16 4.301}
{0 CHEMBL2042269,1 52,2 58.232,3 5,4 21,5 23,6 7,7 52.232,8 3.8,9 24,10 0.693,11 18,12 22,13 6,14 48,15 34.751,16 4.301}
{0 CHEMBL2042270,1 55,2 61.438,3 5,4 23,5 24,6 6,7 54.789,8 1.8,9 26,10 0.697,11 20,12 23,13 6,14 49.5,15 36.563,16 4.301}
{0 CHEMBL2042271,1 55,2 61.438,3 5,4 23,5 24,6 6,7 54.789,8 1.8,9 26,10 0.697,11 20,12 23,13 6,14 49.5,15 36.563,16 5.517}
{0 CHEMBL2042408,1 60,2 67.272,3 5,4 25,5 24,6 8,7 60.327,8 5,9 27,10 0.683,11 20,12 22,13 7,14 53,15 39.519,16 6.357}
{0 CHEMBL2042409,1 45,2 50.362,3 2,4 20,5 14,6 5,7 45.138,8 6.7,9 20,10 0.672,11 14,12 12,13 6,14 36,15 28.928,16 4.815}
{0 CHEMBL2042720,1 56,2 62.647,3 5,4 23,5 24,6 7,7 56.116,8 3.6,9 26,10 0.693,11 20,12 22,13 6,14 51,15 37.278,16 4.301}
{0 CHEMBL2042840,1 51,2 56.78,3 3,4 21,5 21,6 7,7 51.316,8 5.9,9 23,10 0.704,11 18,12 18,13 5,14 46,15 34.137,16 4.301}
{0 CHEMBL2042841,1 59,2 65.77,3 4,4 26,5 24,6 5,7 58.454,8 1.7,9 28,10 0.692,11 21,12 23,13 7,14 50.5,15 38.595,16 4.301}
{0 CHEMBL2042842,1 63,2 70.185,3 4,4 28,5 24,6 5,7 62.338,8 1.6,9 30,10 0.692,11 21,12 23,13 9,14 53.5,15 41.122,16 5.509}
{0 CHEMBL2042843,1 59,2 65.77,3 4,4 26,5 24,6 5,7 58.454,8 1.7,9 28,10 0.692,11 21,12 23,13 7,14 50.5,15 38.595,16 6.733}
{0 CHEMBL2042844,1 63,2 70.185,3 4,4 28,5 24,6 5,7 62.338,8 1.6,9 30,10 0.692,11 21,12 23,13 9,14 53.5,15 41.122,16 6.076}
{0 CHEMBL2042845,1 57,2 63.564,3 4,4 24,5 24,6 6,7 56.898,8 3.5,9 27,10 0.694,11 21,12 23,13 6,14 50.5,15 37.783,16 5.328}
{0 CHEMBL2042846,1 58,2 64.77,3 4,4 26,5 23,6 5,7 57.454,8 1.7,9 27,10 0.687,11 20,12 22,13 7,14 49,15 37.595,16 7.357}
{0 CHEMBL2042847,1 51,2 57.438,3 5,4 23,5 18,6 6,7 50.789,8 2,9 22,10 0.673,11 15,12 17,13 7,14 41.5,15 32.563,16 5.222}
{0 CHEMBL2042848,1 54,2 60.853,3 5,4 25,5 18,6 6,7 53.672,8 1.9,9 23,10 0.668,11 15,12 17,13 8,14 42.5,15 34.09,16 5.921}
{0 CHEMBL2042849,1 59,2 66.351,3 6,4 26,5 23,6 7,7 58.774,8 1.7,9 26,10 0.68,11 19,12 22,13 7,14 50,15 38.111,16 7.523}
{0 CHEMBL2042850,1 58,2 65.185,3 4,4 28,5 18,6 5,7 57.338,8 1.7,9 25,10 0.666,11 16,12 17,13 9,14 43.5,15 36.122,16 6.854}
{0 CHEMBL2042851,1 63,2 70.394,3 4,4 28,5 24,6 6,7 62.665,8 3.2,9 29,10 0.684,11 22,12 23,13 7,14 52.5,15 40.837,16 7.284}
{0 CHEMBL2042852,1 62,2 69.185,3 4,4 28,5 24,6 5,7 61.338,8 1.6,9 29,10 0.687,11 22,12 23,13 7,14 51.5,15 40.122,16 8.167}
{0 CHEMBL2042853,1 64,2 71.102,3 3,4 29,5 25,6 4,7 63.12,8 1.6,9 31,10 0.693,11 24,12 24,13 7,14 53,15 41.627,16 8.398}
{0 CHEMBL2042854,1 63,2 70.185,3 4,4 28,5 25,6 5,7 62.338,8 1.6,9 30,10 0.692,11 23,12 24,13 7,14 53,15 41.122,16 8.108}
{0 CHEMBL2042855,1 63,2 70.185,3 4,4 28,5 25,6 5,7 62.338,8 1.6,9 30,10 0.692,11 23,12 24,13 7,14 53,15 41.122,16 7.959}
{0 CHEMBL2042991,1 64,2 70.944,3 3,4 28,5 25,6 5,7 63.349,8 1.6,9 31,10 0.714,11 24,12 24,13 7,14 54,15 42.653,16 7.77}
{0 CHEMBL2042992,1 65,2 72.185,3 4,4 28,5 26,6 5,7 64.338,8 1.5,9 32,10 0.702,11 24,12 24,13 7,14 57,15 43.122,16 8.387}
{0 CHEMBL2042993,1 67,2 74.521,3 3,4 29,5 26,6 6,7 66.774,8 4.5,9 32,10 0.691,11 25,12 24,13 7,14 57,15 44.057,16 9.155}
{0 CHEMBL2042994,1 63,2 70.185,3 4,4 28,5 25,6 5,7 62.338,8 1.6,9 30,10 0.692,11 23,12 24,13 7,14 53,15 41.122,16 8.678}
{0 CHEMBL2042995,1 63,2 70.185,3 4,4 28,5 25,6 5,7 62.338,8 1.6,9 30,10 0.692,11 23,12 24,13 7,14 53,15 41.122,16 8.796}
{0 CHEMBL2042996,1 59,2 65.896,3 3,4 27,5 20,6 5,7 58.563,8 3.4,9 27,10 0.679,11 19,12 18,13 8,14 47,15 37.815,16 8.42}
{0 CHEMBL2042997,1 60,2 67.102,3 3,4 29,5 19,6 4,7 59.12,8 1.7,9 27,10 0.673,11 18,12 18,13 9,14 45,15 37.627,16 7.009}
{0 CHEMBL2042998,1 63,2 70.521,3 3,4 29,5 20,6 6,7 62.774,8 4.8,9 28,10 0.671,11 19,12 18,13 9,14 49,15 40.057,16 7.509}
{0 CHEMBL2042999,1 58,2 64.979,3 4,4 26,5 20,6 6,7 57.781,8 3.4,9 26,10 0.678,11 19,12 18,13 7,14 47,15 37.31,16 8.051}
{0 CHEMBL2043000,1 61,2 68.398,3 4,4 26,5 21,6 8,7 61.436,8 6.6,9 27,10 0.676,11 20,12 18,13 7,14 51,15 39.74,16 7.569}
{0 CHEMBL2043002,1 67,2 75.185,3 6,4 28,5 26,6 9,7 67.312,8 4.5,9 30,10 0.683,11 23,12 24,13 7,14 58,15 44.068,16 8.523}
{0 CHEMBL2043003,1 68,2 76.102,3 5,4 29,5 26,6 8,7 68.094,8 4.4,9 31,10 0.684,11 24,12 24,13 7,14 58,15 44.573,16 8.367}
{0 CHEMBL2043004,1 67,2 75.185,3 6,4 28,5 26,6 9,7 67.312,8 4.5,9 30,10 0.683,11 23,12 24,13 7,14 58,15 44.068,16 8.602}
{0 CHEMBL2043005,1 66,2 73.976,3 6,4 28,5 26,6 8,7 65.985,8 3,9 30,10 0.687,11 23,12 24,13 7,14 57,15 43.353,16 8.678}
{0 CHEMBL2043006,1 68,2 76.102,3 5,4 29,5 26,6 8,7 68.094,8 4.4,9 31,10 0.684,11 24,12 24,13 7,14 58,15 44.573,16 8.367}
{0 CHEMBL2043007,1 67,2 75.185,3 6,4 28,5 26,6 9,7 67.312,8 4.5,9 30,10 0.683,11 23,12 24,13 7,14 58,15 44.068,16 8.469}
{0 CHEMBL2043008,1 67,2 75.185,3 6,4 28,5 26,6 9,7 67.312,8 4.5,9 30,10 0.683,11 23,12 24,13 7,14 58,15 44.068,16 8.387}
{0 CHEMBL2043010,1 73,2 82.019,3 6,4 30,5 27,6 11,7 73.851,8 6.8,9 32,10 0.677,11 24,12 24,13 8,14 63,15 48.024,16 9.398}
{0 CHEMBL2043011,1 70,2 78.604,3 6,4 28,5 27,6 11,7 70.967,8 7.1,9 31,10 0.681,11 24,12 24,13 7,14 62,15 46.497,16 8.959}
{0 CHEMBL2043168,1 73,2 82.019,3 6,4 30,5 27,6 11,7 73.851,8 6.8,9 32,10 0.677,11 24,12 24,13 8,14 63,15 48.024,16 9.398}
{0 CHEMBL2043169,1 73,2 82.019,3 6,4 30,5 27,6 11,7 73.851,8 6.8,9 32,10 0.677,11 24,12 24,13 8,14 63,15 48.024,16 9.398}
{0 CHEMBL2043170,1 73,2 82.019,3 6,4 30,5 27,6 11,7 73.851,8 6.8,9 32,10 0.677,11 24,12 24,13 8,14 63,15 48.024,16 8.301}
{0 CHEMBL2043171,1 73,2 81.963,3 6,4 29,5 27,6 12,7 74.174,8 6.8,9 32,10 0.689,11 24,12 24,13 8,14 64,15 48.851,16 9.097}
{0 CHEMBL2043172,1 73,2 81.963,3 6,4 29,5 27,6 12,7 74.174,8 6.8,9 32,10 0.689,11 24,12 24,13 8,14 64,15 48.851,16 9}
{0 CHEMBL2043324,1 73,2 82.359,3 6,4 29,5 27,6 12,7 74.363,8 6.8,9 32,10 0.676,11 24,12 24,13 8,14 64,15 48.407,16 9.398}
{0 CHEMBL2043325,1 76,2 85.434,3 6,4 32,5 27,6 11,7 76.734,8 6.6,9 33,10 0.674,11 24,12 24,13 9,14 64,15 49.551,16 9.699}
{0 CHEMBL2043326,1 76,2 85.434,3 6,4 32,5 27,6 11,7 76.734,8 6.6,9 33,10 0.674,11 24,12 24,13 9,14 64,15 49.551,16 9.301}
{0 CHEMBL2043327,1 73,2 82.431,3 6,4 34,5 20,6 9,7 72.963,8 4.1,9 30,10 0.658,11 17,12 18,13 13,14 55,15 45.648,16 8.301}
{0 CHEMBL2043328,1 65,2 73.478,3 7,4 27,5 21,6 11,7 65.858,8 6.2,9 27,10 0.669,11 18,12 18,13 9,14 55,15 42.277,16 7.509}
{0 CHEMBL2164243,1 23,2 26.701,3 2,4 12,5 2,6 5,7 23.604,8 13,9 6,10 0.573,11 2,13 4,14 12,15 12.821,16 4}
{0 CHEMBL2164244,1 27,2 31.324,3 2,4 15,5 2,6 5,7 27.429,8 11.1,9 7,10 0.568,11 2,13 5,14 13,15 14.611,16 4}
{0 CHEMBL2164245,1 20,2 23.286,3 2,4 10,5 2,6 5,7 20.72,8 15,9 5,10 0.571,11 2,13 3,14 11,15 11.294,16 4.848}
{0 CHEMBL2164246,1 17,2 19.87,3 2,4 8,5 2,6 5,7 17.836,8 17.6,9 4,10 0.568,11 2,13 2,14 10,15 9.768,16 4}
{0 CHEMBL2164247,1 26,2 30.116,3 2,4 14,5 2,6 5,7 26.487,8 11.5,9 7,10 0.575,11 2,13 5,14 13,15 14.348,16 4}
{0 CHEMBL2164248,1 24,2 27.618,3 1,4 13,5 2,6 4,7 24.385,8 12.5,9 7,10 0.581,11 2,13 5,14 12,15 13.327,16 4}
{0 CHEMBL2164249,1 22,2 25.412,3 1,4 11,5 2,6 5,7 22.829,8 18.2,9 6,10 0.574,11 2,13 4,14 12,15 12.515,16 5.201}
{0 CHEMBL2164250,1 32,2 37.318,3 4,4 18,5 2,6 6,7 32.247,8 6.3,9 8,10 0.571,11 2,13 6,14 15,15 17.203,16 4}
{0 CHEMBL217943,1 35,2 38.907,3 2,4 14,5 18,6 4,7 35.16,8 5.7,9 17,10 0.7,11 16,12 17,13 1,14 32.5,15 23.633,16 5.377}
{0 CHEMBL217944,1 34,2 38.377,3 2,4 12,5 18,6 5,7 34.858,8 2.9,9 17,10 0.703,11 16,12 17,13 1,14 33.5,15 23.685,16 5.357}
{0 CHEMBL217945,1 34,2 37.618,3 1,4 13,5 18,6 4,7 34.385,8 8.8,9 17,10 0.704,11 16,12 17,13 1,14 32.5,15 23.327,16 4.542}
{0 CHEMBL218005,1 43,2 48.156,3 2,4 18,5 18,6 6,7 43.582,8 9.3,9 19,10 0.673,11 16,12 17,13 3,14 36.5,15 28.116,16 5.131}
{0 CHEMBL218015,1 35,2 39.199,3 3,4 13,5 18,6 6,7 35.705,8 8.6,9 16,10 0.691,11 15,12 16,13 1,14 34,15 23.843,16 4.848}
{0 CHEMBL218070,1 39,2 43.697,3 4,4 14,5 19,6 7,7 39.807,8 7.7,9 18,10 0.697,11 15,12 17,13 2,14 38.5,15 26.864,16 5.796}
{0 CHEMBL218233,1 35,2 39.199,3 3,4 13,5 18,6 6,7 35.705,8 8.6,9 16,10 0.691,11 15,12 17,13 1,14 33.5,15 23.843,16 5}
{0 CHEMBL218288,1 32,2 35.491,3 2,4 12,5 18,6 4,7 32.276,8 6.3,9 16,10 0.71,11 16,12 17,14 31.5,15 22.106,16 5.222}
{0 CHEMBL218424,1 41,2 46.03,3 3,4 17,5 18,6 6,7 41.473,8 7.3,9 18,10 0.676,11 15,12 17,13 3,14 35.5,15 26.896,16 5.678}
{0 CHEMBL218480,1 35,2 39.539,3 3,4 12,5 18,6 7,7 36.218,8 8.6,9 16,10 0.689,11 15,12 16,13 1,14 35,15 24.226,16 4.854}
{0 CHEMBL218481,1 31,2 34.575,3 3,4 11,5 18,6 5,7 31.494,8 6.5,9 15,10 0.709,11 15,12 17,14 31.5,15 21.601,16 5.387}
{0 CHEMBL218482,1 38,2 42.325,3 2,4 14,5 19,6 6,7 38.814,8 10.5,9 18,10 0.695,11 17,12 17,13 1,14 36.5,15 26.063,16 5}
{0 CHEMBL218493,1 33,2 36.575,3 3,4 11,5 19,6 5,7 33.494,8 6.1,9 17,10 0.726,11 16,12 17,14 35.5,15 23.601,16 5.215}
{0 CHEMBL218887,1 39,2 43.824,3 3,4 15,5 18,6 7,7 39.916,8 10.3,9 17,10 0.677,11 15,12 16,13 2,14 36,15 26.084,16 5.092}
{0 CHEMBL218888,1 39,2 43.907,3 4,4 14,5 19,6 8,7 40.134,8 10.3,9 17,10 0.683,11 16,12 16,13 1,14 38,15 26.579,16 5.229}
{0 CHEMBL220498,1 34,2 38.116,3 2,4 14,5 14,6 5,7 34.487,8 8.8,9 15,10 0.675,11 13,12 12,13 2,14 29,15 22.348,16 4.337}
{0 CHEMBL220546,1 32,2 35.784,3 3,4 11,5 15,6 6,7 32.822,8 9.4,9 15,10 0.701,11 13,12 12,13 1,14 32,15 22.316,16 4.409}
{0 CHEMBL220659,1 42,2 46.946,3 2,4 18,5 18,6 5,7 42.254,8 7.1,9 19,10 0.678,11 16,12 17,13 3,14 35.5,15 27.402,16 5.161}
{0 CHEMBL220695,1 31,2 34.519,3 3,4 10,5 18,6 6,7 31.818,8 6.5,9 15,10 0.736,11 15,12 17,14 32.5,15 22.429,16 4.699}
{0 CHEMBL220743,1 21,2 23.744,3 3,4 7,5 12,6 5,7 21.727,8 9.5,9 9,10 0.688,11 9,12 11,14 21.5,15 14.547,16 4.921}
{0 CHEMBL220796,1 31,2 34.519,3 3,4 10,5 18,6 6,7 31.818,8 6.5,9 15,10 0.736,11 15,12 17,14 32.5,15 22.429,16 5.31}
{0 CHEMBL221012,1 38,2 42.558,3 3,4 14,5 18,6 7,7 38.913,8 7.9,9 17,10 0.705,11 15,12 17,13 2,14 35.5,15 26.197,16 6.237}
{0 CHEMBL221013,1 38,2 42.558,3 3,4 14,5 18,6 7,7 38.913,8 7.9,9 17,10 0.705,11 15,12 17,13 2,14 35.5,15 26.197,16 5.77}
{0 CHEMBL221025,1 35,2 39.143,3 3,4 12,5 18,6 7,7 36.029,8 8.6,9 16,10 0.716,11 15,12 16,13 1,14 35,15 24.67,16 5.167}
{0 CHEMBL221026,1 39,2 43.531,3 2,4 16,5 18,6 5,7 39.371,8 7.7,9 18,10 0.685,11 16,12 17,13 2,14 34.5,15 25.875,16 5.337}
{0 CHEMBL221027,1 35,2 38.851,3 2,4 13,5 18,6 5,7 35.484,8 5.7,9 17,10 0.724,11 16,12 17,13 1,14 33.5,15 24.461,16 5.319}
{0 CHEMBL221189,1 38,2 42.614,3 3,4 15,5 18,6 6,7 38.589,8 7.9,9 17,10 0.683,11 15,12 17,13 2,14 34.5,15 25.369,16 5.569}
{0 CHEMBL221232,1 31,2 34.519,3 3,4 10,5 18,6 6,7 31.818,8 6.5,9 15,10 0.736,11 15,12 17,14 32.5,15 22.429,16 5.187}
{0 CHEMBL221241,1 47,2 52.86,3 3,4 21,5 18,6 6,7 47.24,8 6.4,9 20,10 0.665,11 15,12 17,13 5,14 37.5,15 29.95,16 5.77}
{0 CHEMBL221255,1 21,2 23.87,3 2,4 8,5 8,6 5,7 21.836,8 14.3,9 8,10 0.65,11 7,12 6,13 1,14 18,15 13.768,16 4}
{0 CHEMBL221316,1 40,2 44.82,3 3,4 17,5 18,6 5,7 40.145,8 5,9 18,10 0.681,11 15,12 17,13 3,14 34.5,15 26.181,16 5.167}
{0 CHEMBL221341,1 35,2 39.143,3 3,4 12,5 18,6 7,7 36.029,8 8.6,9 16,10 0.716,11 15,12 16,13 1,14 35,15 24.67,16 4.921}
{0 CHEMBL221604,1 38,2 42.266,3 2,4 15,5 18,6 5,7 38.367,8 5.3,9 18,10 0.713,11 16,12 17,13 2,14 34.5,15 25.988,16 5.276}
{0 CHEMBL221815,1 31,2 34.645,3 2,4 11,5 14,6 6,7 31.927,8 9.7,9 14,10 0.711,11 13,12 12,13 1,14 29,15 21.649,16 4}
{0 CHEMBL221861,1 28,2 31.079,3 3,4 9,5 17,6 6,7 28.687,8 7.1,9 13,10 0.745,11 13,12 16,14 30,15 20.261,16 4.745}
{0 CHEMBL221918,1 35,2 39.926,3 2,4 11,5 18,6 7,7 36.698,8 5.7,9 17,10 0.694,11 16,12 17,13 1,14 35.5,15 24.783,16 5.013}
{0 CHEMBL221919,1 33,2 36.575,3 3,4 11,5 19,6 5,7 33.494,8 6.1,9 17,10 0.726,11 16,12 17,14 35.5,15 23.601,16 5.409}
{0 CHEMBL221970,1 41,2 45.614,3 3,4 15,5 23,6 6,7 41.589,8 7.3,9 20,10 0.706,11 19,12 21,13 1,14 41.5,15 28.369,16 5.444}
{0 CHEMBL221971,1 38,2 42.322,3 2,4 16,5 18,6 4,7 38.043,8 5.3,9 18,10 0.691,11 16,12 17,13 2,14 33.5,15 25.16,16 5.143}
{0 CHEMBL221974,1 35,2 39.539,3 3,4 12,5 18,6 7,7 36.218,8 8.6,9 16,10 0.689,11 15,12 16,13 1,14 35,15 24.226,16 4.62}
{0 CHEMBL222009,1 29,2 32.741,3 5,4 9,5 18,6 7,7 29.931,8 6.9,9 13,10 0.706,11 13,12 17,14 31.5,15 20.59,16 4.824}
{0 CHEMBL222010,1 35,2 39.199,3 3,4 13,5 18,6 6,7 35.705,8 8.6,9 16,10 0.691,11 15,12 17,13 1,14 33.5,15 23.843,16 5.137}
{0 CHEMBL222114,1 42,2 47.239,3 3,4 17,5 18,6 7,7 42.8,8 9.5,9 18,10 0.671,11 15,12 17,13 3,14 36.5,15 27.611,16 5.62}
{0 CHEMBL222115,1 49,2 54.528,3 4,4 18,5 25,6 7,7 49.574,8 6.1,9 24,10 0.708,11 21,12 23,13 2,14 48.5,15 33.918,16 6.721}
{0 CHEMBL222824,1 21,2 23.914,4 10,5 3,6 4,7 21.727,8 19,9 7,10 0.601,11 3,13 4,14 13,15 12.493,16 4.373}
{0 CHEMBL2312530,1 44,2 48.999,3 2,4 16,5 17,6 10,7 45.505,8 13.6,9 18,10 0.713,11 15,12 11,13 3,14 41.5,15 30.393,16 7.35}
{0 CHEMBL268057,1 31,2 34.645,3 2,4 11,5 14,6 6,7 31.927,8 9.7,9 14,10 0.711,11 13,12 12,13 1,14 29,15 21.649,16 4.824}
{0 CHEMBL269093,1 42,2 47.239,3 3,4 17,5 18,6 7,7 42.8,8 9.5,9 18,10 0.671,11 15,12 17,13 3,14 36.5,15 27.611,16 5.796}
{0 CHEMBL316034,1 17,2 19.166,3 1,4 5,5 8,6 5,7 18.178,8 23.5,9 7,10 0.667,11 7,12 6,14 17,15 11.934,16 5.215}
{0 CHEMBL374147,1 46,2 51.864,3 3,4 19,5 18,6 8,7 47.011,8 10.9,9 19,10 0.66,11 15,12 17,13 4,14 38.5,15 29.853,16 5.553}
{0 CHEMBL374569,1 21,2 23.372,3 1,4 7,5 12,6 4,7 21.735,8 14.3,9 10,10 0.698,11 10,12 11,14 21.5,15 14.746,16 4}
{0 CHEMBL374866,1 39,2 43.851,3 4,4 13,5 19,6 9,7 40.458,8 10.3,9 17,10 0.705,11 16,12 16,13 1,14 39,15 27.406,16 4.62}
{0 CHEMBL374946,1 40,2 44.741,3 2,4 16,5 18,6 6,7 40.698,8 10,9 18,10 0.679,11 16,12 17,13 2,14 35.5,15 26.59,16 5.495}
{0 CHEMBL375008,1 38,2 42.558,3 3,4 14,5 18,6 7,7 38.913,8 7.9,9 17,10 0.705,11 15,12 17,13 2,14 35.5,15 26.197,16 5.62}
{0 CHEMBL376214,1 31,2 34.645,3 2,4 11,5 14,6 6,7 31.927,8 9.7,9 14,10 0.711,11 13,12 12,13 1,14 29,15 21.649,16 4}
{0 CHEMBL376626,1 39,2 43.824,3 3,4 15,5 18,6 7,7 39.916,8 10.3,9 17,10 0.677,11 15,12 16,13 2,14 36,15 26.084,16 4.721}
{0 CHEMBL384018,1 44,2 49.152,3 2,4 20,5 18,6 4,7 43.811,8 4.5,9 20,10 0.677,11 16,12 17,13 4,14 35.5,15 28.214,16 5.237}
{0 CHEMBL384996,1 38,2 42.614,3 3,4 15,5 18,6 6,7 38.589,8 7.9,9 17,10 0.683,11 15,12 16,13 2,14 35,15 25.369,16 4.77}
{0 CHEMBL386421,1 41,2 47.049,3 3,4 14,5 18,6 9,7 43.011,8 7.3,9 18,10 0.671,11 15,12 17,13 3,14 38.5,15 28.046,16 5.538}
{0 CHEMBL387428,1 26,2 29.159,3 3,4 9,5 13,6 5,7 26.611,8 7.7,9 12,10 0.7,11 10,12 11,13 1,14 26.5,15 18.074,16 5.357}
{0 CHEMBL387429,1 41,2 46.03,3 3,4 17,5 18,6 6,7 41.473,8 7.3,9 18,10 0.676,11 15,12 16,13 3,14 36,15 26.896,16 4.796}
{0 CHEMBL413662,1 38,2 42.614,3 3,4 15,5 18,6 6,7 38.589,8 7.9,9 17,10 0.683,11 15,12 16,13 2,14 35,15 25.369,16 4}
{0 CHEMBL426560,1 28,2 31.439,3 2,4 9,5 13,6 7,7 29.371,8 14.3,9 12,10 0.705,11 11,12 11,13 1,14 27.5,15 19.837,16 7.137}
{0 CHEMBL427234,1 35,2 39.199,3 3,4 13,5 18,6 6,7 35.705,8 8.6,9 16,10 0.691,11 15,12 17,13 1,14 33.5,15 23.843,16 4.721}
{0 CHEMBL441860,1 28,2 31.495,3 2,4 10,5 13,6 6,7 29.047,8 14.3,9 12,10 0.674,11 11,12 11,13 1,14 26.5,15 19.009,16 5.301}
{0 CHEMBL445510,1 33,2 36.75,3 2,4 12,5 10,6 8,7 34.084,8 12.1,9 13,10 0.725,11 11,12 6,13 2,14 29,15 22.91,16 5.638}
{0 CHEMBL447601,1 33,2 37.04,3 2,4 12,5 10,6 8,7 34.335,8 15.2,9 13,10 0.689,11 11,12 6,13 2,14 29,15 22.438,16 5.357}
{0 CHEMBL447994,1 38,2 42.584,3 2,4 14,5 12,6 10,7 39.622,8 15.8,9 14,10 0.7,11 11,12 6,13 3,14 34,15 25.867,16 5.886}
{0 CHEMBL448208,1 27,2 30.867,3 4,4 10,5 12,6 7,7 28.04,8 11.1,9 10,10 0.654,11 8,12 10,13 2,14 25,15 17.81,16 6.244}
{0 CHEMBL448608,1 34,2 38.226,3 4,4 11,5 18,6 8,7 35.247,8 8.8,9 15,10 0.714,11 14,12 16,13 1,14 35,15 24.165,16 7.18}
{0 CHEMBL449035,1 28,2 31.369,3 3,4 9,5 17,6 6,7 28.938,8 10.7,9 13,10 0.702,11 13,12 16,14 30,15 19.789,16 4.824}
{0 CHEMBL453519,1 28,2 31.754,3 2,4 10,5 6,6 10,7 29.855,8 21.4,9 8,10 0.681,11 5,13 3,14 24,15 18.813,16 6.222}
{0 CHEMBL479404,1 40,2 44.79,3 2,4 16,5 15,6 9,7 41.178,8 12.5,9 15,10 0.698,11 11,12 11,13 4,14 34.5,15 26.679,16 4.398}
{0 CHEMBL479405,1 41,2 45.999,3 2,4 16,5 12,6 10,7 42.505,8 14.6,9 15,10 0.692,11 11,12 6,13 4,14 35,15 27.393,16 4.398}
{0 CHEMBL479415,1 41,2 45.584,3 2,4 14,5 17,6 10,7 42.622,8 14.6,9 17,10 0.722,11 15,12 11,13 2,14 40.5,15 28.867,16 7.569}
{0 CHEMBL479417,1 41,2 45.999,3 2,4 16,5 12,6 10,7 42.505,8 14.6,9 15,10 0.692,11 11,12 6,13 4,14 35,15 27.393,16 4.398}
{0 CHEMBL480159,1 35,2 39.113,3 2,4 11,5 12,6 11,7 37.062,8 17.1,9 13,10 0.734,11 11,12 6,13 2,14 34,15 25.167,16 7.143}
{0 CHEMBL480160,1 35,2 39.113,3 2,4 11,5 12,6 11,7 37.062,8 17.1,9 13,10 0.734,11 11,12 6,13 2,14 34,15 25.167,16 7.009}
{0 CHEMBL481168,1 35,2 39.245,3 2,4 14,5 10,6 7,7 35.891,8 11.4,9 14,10 0.687,11 11,12 6,13 3,14 29,15 23.25,16 4.398}
{0 CHEMBL481692,1 38,2 42.584,3 2,4 14,5 12,6 10,7 39.622,8 15.8,9 14,10 0.7,11 11,12 6,13 3,14 34,15 25.867,16 7.959}
{0 CHEMBL481700,1 38,2 42.584,3 2,4 14,5 12,6 10,7 39.622,8 15.8,9 14,10 0.7,11 11,12 6,13 3,14 34,15 25.867,16 7.301}
{0 CHEMBL481875,1 47,2 52.83,3 2,4 20,5 12,6 10,7 48.273,8 12.8,9 17,10 0.678,11 11,12 6,13 6,14 37,15 30.447,16 7.678}
{0 CHEMBL485022,1 31,2 34.854,3 2,4 11,5 13,6 7,7 32.255,8 12.9,9 13,10 0.693,11 11,12 11,13 2,14 28.5,15 21.364,16 6.146}
{0 CHEMBL485023,1 31,2 34.854,3 2,4 11,5 13,6 7,7 32.255,8 12.9,9 13,10 0.693,11 11,12 11,13 2,14 28.5,15 21.364,16 4.658}
{0 CHEMBL486539,1 24,2 26.79,3 2,4 8,5 12,6 6,7 24.913,8 12.5,9 10,10 0.721,11 9,12 10,13 1,14 24,15 16.955,16 4.398}
{0 CHEMBL489154,1 33,2 37.365,3 5,4 11,5 18,6 8,7 34.142,8 9.1,9 14,10 0.687,11 13,12 16,13 1,14 34,15 22.832,16 4.398}
{0 CHEMBL489155,1 35,2 39.199,3 3,4 13,5 18,6 6,7 35.705,8 8.6,9 16,10 0.691,11 15,12 16,13 1,14 34,15 23.843,16 6.137}
{0 CHEMBL491424,1 34,2 38.124,3 4,4 11,5 18,6 8,7 35.153,8 8.8,9 15,10 0.729,11 14,12 16,13 1,14 35,15 24.362,16 6.481}
{0 CHEMBL491425,1 37,2 41.697,3 4,4 14,5 18,6 7,7 37.807,8 8.1,9 16,10 0.681,11 14,12 16,13 2,14 35,15 24.864,16 6.398}
{0 CHEMBL491426,1 37,2 42.717,3 4,4 11,5 18,6 10,7 39.345,8 8.1,9 16,10 0.676,11 14,12 16,13 2,14 38,15 26.014,16 5.256}
{0 CHEMBL501554,1 38,2 42.584,3 2,4 14,5 12,6 10,7 39.622,8 15.8,9 14,10 0.7,11 11,12 6,13 3,14 34,15 25.867,16 6.398}
{0 CHEMBL503160,1 12,2 13.668,4 4,5 3,6 4,7 13.076,8 33.3,9 4,10 0.612,11 4,14 10,15 7.913,16 4.721}
{0 CHEMBL503507,1 24,2 27.452,3 4,4 8,5 12,6 7,7 25.156,8 12.5,9 9,10 0.663,11 8,12 10,13 1,14 24,15 16.284,16 5.55}
{0 CHEMBL509064,1 28,2 31.216,3 2,4 9,5 13,6 7,7 29.116,8 14.3,9 12,10 0.769,11 11,12 11,13 1,14 27.5,15 20.326,16 5.854}
{0 CHEMBL509126,1 34,2 38.329,3 3,4 13,5 10,6 8,7 35.109,8 11.8,9 13,10 0.685,11 11,12 6,13 2,14 29,15 22.745,16 5.77}
{0 CHEMBL517834,1 35,2 39.169,3 2,4 12,5 12,6 10,7 36.738,8 17.1,9 13,10 0.71,11 11,12 6,13 2,14 33,15 24.34,16 7.143}
{0 CHEMBL517835,1 34,2 37.96,3 2,4 12,5 15,6 9,7 35.411,8 14.7,9 13,10 0.717,11 11,12 11,13 2,14 32.5,15 23.625,16 4.398}
{0 CHEMBL518140,1 35,2 39.113,3 2,4 11,5 12,6 11,7 37.062,8 17.1,9 13,10 0.734,11 11,12 6,13 2,14 34,15 25.167,16 7.481}
{0 CHEMBL518141,1 38,2 42.584,3 2,4 14,5 12,6 10,7 39.622,8 15.8,9 14,10 0.7,11 11,12 6,13 3,14 34,15 25.867,16 6.387}
{0 CHEMBL519615,1 45,2 49.999,3 2,4 16,5 18,6 10,7 46.505,8 13.3,9 19,10 0.719,11 17,12 12,13 2,14 43,15 31.393,16 7.678}
{0 CHEMBL51979,1 16,2 18.582,3 1,4 7,5 2,6 5,7 17.062,8 25,9 4,10 0.569,11 2,13 2,14 10,15 9.461,16 4.368}
{0 CHEMBL520935,1 50,2 56.245,3 2,4 22,5 12,6 10,7 51.156,8 12,9 18,10 0.673,11 11,12 6,13 7,14 38,15 31.974,16 8.523}
{0 CHEMBL521790,1 37,2 41.697,3 4,4 14,5 18,6 7,7 37.807,8 8.1,9 16,10 0.681,11 14,12 16,13 2,14 35,15 24.864,16 6.495}
{0 CHEMBL522419,1 44,2 49.113,3 4,4 16,5 24,6 7,7 44.691,8 6.8,9 21,10 0.704,11 20,12 22,13 1,14 44,15 30.391,16 8.523}
{0 CHEMBL522970,1 34,2 38.282,3 4,4 12,5 18,6 7,7 34.924,8 8.8,9 15,10 0.689,11 14,12 16,13 1,14 34,15 23.337,16 6.538}
{0 CHEMBL568873,1 37,2 41.685,3 2,4 15,5 13,6 7,7 38.022,8 10.8,9 15,10 0.676,11 11,12 11,13 4,14 30.5,15 24.417,16 4.481}
{0 CHEMBL569062,1 37,2 41.685,3 2,4 15,5 13,6 7,7 38.022,8 10.8,9 15,10 0.676,11 11,12 11,13 4,14 30.5,15 24.417,16 4.456}
{0 CHEMBL570655,1 38,2 42.169,3 2,4 12,5 17,6 10,7 39.738,8 15.8,9 16,10 0.733,11 15,12 11,13 1,14 39.5,15 27.34,16 6}
{0 CHEMBL572739,1 21,2 24.206,3 1,4 9,5 3,6 6,7 22.273,8 23.8,9 6,10 0.587,11 3,13 3,14 14,15 12.703,16 4.108}
{0 CHEMBL576,1 14,2 16.083,4 6,5 2,6 4,7 14.96,8 28.6,9 4,10 0.579,11 2,13 2,14 9,15 8.44,16 4}
{0 CHEMBL578182,1 276,2 316.868,3 19,4 141,5 28,6 48,7 280.326,8 10.5,9 87,10 0.6,11 28,12 6,13 59,14 161,15 159.271,16 4.214}
{0 CHEMBL578183,1 309,2 353.329,3 20,4 152,5 38,6 56,7 314.635,8 11,9 101,10 0.615,11 38,12 12,13 63,14 192,15 182.874,16 4.643}
{0 CHEMBL78920,1 15,2 17.163,3 1,4 7,5 2,6 3,7 15.407,8 13.3,9 5,10 0.613,11 3,13 2,14 10,15 9.031,16 5.071}
{0 CHEMBL89286,1 18,2 20.791,3 1,4 7,5 3,6 6,7 19.389,8 27.8,9 5,10 0.587,11 3,13 2,14 13,15 11.176,16 4.022}
{0 CHEMBL90852,1 15,2 17.376,3 1,4 5,5 3,6 6,7 16.506,8 33.3,9 4,10 0.587,11 3,13 1,14 12,15 9.649,16 5.509}
