{
  "data_set_description": {
    "collection_date": "November 2013",
    "creator": "Dr Jeremy Besnard, Dr Ivan Olier, Dr Noureddin Sadawi, Dr Larisa Soldatova, Dr Crina Grosan, Prof Ross King, Dr Richard Bickerton, Prof Andrew Hopkins and Dr Willem van Hoorn",
    "default_target_attribute": "pXC50",
    "description": "This dataset contains QSAR data (from ChEMBL version 17) showing activity values (unit is pseudo-pCI50) of several compounds on drug target ChEMBL_ID: CHEMBL2616 (TID: 12700), and it has 65 rows and 1209 features (not including molecule IDs and class feature: molecule_id and pXC50). The features represent Molecular Descriptors which were generated from SMILES strings. Missing value imputation was applied to this dataset (By choosing the Median).",
    "description_version": "1",
    "file_id": "3253518",
    "format": "ARFF",
    "id": "24797",
    "licence": "Public",
    "md5_checksum": "0e292a048117a15f7cb3b69b4c6c9b75",
    "minio_url": "https://data.openml.org/datasets/0002/24797/dataset_24797.pq",
    "name": "QSAR-DATASET-FOR-DRUG-TARGET-CHEMBL2616",
    "original_data_url": "https://www.ebi.ac.uk/chembl/target/inspect/CHEMBL2616",
    "parquet_url": "https://data.openml.org/datasets/0002/24797/dataset_24797.pq",
    "processing_date": "2018-10-03 23:00:12",
    "row_id_attribute": "molecule_id",
    "status": "deactivated",
    "tag": [
      "MetaQSAR",
      "study_13"
    ],
    "upload_date": "2016-07-14T15:26:50",
    "url": "https://api.openml.org/data/v1/download/3253518/QSAR-DATASET-FOR-DRUG-TARGET-CHEMBL2616.arff",
    "version": "7",
    "visibility": "public"
  }
}