"molecule_id","AMW","C.","H.","Me","pXC50"
{1 7.493,2 41.4,3 48.3,4 1.006,5 5.248}
{0 CHEMBL129976,1 6.467,2 41.4,3 52.9,4 0.99,5 5}
{0 CHEMBL130230,1 7.026,2 42.6,3 49.2,4 1.002,5 6}
{0 CHEMBL130577,1 7.459,2 41.7,3 46.7,4 1.015,5 5}
{0 CHEMBL131561,1 7.06,2 41,3 50.8,4 0.995,5 5.467}
{0 CHEMBL132488,1 7.803,2 41.4,3 46.6,4 1.015,5 5.463}
{0 CHEMBL133176,1 6.102,2 40,3 55.4,4 0.983,5 5.854}
{0 CHEMBL288436,1 6.492,2 42.9,3 51.8,4 0.984,5 6}
{0 CHEMBL335751,1 6.796,2 41,3 50.8,4 0.999,5 5.435}
{0 CHEMBL335762,1 7.115,2 40.3,3 50.7,4 1,5 5.267}
{0 CHEMBL336086,1 6.379,2 40,3 53.8,4 0.991,5 5.605}
{0 CHEMBL337719,1 7.041,2 40.3,3 50,4 1.009,5 5.056}
{0 CHEMBL339298,1 7.06,2 41,3 50.8,4 0.995,5 5}
{0 CHEMBL340074,1 6.751,2 40.3,3 51.6,4 1,5 5.429}
{0 CHEMBL340555,1 7.493,2 41.4,3 48.3,4 1.006,5 5.59}
{0 CHEMBL42314,1 6.572,2 39.1,3 53.1,4 0.999,5 5.561}
{0 CHEMBL445634,1 6.634,2 42.2,3 51.6,4 0.992,5 5.125}
