"molecule_id","FCFP4_1024b1","FCFP4_1024b10","FCFP4_1024b100","FCFP4_1024b1000","FCFP4_1024b1001","FCFP4_1024b1002","FCFP4_1024b1003","FCFP4_1024b1004","FCFP4_1024b1005","FCFP4_1024b1006","FCFP4_1024b1007","FCFP4_1024b1008","FCFP4_1024b1009","FCFP4_1024b101","FCFP4_1024b1010","FCFP4_1024b1011","FCFP4_1024b1012","FCFP4_1024b1013","FCFP4_1024b1014","FCFP4_1024b1015","FCFP4_1024b1016","FCFP4_1024b1017","FCFP4_1024b1018","FCFP4_1024b1019","FCFP4_1024b102","FCFP4_1024b1020","FCFP4_1024b1021","FCFP4_1024b1022","FCFP4_1024b1023","FCFP4_1024b1024","FCFP4_1024b103","FCFP4_1024b104","FCFP4_1024b105","FCFP4_1024b106","FCFP4_1024b107","FCFP4_1024b108","FCFP4_1024b109","FCFP4_1024b11","FCFP4_1024b110","FCFP4_1024b111","FCFP4_1024b112","FCFP4_1024b113","FCFP4_1024b114","FCFP4_1024b115","FCFP4_1024b116","FCFP4_1024b117","FCFP4_1024b118","FCFP4_1024b119","FCFP4_1024b12","FCFP4_1024b120","FCFP4_1024b121","pXC50"
{1 1,31 1,52 4.254}
{0 CHEMBL1329141,1 1,27 1,52 5.097}
{0 CHEMBL1343544,1 1,45 1,52 5.773}
{0 CHEMBL1401747,1 1,3 1,27 1,52 4.855}
{0 CHEMBL1416439,1 1,3 1,27 1,52 4.681}
{0 CHEMBL1431007,1 1,35 1,52 6.561}
{0 CHEMBL1455226,1 1,27 1,52 5.613}
{0 CHEMBL1458563,1 1,27 1,52 5.256}
{0 CHEMBL1460470,1 1,24 1,27 1,52 5.356}
{0 CHEMBL1464805,1 1,35 1,52 5.227}
{0 CHEMBL1465955,1 1,39 1,52 4.254}
{0 CHEMBL1497651,1 1,2 1,27 1,52 6.847}
{0 CHEMBL1517227,1 1,2 1,52 4.971}
{0 CHEMBL1517376,1 1,20 1,51 1,52 5.686}
{0 CHEMBL1611294,1 1,52 4.254}
{0 CHEMBL1988133,1 1,52 5.45}
{0 CHEMBL1990545,1 1,52 4.254}
{0 CHEMBL257359,1 1,3 1,27 1,52 4.688}
{0 CHEMBL6246,1 1,52 6.267}
