"molecule_id","nDB","O.","pXC50"
{1 1,2 3.8,3 5.553}
{0 CHEMBL14,1 1,2 8,3 5.004}
{0 CHEMBL20835,1 1,2 7.4,3 5}
{0 CHEMBL21536,1 1,2 2.4,3 4.959}
{0 CHEMBL22089,1 1,2 7.7,3 4.959}
{0 CHEMBL277014,1 1,2 4.5,3 5.959}
{0 CHEMBL281411,1 1,2 3.8,3 5.237}
{0 CHEMBL416736,1 1,2 4,3 5}
{0 CHEMBL538467,1 2,2 10,3 4.301}
{0 CHEMBL541398,1 2,2 8.7,3 4.77}
{0 CHEMBL542065,1 2,2 9.1,3 4.745}
{0 CHEMBL553602,1 2,2 8.7,3 4.854}
{0 CHEMBL557795,1 2,2 8,3 4.921}
{0 CHEMBL7303,1 2,2 8.3,3 4.921}
