"molecule_id","SpMaxA_EA.dm.","Eig05_AEA.ri.","piPC07","piPC08","SM02_EA.ri.","piPC10","piPC09","GATS1e","SpMAD_EA.dm.","piPC05","piPC06","GATS1s","MPC10","SM10_EA.dm.","SM12_EA.dm.","SM14_EA.dm.","Eta_alpha","piID","Rperim","MWC03","SpAD_AEA.ed.","ZM2","SpMaxA_AEA.bo.","SM04_EA.ri.","SpAD_EA.ri.","Eig07_EA.ed.","SM02_AEA.ri.","SMTIV","piPC03","ATS8m","Eig01_EA.dm.","SpMax_EA.dm.","Eig05_EA.ri.","SpMax1_Bh.p.","Chi0_EA.bo.","IDDM","RDSQ","S0K","SpAD_AEA.bo.","SpMaxA_EA.bo.","SM13_EA.ri.","SM14_EA.ri.","SM15_EA.ri.","MWC04","SRW08","MPC09","TRS","S2K","MWC05","MWC06","SRW06","MPC08","piPC04","SM08_EA.dm.","ATS4m","Eig10_AEA.dm.","X0v","ZM2Kup","Eig07_EA","SM15_AEA.bo.","CATS2D_04_DL","LOC","SdsssP","SpMAD_EA.ri.","pXC50"
{1 0.102,2 2.65,3 6.012,4 6.09,5 4.117,6 6.005,7 6.085,8 0.842,9 0.543,10 5.528,11 5.804,12 0.752,13 3.871,14 8.615,15 10.266,16 11.94,17 10,18 8.354,19 9,20 5.565,21 37.067,22 130,23 0.205,24 5.713,25 32.903,26 2.78,27 2.78,28 8765,29 4.491,30 3.077,31 2.341,32 2.341,33 1.621,34 3.962,35 13.014,36 4.422,37 165.458,38 98.107,39 34.379,40 0.194,41 15.544,42 16.727,43 17.905,44 6.457,45 8.312,46 4.094,47 11,48 6.944,49 7.343,50 8.248,51 6.681,52 4.263,53 5.039,54 7.005,55 3.842,56 0.93,57 12.511,58 342.333,59 1.143,60 1.143,61 3,62 2.042,64 1.431,65 5.745}
{0 CHEMBL1170847,1 0.035,2 3.889,3 6.954,4 7.214,5 4.932,6 7.319,7 7.216,8 1.07,9 0.239,10 6.327,11 6.646,12 0.97,13 5.352,14 6.174,15 7.258,16 8.348,17 21.333,18 12.409,19 23,20 6.409,21 82.006,22 303,23 0.094,24 6.634,25 72.54,26 7.929,27 7.929,28 75703,29 5.304,30 4.596,31 1.727,32 1.727,33 2.799,34 4.129,35 26.857,36 5.501,37 481.675,38 254.084,39 77.065,40 0.092,41 16.603,42 17.779,43 18.953,44 7.332,45 9.211,46 5.357,47 27,48 13.49,49 8.224,50 9.149,51 7.566,52 5.38,53 5.878,54 5.109,55 4.817,56 2.521,57 26.629,58 789.312,59 2.409,60 2.409,61 3,62 0.746,63 -9.471,64 1.451,65 6.284}
{0 CHEMBL1170848,1 0.038,2 3.633,3 6.959,4 7.21,5 4.801,6 7.425,7 7.23,8 0.958,9 0.214,10 6.353,11 6.66,12 0.911,13 5.489,14 6.169,15 7.256,16 8.347,17 18.433,18 13.407,19 28,20 6.33,21 74.762,22 280,23 0.102,24 6.384,25 65.992,26 7.676,27 7.676,28 53968,29 5.342,30 4.094,31 1.727,32 1.727,33 2.571,34 3.965,35 24.966,36 5.336,37 422.773,38 217.66,39 70.654,40 0.1,41 15.959,42 17.111,43 18.259,44 7.244,45 9.098,46 5.442,47 32,48 11.129,49 8.153,50 9.071,51 7.453,52 5.425,53 5.936,54 5.094,55 4.542,56 2.068,57 22.259,58 725.013,59 2.377,60 2.377,61 1,62 0.697,64 1.435,65 4.854}
{0 CHEMBL1170849,1 0.035,2 3.642,3 7.035,4 7.306,5 4.865,6 7.512,7 7.355,8 0.943,9 0.263,10 6.391,11 6.72,12 0.913,13 5.481,14 6.171,15 7.256,16 8.347,17 19.933,18 14.086,19 28,20 6.382,21 79.392,22 295,23 0.096,24 6.443,25 70.318,26 7.677,27 7.677,28 66580,29 5.38,30 4.167,31 1.727,32 1.727,33 2.584,34 3.972,35 26.491,36 5.439,37 456.663,38 240.215,39 75.149,40 0.093,41 15.968,42 17.119,43 18.266,44 7.291,45 9.139,46 5.464,47 32,48 12.396,49 8.195,50 9.109,51 7.504,52 5.455,53 5.964,54 5.1,55 4.592,56 2.338,57 24.337,58 751.013,59 2.385,60 2.385,61 3,62 0.695,64 1.435,65 7.114}
{0 CHEMBL1170850,1 0.038,2 3.617,3 6.971,4 7.261,5 4.795,6 7.523,7 7.338,8 0.95,9 0.235,10 6.347,11 6.661,12 0.914,13 5.476,14 6.186,15 7.263,16 8.35,17 18.367,18 13.401,19 28,20 6.33,21 74.73,22 280,23 0.102,24 6.377,25 65.743,26 7.805,27 7.805,28 54592,29 5.342,30 4.135,31 1.727,32 1.727,33 2.548,34 3.967,35 24.966,36 5.337,37 422.369,38 219.66,39 70.731,40 0.1,41 15.951,42 17.103,43 18.252,44 7.242,45 9.097,46 5.451,47 32,48 11.129,49 8.15,50 9.067,51 7.453,52 5.416,53 5.93,54 5.131,55 4.534,56 2.216,57 22.168,58 735.523,59 2.375,60 2.375,61 1,62 0.697,64 1.429,65 5.824}
{0 CHEMBL1170851,1 0.035,2 3.635,3 7.032,4 7.291,5 4.859,6 7.544,7 7.349,8 0.934,9 0.284,10 6.394,11 6.718,12 0.914,13 5.442,14 6.187,15 7.264,16 8.35,17 19.867,18 14.084,19 28,20 6.382,21 79.388,22 295,23 0.096,24 6.436,25 70.066,26 7.876,27 7.876,28 67194,29 5.38,30 4.248,31 1.727,32 1.727,33 2.573,34 3.972,35 26.491,36 5.439,37 456.192,38 240.215,39 75.197,40 0.093,41 15.965,42 17.115,43 18.261,44 7.291,45 9.139,46 5.412,47 32,48 12.396,49 8.193,50 9.107,51 7.504,52 5.398,53 5.969,54 5.135,55 4.593,56 2.334,57 24.245,58 761.523,59 2.392,60 2.392,61 2,62 0.695,64 1.43,65 7.155}
{0 CHEMBL1215173,1 0.052,2 3.215,3 6.348,4 6.625,5 4.4,6 6.749,7 6.794,8 0.827,9 0.295,10 5.819,11 6.052,12 0.676,13 4.344,14 5.644,15 6.558,16 7.49,17 13.767,18 10.424,19 17,20 5.82,21 47.72,22 168,23 0.138,24 5.888,25 44.869,26 5.122,27 5.122,28 24729,29 4.859,30 3.538,31 1.659,32 1.659,33 2.184,34 3.916,35 18.042,36 4.875,37 241.346,38 143.207,39 46.632,40 0.128,41 14.544,42 15.619,43 16.66,44 6.663,45 8.45,46 4.419,47 17,48 10.479,49 7.497,50 8.345,51 6.909,52 4.443,53 5.372,54 4.752,55 3.932,56 1.242,57 16.085,58 480.017,59 1.866,60 1.866,61 8,62 1.302,64 1.402,65 5.108}
{0 CHEMBL1215174,1 0.052,2 3.207,3 6.366,4 6.593,5 4.4,6 6.785,7 6.787,8 0.827,9 0.295,10 5.819,11 6.042,12 0.676,13 4.357,14 5.644,15 6.558,16 7.49,17 13.767,18 10.473,19 17,20 5.82,21 47.691,22 168,23 0.138,24 5.888,25 44.861,26 5.093,27 5.093,28 23841,29 4.859,30 3.603,31 1.659,32 1.659,33 2.166,34 3.917,35 18.042,36 4.878,37 243.508,38 147.207,39 46.645,40 0.128,41 14.568,42 15.645,43 16.687,44 6.666,45 8.451,46 4.419,47 17,48 10.479,49 7.499,50 8.351,51 6.909,52 4.419,53 5.382,54 4.752,55 3.948,56 1.349,57 16.085,58 480.017,59 1.851,60 1.851,61 8,62 1.302,64 1.402,65 5.638}
{0 CHEMBL1215175,1 0.073,2 3.13,3 5.937,4 6.126,5 4.249,6 5.938,7 6.105,8 0.791,9 0.482,10 5.632,11 5.758,12 0.628,13 3.932,14 7.906,15 9.285,16 10.68,17 12.433,18 9.47,19 12,20 5.659,21 41.844,22 143,23 0.154,24 5.718,25 38.654,26 4.112,27 4.112,28 18675,29 4.677,30 3.365,31 2.035,32 2.035,33 2.12,34 3.906,35 16.31,36 4.723,37 200.053,38 122.382,39 41.153,40 0.141,41 13.997,42 15.028,43 16.002,44 6.488,45 8.28,46 3.989,47 12,48 10.095,49 7.305,50 8.136,51 6.751,52 4.06,53 5.134,54 6.556,55 3.747,56 1.242,57 14.522,58 408.949,59 1.608,60 1.608,61 8,62 1.507,64 1.381,65 4}
{0 CHEMBL1215176,1 0.073,2 3.062,3 5.965,4 6.072,5 4.249,6 6.016,7 6.091,8 0.791,9 0.482,10 5.632,11 5.746,12 0.628,13 3.951,14 7.906,15 9.285,16 10.68,17 12.433,18 9.518,19 12,20 5.659,21 41.818,22 143,23 0.154,24 5.718,25 38.648,26 4.112,27 4.112,28 17937,29 4.677,30 3.442,31 2.035,32 2.035,33 2.047,34 3.908,35 16.31,36 4.726,37 202.045,38 128.382,39 41.166,40 0.141,41 14.039,42 15.074,43 16.053,44 6.491,45 8.282,46 3.989,47 12,48 10.095,49 7.307,50 8.142,51 6.751,52 4.025,53 5.147,54 6.556,55 3.767,56 1.349,57 14.522,58 408.949,59 1.608,60 1.608,61 8,62 1.507,64 1.38,65 4.357}
{0 CHEMBL1215241,1 0.044,2 3.344,3 6.389,4 6.68,5 4.48,6 6.81,7 6.89,8 0.796,9 0.292,10 5.845,11 6.088,12 0.646,13 4.394,14 4.805,15 5.572,16 6.359,17 14.6,18 10.456,19 17,20 5.889,21 51.163,22 180,23 0.13,24 5.995,25 48.211,26 5.715,27 5.715,28 29817,29 4.926,30 3.645,31 1.497,32 1.497,33 2.327,34 3.916,35 19.158,36 4.968,37 264.258,38 156,39 49.947,40 0.12,41 14.747,42 15.817,43 16.858,44 6.732,45 8.527,46 4.533,47 17,48 11.134,49 7.57,50 8.418,51 6.982,52 4.522,53 5.395,54 4.075,55 4.002,56 1.64,57 16.994,58 523.653,59 2.006,60 2.006,61 5,62 1.293,64 1.418,65 4.77}
{0 CHEMBL1215242,1 0.044,2 3.341,3 6.407,4 6.655,5 4.48,6 6.836,7 6.874,8 0.796,9 0.292,10 5.845,11 6.08,12 0.646,13 4.419,14 4.805,15 5.572,16 6.359,17 14.6,18 10.504,19 17,20 5.889,21 51.145,22 180,23 0.13,24 5.995,25 48.203,26 5.596,27 5.596,28 28817,29 4.926,30 3.735,31 1.497,32 1.497,33 2.327,34 3.916,35 19.158,36 4.97,37 266.518,38 160,39 49.956,40 0.12,41 14.767,42 15.838,43 16.88,44 6.735,45 8.529,46 4.511,47 17,48 11.134,49 7.572,50 8.423,51 6.982,52 4.511,53 5.405,54 4.075,55 4.017,56 1.64,57 16.994,58 523.653,59 1.984,60 1.984,61 5,62 1.293,64 1.418,65 5.357}
{0 CHEMBL1215243,1 0.053,2 3.217,3 6.398,4 6.687,5 4.372,6 6.994,7 6.843,8 0.837,9 0.275,10 5.825,11 6.069,12 0.684,13 4.454,14 5.632,15 6.544,16 7.472,17 13.267,18 10.413,19 17,20 5.796,21 46.484,22 164,23 0.142,24 5.862,25 43.452,26 4.762,27 4.762,28 22201,29 4.851,30 3.52,31 1.656,32 1.656,33 2.192,34 3.91,35 17.335,36 4.825,37 233.502,38 136.881,39 45.173,40 0.132,41 14.537,42 15.613,43 16.655,44 6.645,45 8.436,46 4.454,47 17,48 9.771,49 7.482,50 8.336,51 6.889,52 4.454,53 5.386,54 4.743,55 3.923,56 1,57 15.378,58 480.58,59 1.749,60 1.749,61 8,62 1.33,64 1.402,65 6.523}
{0 CHEMBL1215244,1 0.053,2 3.199,3 6.4,4 6.658,5 4.372,6 6.954,7 6.865,8 0.837,9 0.275,10 5.825,11 6.07,12 0.684,13 4.443,14 5.632,15 6.544,16 7.472,17 13.267,18 10.463,19 17,20 5.796,21 46.466,22 164,23 0.142,24 5.862,25 43.409,26 4.677,27 4.677,28 21351,29 4.851,30 3.588,31 1.656,32 1.656,33 2.166,34 3.91,35 17.335,36 4.828,37 235.747,38 140.881,39 45.249,40 0.132,41 14.558,42 15.635,43 16.678,44 6.648,45 8.438,46 4.454,47 17,48 9.771,49 7.484,50 8.342,51 6.889,52 4.454,53 5.396,54 4.743,55 3.942,56 1.264,57 15.378,58 480.58,59 1.723,60 1.723,61 9,62 1.33,64 1.4,65 6.237}
{0 CHEMBL1215245,1 0.075,2 3.112,3 6.011,4 6.227,5 4.217,6 6.422,7 6.2,8 0.802,9 0.466,10 5.639,11 5.782,12 0.637,13 4.06,14 7.905,15 9.284,16 10.679,17 11.933,18 9.453,19 12,20 5.631,21 40.567,22 139,23 0.16,24 5.688,25 37.173,26 4.106,27 4.106,28 16600,29 4.668,30 3.343,31 2.035,32 2.035,33 2.085,34 3.894,35 15.603,36 4.668,37 192.436,38 116.211,39 39.736,40 0.147,41 13.985,42 15.017,43 15.992,44 6.466,45 8.264,46 4.043,47 12,48 9.35,49 7.286,50 8.124,51 6.727,52 4.078,53 5.152,54 6.554,55 3.737,56 1,57 13.815,58 409.513,59 1.608,60 1.608,61 8,62 1.54,64 1.377,65 5.921}
{0 CHEMBL1215311,1 0.075,2 3.057,3 6.015,4 6.18,5 4.217,6 6.351,7 6.242,8 0.802,9 0.466,10 5.639,11 5.783,12 0.637,13 4.043,14 7.905,15 9.284,16 10.679,17 11.933,18 9.502,19 12,20 5.631,21 40.549,22 139,23 0.16,24 5.688,25 37.117,26 4.104,27 4.104,28 15900,29 4.668,30 3.424,31 2.035,32 2.035,33 2.031,34 3.895,35 15.603,36 4.67,37 194.487,38 122.211,39 39.811,40 0.147,41 14.022,42 15.056,43 16.036,44 6.469,45 8.266,46 4.043,47 12,48 9.35,49 7.288,50 8.131,51 6.727,52 4.078,53 5.165,54 6.554,55 3.76,56 1.264,57 13.815,58 409.513,59 1.607,60 1.607,61 9,62 1.54,64 1.375,65 5.086}
{0 CHEMBL1215312,1 0.045,2 3.314,3 6.434,4 6.745,5 4.455,6 6.913,7 6.908,8 0.806,9 0.271,10 5.863,11 6.103,12 0.654,13 4.454,14 4.798,15 5.568,16 6.356,17 14.1,18 10.445,19 17,20 5.866,21 49.918,22 176,23 0.134,24 5.973,25 46.819,26 5.628,27 5.628,28 26948,29 4.919,30 3.64,31 1.497,32 1.497,33 2.308,34 3.909,35 18.451,36 4.921,37 256.317,38 149.58,39 48.524,40 0.124,41 14.751,42 15.823,43 16.867,44 6.715,45 8.515,46 4.522,47 17,48 10.428,49 7.556,50 8.409,51 6.963,52 4.543,53 5.409,54 4.065,55 3.991,56 1.64,57 16.287,58 524.217,59 1.961,60 1.961,61 4,62 1.319,64 1.419,65 5.149}
{0 CHEMBL1215313,1 0.045,2 3.315,3 6.444,4 6.706,5 4.455,6 6.892,7 6.922,8 0.806,9 0.271,10 5.863,11 6.104,12 0.654,13 4.443,14 4.798,15 5.568,16 6.356,17 14.1,18 10.494,19 17,20 5.866,21 49.898,22 176,23 0.134,24 5.973,25 46.792,26 5.483,27 5.483,28 25986,29 4.919,30 3.686,31 1.497,32 1.497,33 2.309,34 3.909,35 18.451,36 4.924,37 258.677,38 153.58,39 48.598,40 0.124,41 14.768,42 15.841,43 16.886,44 6.718,45 8.516,46 4.533,47 17,48 10.428,49 7.559,50 8.415,51 6.963,52 4.522,53 5.419,54 4.065,55 4.009,56 1.64,57 16.287,58 524.217,59 1.92,60 1.92,61 5,62 1.319,64 1.418,65 6.337}
{0 CHEMBL132727,1 0.102,2 3.079,3 5.941,4 6.114,5 4.161,6 6.079,7 6.185,8 0.868,9 0.527,10 5.513,11 5.782,12 0.812,13 3.871,14 8.615,15 10.266,16 11.94,17 10,18 8.346,19 9,20 5.58,21 37.661,22 132,23 0.204,24 5.774,25 33.778,26 3.052,27 3.052,28 8740,29 4.491,30 3.194,31 2.341,32 2.341,33 2.06,34 3.962,35 12.461,36 4.427,37 166.168,38 98.107,39 34.946,40 0.194,41 15.538,42 16.717,43 17.891,44 6.472,45 8.336,46 4.127,47 11,48 6.505,49 7.354,50 8.256,51 6.711,52 4.234,53 5.01,54 7.004,55 3.81,56 1.017,57 12.472,58 339.818,59 1.171,60 1.171,61 5,62 1.945,64 1.469,65 6.824}
{0 CHEMBL150777,1 0.031,2 3.155,3 7.286,4 7.782,5 4.34,6 8.599,7 8.291,8 0.899,9 0.061,10 6.311,11 6.772,12 0.943,13 5.159,14 0.366,15 0.283,16 0.217,17 11.8,18 11.369,19 21,20 5.79,21 43.21,22 163,23 0.165,24 5.922,25 40.747,26 4.154,27 4.154,28 11005,29 5.044,30 3.098,31 0.86,32 0.86,33 2.1,34 4.043,35 14.554,36 4.613,37 218.414,38 112.096,39 42.437,40 0.163,41 15.193,42 16.313,43 17.414,44 6.686,45 8.555,46 5.17,47 23,48 6.226,49 7.575,50 8.477,51 6.919,52 5.011,53 5.708,54 0.469,55 3.911,56 0.97,57 13.854,58 414.869,59 1.506,60 1.506,61 3,62 0.739,64 1.455,65 6.824}
{0 CHEMBL152959,1 0.03,2 3.183,3 7.301,4 7.796,5 4.346,6 8.644,7 8.307,8 0.917,9 0.119,10 6.323,11 6.797,12 0.938,13 5.231,14 0.634,15 0.504,16 0.395,17 12.133,18 11.47,19 21,20 5.82,21 44.642,22 168,23 0.16,24 5.919,25 41.439,26 4.387,27 4.387,28 13041,29 5.063,30 3.263,31 0.86,32 0.86,33 2.11,34 4.04,35 15.477,36 4.666,37 227.942,38 118.211,39 43.438,40 0.158,41 15.17,42 16.29,43 17.391,44 6.711,45 8.578,46 5.204,47 23,48 6.788,49 7.6,50 8.499,51 6.944,52 5.043,53 5.715,54 0.787,55 3.944,56 1,57 14.263,58 445.414,59 1.539,60 1.539,61 3,62 0.825,64 1.429,65 7.046}
{0 CHEMBL152988,1 0.031,2 3.178,3 7.277,4 7.783,5 4.34,6 8.614,7 8.287,8 0.899,9 0.061,10 6.311,11 6.778,12 0.943,13 5.176,14 0.366,15 0.283,16 0.217,17 11.8,18 11.36,19 21,20 5.79,21 43.214,22 163,23 0.165,24 5.922,25 40.642,26 4.305,27 4.305,28 11113,29 5.044,30 3.132,31 0.86,32 0.86,33 2.112,34 4.043,35 14.554,36 4.612,37 217.644,38 112.096,39 42.358,40 0.163,41 15.177,42 16.296,43 17.397,44 6.683,45 8.554,46 5.159,47 23,48 6.226,49 7.573,50 8.473,51 6.919,52 5.017,53 5.7,54 0.469,55 3.894,56 1,57 13.854,58 414.869,59 1.52,60 1.52,61 3,62 0.739,64 1.452,65 7.337}
{0 CHEMBL157617,1 0.075,2 2.642,3 6.064,4 6.167,5 4.112,6 6.071,7 6.169,8 0.877,9 0.399,10 5.54,11 5.836,12 0.829,13 3.912,14 6.163,15 7.253,16 8.346,17 10.167,18 8.262,19 9,20 5.572,21 37.379,22 131,23 0.205,24 5.722,25 32.481,26 2.547,27 2.547,28 7568,29 4.503,30 3.187,31 1.727,32 1.727,33 1.585,34 3.965,35 13.307,36 4.424,37 167.777,38 96.107,39 33.815,40 0.194,41 15.553,42 16.735,43 17.912,44 6.466,45 8.325,46 4.143,47 11,48 7.161,49 7.358,50 8.265,51 6.688,52 4.317,53 5.046,54 5.078,55 3.87,56 0.814,57 13.232,58 308.182,59 1.165,60 1.165,61 3,62 2.042,64 1.412,65 6.114}
{0 CHEMBL162782,1 0.066,2 3.356,3 5.946,4 5.98,5 4.34,6 5.865,7 5.953,8 1.102,9 0.248,10 5.481,11 5.75,12 0.974,13 4.205,14 6.162,15 7.253,16 8.346,17 11.833,18 8.224,19 9,20 5.733,21 42.713,22 154,23 0.181,24 6.142,25 38.344,26 3.397,27 3.397,28 13434,29 4.535,30 3.886,31 1.727,32 1.727,33 2.324,34 4.121,35 14.071,36 4.618,37 202.597,38 114.096,39 39.77,40 0.172,41 16.353,42 17.539,43 18.725,44 6.668,45 8.568,46 4.331,47 11,48 7.374,49 7.531,50 8.466,51 6.921,52 4.419,53 5.102,54 5.076,55 4.208,56 1.039,57 15.25,58 425.644,59 1.412,60 1.412,61 2,62 1.937,63 -9.232,64 1.475,65 6.051}
{0 CHEMBL165933,1 0.149,2 2.642,3 5.89,4 5.887,5 4.046,6 5.505,7 5.735,8 0.858,9 0.803,10 5.46,11 5.715,12 0.752,13 3.784,14 12.568,15 14.929,16 17.295,17 9.833,18 7.923,19 9,20 5.533,21 35.948,22 126,23 0.214,24 5.65,25 30.836,26 2.519,27 2.519,28 7750,29 4.446,30 3.167,31 3.272,32 3.272,33 1.585,34 3.96,35 12.566,36 4.356,37 157.4,38 92.239,39 32.729,40 0.203,41 15.523,42 16.705,43 17.883,44 6.431,45 8.294,46 4.043,47 11,48 6.685,49 7.322,50 8.231,51 6.655,52 4.263,53 4.993,54 10.218,55 4.05,56 0.969,57 12.581,58 338.705,59 1.04,60 1.04,61 3,62 1.885,64 1.402,65 4.963}
{0 CHEMBL165934,1 0.084,2 3.227,3 6.192,4 6.348,5 4.431,6 6.497,7 6.463,8 0.72,9 0.505,10 5.619,11 5.947,12 0.674,13 4.913,14 8.637,15 10.276,16 11.944,17 11.571,18 8.664,19 12,20 5.911,21 49.186,22 184,23 0.183,24 6.325,25 41.971,26 4.831,27 4.831,28 13046,29 4.666,30 3.686,31 2.341,32 2.341,33 2.197,34 4.009,35 15.264,36 4.672,37 230.605,38 120.211,39 44.269,40 0.159,41 17.9,42 19.254,43 20.609,44 6.872,45 8.849,46 4.934,47 14,48 6.172,49 7.824,50 8.793,51 7.102,52 4.913,53 5.138,54 7.052,55 4.105,56 1.255,57 14.689,58 454,59 1.686,60 1.686,61 3,62 1.357,64 1.499,65 5.585}
{0 CHEMBL166664,1 0.142,2 2.642,3 5.882,4 5.87,5 4.081,6 5.468,7 5.725,8 0.847,9 0.768,10 5.464,11 5.718,12 0.743,13 3.871,14 12.568,15 14.929,16 17.295,17 10.333,18 7.99,19 9,20 5.565,21 37.067,22 130,23 0.205,24 5.671,25 32.122,26 2.78,27 2.78,28 8928,29 4.457,30 3.092,31 3.272,32 3.272,33 1.585,34 3.96,35 13.273,36 4.422,37 165.458,38 98.107,39 34.074,40 0.194,41 15.524,42 16.705,43 17.883,44 6.457,45 8.312,46 4.094,47 11,48 7.354,49 7.343,50 8.248,51 6.681,52 4.263,53 5,54 10.218,55 4.03,56 1.221,57 13.288,58 342.705,59 1.143,60 1.143,61 2,62 2.042,64 1.397,65 4.644}
{0 CHEMBL167966,1 0.094,2 3.097,3 6.204,4 6.374,5 4.211,6 6.687,7 6.545,8 0.834,9 0.7,10 5.608,11 5.931,12 0.753,13 4.06,14 8.834,15 10.432,16 12.064,17 11,18 8.984,19 9,20 5.645,21 40.478,22 141,23 0.188,24 5.807,25 36.013,26 3.337,27 3.337,28 11046,29 4.608,30 3.259,31 2.341,32 2.341,33 2.079,34 3.965,35 13.884,36 4.552,37 185.611,38 110.039,39 37.592,40 0.179,41 15.558,42 16.738,43 17.914,44 6.535,45 8.385,46 4.19,47 11,48 7.67,49 7.415,50 8.316,51 6.765,52 4.331,53 5.12,54 7.284,55 3.916,56 1.167,57 13.933,58 367.333,59 1.378,60 1.378,61 3,62 2.154,64 1.441,65 5.921}
{0 CHEMBL1683637,1 0.023,2 3.89,3 6.802,4 7.121,5 4.884,6 7.269,7 7.179,8 1.184,9 0.129,10 6.127,11 6.509,12 1.066,13 5.485,14 2.622,15 2.809,16 3.011,17 20.8,18 11.501,19 24,20 6.389,21 79.921,22 297,23 0.095,24 6.552,25 70.239,26 8.016,27 8.016,28 73137,29 5.194,30 4.726,31 1.151,32 1.151,33 2.816,34 3.978,35 26.673,36 5.465,37 470.927,38 245.133,39 76.352,40 0.094,41 16.34,42 17.498,43 18.657,44 7.31,45 9.169,46 5.489,47 26,48 13.326,49 8.198,50 9.121,51 7.543,52 5.46,53 5.75,54 2.452,55 4.842,56 2.257,57 25.643,58 818.916,59 2.45,60 2.45,61 3,62 0.83,63 -10.746,64 1.433,65 9}
{0 CHEMBL1683638,1 0.03,2 3.89,3 6.815,4 7.134,5 4.933,6 7.295,7 7.2,8 1.049,9 0.184,10 6.136,11 6.521,12 0.953,13 5.572,14 4.92,15 5.696,16 6.494,17 21.538,18 11.519,19 24,20 6.466,21 85.464,22 321,23 0.1,24 6.653,25 73.583,26 8.02,27 8.02,28 79925,29 5.279,30 4.85,31 1.51,32 1.51,33 2.816,34 4.126,35 27.69,36 5.526,37 511.383,38 259.066,39 80.827,40 0.09,41 17.312,42 18.594,43 19.882,44 7.39,45 9.303,46 5.583,47 26,48 13.395,49 8.303,50 9.227,51 7.636,52 5.525,53 5.763,54 4.185,55 4.889,56 2.399,57 26.491,58 872.92,59 2.452,60 2.452,61 3,62 0.832,63 -12.819,64 1.443,65 7.886}
{0 CHEMBL1683639,1 0.035,2 3.891,3 7.003,4 7.254,5 4.914,6 7.363,7 7.289,8 1.07,9 0.174,10 6.349,11 6.703,12 0.968,13 5.472,14 6.169,15 7.256,16 8.347,17 20.833,18 11.958,19 23,20 6.399,21 80.891,22 300,23 0.096,24 6.623,25 70.958,26 8.016,27 8.016,28 67959,29 5.301,30 4.688,31 1.727,32 1.727,33 2.816,34 4.13,35 26.677,36 5.469,37 476.219,38 247.133,39 75.417,40 0.094,41 16.609,42 17.784,43 18.959,44 7.328,45 9.213,46 5.472,47 27,48 13.047,49 8.225,50 9.156,51 7.559,52 5.46,53 5.895,54 5.093,55 4.817,56 2.423,57 26.181,58 784.016,59 2.45,60 2.45,61 3,62 0.83,63 -9.569,64 1.448,65 7.796}
{0 CHEMBL1683640,1 0.034,2 3.891,3 7.014,4 7.27,5 4.961,6 7.406,7 7.316,8 0.991,9 0.226,10 6.356,11 6.71,12 0.888,13 5.568,14 6.398,15 7.437,16 8.488,17 21.405,18 11.97,19 23,20 6.475,21 86.48,22 324,23 0.1,24 6.717,25 74.311,26 8.02,27 8.02,28 75733,29 5.378,30 4.874,31 1.727,32 1.727,33 2.817,34 4.128,35 27.694,36 5.53,37 516.633,38 259.066,39 79.892,40 0.09,41 17.422,42 18.699,43 19.981,44 7.407,45 9.341,46 5.561,47 27,48 13.1,49 8.327,50 9.258,51 7.65,52 5.525,53 5.906,54 5.38,55 4.868,56 2.456,57 26.73,58 872.888,59 2.452,60 2.452,61 3,62 0.832,63 -12.641,64 1.457,65 8.301}
{0 CHEMBL1683742,1 0.036,2 3.933,3 6.885,4 7.122,5 4.881,6 7.163,7 7.084,8 1.117,9 0.178,10 6.294,11 6.592,12 0.993,13 5.323,14 6.169,15 7.256,16 8.347,17 20.167,18 11.767,19 23,20 6.372,21 78.71,22 292,23 0.098,24 6.584,25 69.383,26 7.93,27 7.93,28 68591,29 5.269,30 4.567,31 1.727,32 1.727,33 2.804,34 3.999,35 26.039,36 5.438,37 455.294,38 240.215,39 74.128,40 0.095,41 16.467,42 17.622,43 18.774,44 7.292,45 9.176,46 5.333,47 27,48 12.787,49 8.189,50 9.109,51 7.529,52 5.361,53 5.824,54 5.093,55 4.788,56 2.249,57 24.959,58 794.564,59 2.388,60 2.388,61 2,62 0.748,63 -9.647,64 1.445,65 7.06}
{0 CHEMBL1683743,1 0.036,2 3.933,3 6.885,4 7.122,5 4.881,6 7.163,7 7.084,8 1.117,9 0.178,10 6.294,11 6.592,12 0.993,13 5.323,14 6.169,15 7.256,16 8.347,17 20.167,18 11.767,19 23,20 6.372,21 78.71,22 292,23 0.098,24 6.584,25 69.383,26 7.93,27 7.93,28 68599,29 5.269,30 4.561,31 1.727,32 1.727,33 2.804,34 3.995,35 26.039,36 5.438,37 455.294,38 240.215,39 74.128,40 0.095,41 16.467,42 17.622,43 18.774,44 7.292,45 9.176,46 5.333,47 27,48 12.787,49 8.189,50 9.109,51 7.529,52 5.361,53 5.824,54 5.093,55 4.788,56 2.249,57 24.959,58 794.564,59 2.388,60 2.388,61 2,62 0.748,63 -9.647,64 1.445,65 7.699}
{0 CHEMBL1683744,1 0.036,2 3.933,3 6.885,4 7.122,5 4.887,6 7.163,7 7.084,8 1.08,9 0.178,10 6.294,11 6.592,12 0.968,13 5.323,14 6.169,15 7.256,16 8.347,17 20.333,18 11.767,19 23,20 6.372,21 78.71,22 292,23 0.098,24 6.594,25 69.635,26 7.93,27 7.93,28 67443,29 5.269,30 4.551,31 1.727,32 1.727,33 2.804,34 4.071,35 26.039,36 5.438,37 455.294,38 240.215,39 74.128,40 0.095,41 16.506,42 17.664,43 18.819,44 7.292,45 9.176,46 5.333,47 27,48 12.811,49 8.189,50 9.109,51 7.529,52 5.361,53 5.824,54 5.093,55 4.789,56 2.246,57 25.258,58 767.312,59 2.388,60 2.388,61 2,62 0.748,63 -8.925,64 1.451,65 7.022}
{0 CHEMBL1683745,1 0.035,2 3.957,3 7.001,4 7.248,5 4.929,6 7.348,7 7.279,8 1.061,9 0.171,10 6.367,11 6.704,12 0.961,13 5.451,14 6.169,15 7.256,16 8.347,17 21.333,18 11.964,19 23,20 6.412,21 82.215,22 304,23 0.094,24 6.631,25 72.447,26 8.017,27 8.017,28 73763,29 5.306,30 4.623,31 1.727,32 1.727,33 2.823,34 4.072,35 27.384,36 5.502,37 484.088,38 254.084,39 76.858,40 0.092,41 16.519,42 17.676,43 18.832,44 7.334,45 9.216,46 5.451,47 27,48 13.647,49 8.231,50 9.153,51 7.569,52 5.447,53 5.872,54 5.093,55 4.837,56 2.424,57 26.888,58 788.016,59 2.451,60 2.451,61 3,62 0.822,63 -8.942,64 1.449,65 7.004}
{0 CHEMBL1683746,1 0.064,2 3.356,3 5.948,4 5.967,5 4.365,6 5.842,7 5.925,8 1.084,9 0.239,10 5.534,11 5.753,12 0.959,13 4.234,14 6.162,15 7.253,16 8.346,17 12.333,18 8.275,19 9,20 5.759,21 44.047,22 158,23 0.174,24 6.155,25 39.853,26 3.409,27 3.409,28 15083,29 4.546,30 3.773,31 1.727,32 1.727,33 2.324,34 4.061,35 14.778,36 4.673,37 210.984,38 120.211,39 41.2,40 0.165,41 16.243,42 17.41,43 18.575,44 6.678,45 8.575,46 4.304,47 11,48 7.992,49 7.546,50 8.463,51 6.94,52 4.407,53 5.052,54 5.076,55 4.266,56 1.047,57 15.957,58 429.644,59 1.423,60 1.423,61 2,62 2.08,63 -8.63,64 1.476,65 5.256}
{0 CHEMBL1683747,1 0.038,2 3.633,3 6.641,4 6.662,5 4.855,6 6.545,7 6.621,8 0.994,9 0.287,10 6.193,11 6.445,12 0.858,13 4.963,14 6.854,15 7.946,16 9.039,17 19.667,18 10.647,19 18,20 6.301,21 74.427,22 272,23 0.105,24 6.608,25 65.996,26 7.876,27 7.876,28 57544,29 5.185,30 4.479,31 1.727,32 1.727,33 2.571,34 4.074,35 24.8,36 5.373,37 420.138,38 184.477,39 68.658,40 0.099,41 16.689,42 17.864,43 19.036,44 7.223,45 9.121,46 5.011,47 22,48 12.848,49 8.118,50 9.039,51 7.462,52 5.106,53 5.716,54 5.766,55 4.78,56 2.521,57 25.211,58 710.218,59 2.377,60 2.377,61 4,62 0.854,63 -8.751,64 1.467,65 5.959}
{0 CHEMBL1683748,1 0.063,2 3.851,3 6.901,4 7.149,5 4.842,6 7.236,7 7.134,8 0.833,9 0.307,10 6.284,11 6.602,12 0.825,13 5.347,14 11.516,15 13.676,16 15.839,17 19.633,18 11.773,19 23,20 6.358,21 77.36,22 288,23 0.103,24 6.499,25 67.355,26 7.929,27 7.929,28 62051,29 5.284,30 4.623,31 2.95,32 2.95,33 2.735,34 4.117,35 25.021,36 5.404,37 447.462,38 229.329,39 72.127,40 0.099,41 16.166,42 17.309,43 18.449,44 7.287,45 9.172,46 5.357,47 27,48 11.942,49 8.182,50 9.112,51 7.518,52 5.375,53 5.878,54 9.362,55 4.754,56 2.238,57 24.423,58 774.136,59 2.387,60 2.387,61 1,62 0.756,64 1.433,65 6.457}
{0 CHEMBL1683749,1 0.041,2 3.633,3 6.882,4 7.12,5 4.83,6 7.156,7 7.082,8 1.026,9 0.275,10 6.269,11 6.585,12 0.9,13 5.288,14 7.041,15 8.239,16 9.453,17 19.067,18 11.754,19 23,20 6.326,21 75.536,22 279,23 0.102,24 6.486,25 66.414,26 7.876,27 7.876,28 58460,29 5.253,30 4.417,31 1.907,32 1.907,33 2.571,34 3.994,35 25.067,36 5.371,37 428.85,38 226.477,39 70.793,40 0.1,41 16.288,42 17.446,43 18.601,44 7.245,45 9.117,46 5.308,47 27,48 12.028,49 8.144,50 9.065,51 7.47,52 5.338,53 5.832,54 5.865,55 4.645,56 2.235,57 23.354,58 734.196,59 2.377,60 2.377,61 2,62 0.75,63 -4.454,64 1.444,65 6.593}
{0 CHEMBL1683750,1 0.063,2 3.852,3 6.673,4 6.995,5 4.811,6 7.107,7 6.987,8 0.908,9 0.26,10 6.048,11 6.385,12 0.903,13 5.361,14 11.511,15 13.675,16 15.838,17 19.767,18 11.32,19 24,20 6.347,21 76.377,22 285,23 0.103,24 6.419,25 66.631,26 7.929,27 7.929,28 65769,29 5.175,30 4.645,31 2.95,32 2.95,33 2.734,34 4.115,35 25.017,36 5.4,37 442.188,38 229.329,39 73.063,40 0.099,41 15.711,42 16.798,43 17.879,44 7.268,45 9.126,46 5.375,47 26,48 12.24,49 8.155,50 9.075,51 7.502,52 5.375,53 5.731,54 9.349,55 4.777,56 2.235,57 24.184,58 774.167,59 2.387,60 2.387,61 2,62 0.756,64 1.418,65 4.627}
{0 CHEMBL1683751,1 0.041,2 3.756,3 6.65,4 6.967,5 4.797,6 7.043,7 6.948,8 1.095,9 0.227,10 6.026,11 6.365,12 0.981,13 5.298,14 6.52,15 7.778,16 9.053,17 19.2,18 11.293,19 24,20 6.315,21 74.57,22 276,23 0.101,24 6.404,25 65.693,26 7.549,27 7.549,28 62073,29 5.14,30 4.467,31 1.907,32 1.907,33 2.678,34 3.974,35 25.063,36 5.367,37 423.57,38 226.477,39 71.732,40 0.1,41 15.895,42 17.016,43 18.133,44 7.225,45 9.069,46 5.328,47 26,48 12.333,49 8.115,50 9.026,51 7.453,52 5.333,53 5.678,54 5.305,55 4.671,56 2.234,57 23.115,58 734.228,59 2.339,60 2.339,61 2,62 0.75,63 -4.571,64 1.428,65 4.848}
{0 CHEMBL1683752,1 0.066,2 3.632,3 6.871,4 7.104,5 4.781,6 7.103,7 7.05,8 1.029,9 0.321,10 6.258,11 6.574,12 0.942,13 5.226,14 11.516,15 13.676,16 15.839,17 19.167,18 11.742,19 23,20 6.301,21 73.468,22 272,23 0.105,24 6.432,25 63.93,26 7.876,27 7.876,28 55479,29 5.232,30 4.427,31 2.95,32 2.95,33 2.571,34 4,35 24.774,36 5.338,37 411.669,38 219.66,39 68.917,40 0.102,41 16.243,42 17.398,43 18.551,44 7.216,45 9.089,46 5.257,47 27,48 12.226,49 8.116,50 9.035,51 7.441,52 5.298,53 5.803,54 9.362,55 4.689,56 2.398,57 23.878,58 694.241,59 2.377,60 2.377,61 4,62 0.742,63 -4.007,64 1.421,65 7.027}
{0 CHEMBL1683753,1 0.064,2 3.632,3 7.032,4 7.314,5 4.803,6 7.414,7 7.358,8 1.053,9 0.314,10 6.363,11 6.713,12 0.974,13 5.398,14 11.516,15 13.676,16 15.839,17 19.5,18 12.045,19 23,20 6.333,21 75.754,22 281,23 0.103,24 6.457,25 65.204,26 7.876,27 7.876,28 54460,29 5.274,30 4.587,31 2.95,32 2.95,33 2.571,34 4.01,35 25.437,36 5.372,37 439.627,38 226.477,39 70.34,40 0.101,41 16.277,42 17.434,43 18.587,44 7.256,45 9.133,46 5.455,47 27,48 12.435,49 8.165,50 9.093,51 7.477,52 5.464,53 5.868,54 9.362,55 4.773,56 2.458,57 24.248,58 725.146,59 2.377,60 2.377,61 3,62 0.83,63 -4.145,64 1.417,65 5.102}
{0 CHEMBL1683754,1 0.035,2 3.641,3 7.008,4 7.276,5 4.866,6 7.415,7 7.303,8 0.956,9 0.288,10 6.384,11 6.705,12 0.921,13 5.425,14 6.171,15 7.256,16 8.347,17 20.267,18 14.088,19 28,20 6.395,21 80.762,22 299,23 0.094,24 6.43,25 71.008,26 7.831,27 7.831,28 73385,29 5.384,30 4.188,31 1.727,32 1.727,33 2.539,34 3.971,35 27.198,36 5.471,37 464.755,38 247.133,39 76.567,40 0.092,41 15.952,42 17.103,43 18.251,44 7.3,45 9.146,46 5.425,47 32,48 12.976,49 8.201,50 9.112,51 7.515,52 5.425,53 5.962,54 5.103,55 4.596,56 2.411,57 24.745,58 784.468,59 2.393,60 2.393,61 3,62 0.687,64 1.42,65 7.155}
{0 CHEMBL1683755,1 0.035,2 3.642,3 7.035,4 7.306,5 4.865,6 7.512,7 7.355,8 0.943,9 0.263,10 6.391,11 6.72,12 0.913,13 5.481,14 6.171,15 7.256,16 8.347,17 19.933,18 14.086,19 28,20 6.382,21 79.392,22 295,23 0.096,24 6.443,25 70.318,26 7.677,27 7.677,28 66580,29 5.38,30 4.167,31 1.727,32 1.727,33 2.584,34 3.972,35 26.491,36 5.439,37 456.663,38 240.215,39 75.149,40 0.093,41 15.968,42 17.119,43 18.266,44 7.291,45 9.139,46 5.464,47 32,48 12.396,49 8.195,50 9.109,51 7.504,52 5.455,53 5.964,54 5.1,55 4.592,56 2.338,57 24.337,58 751.013,59 2.385,60 2.385,61 3,62 0.695,64 1.435,65 7.114}
{0 CHEMBL168861,1 0.09,2 3.196,3 6.092,4 6.211,5 4.349,6 6.245,7 6.264,8 0.81,9 0.428,10 5.574,11 5.868,12 0.722,13 4.682,14 8.615,15 10.266,16 11.94,17 11,18 8.52,19 12,20 5.784,21 43.626,22 162,23 0.182,24 6.171,25 38.765,26 4.247,27 4.247,28 10038,29 4.567,30 3.311,31 2.341,32 2.341,33 2.175,34 4.01,35 14.331,36 4.553,37 201.244,38 110.039,39 40.139,40 0.172,41 16.964,42 18.226,43 19.488,44 6.72,45 8.64,46 4.727,47 14,48 6.048,49 7.643,50 8.583,51 6.95,52 4.736,53 5.078,54 7.005,55 3.969,56 1.093,57 14.14,58 365.333,59 1.427,60 1.427,61 3,62 1.39,64 1.491,65 5.959}
{0 CHEMBL169198,1 0.102,2 2.65,3 6.128,4 6.27,5 4.117,6 6.352,7 6.349,8 0.852,9 0.571,10 5.587,11 5.883,12 0.758,13 3.871,14 8.616,15 10.266,16 11.94,17 10,18 8.621,19 9,20 5.565,21 37.067,22 130,23 0.205,24 5.713,25 32.903,26 2.78,27 2.78,28 8952,29 4.525,30 3.06,31 2.341,32 2.341,33 1.621,34 3.96,35 12.859,36 4.422,37 165.458,38 98.107,39 35.045,40 0.194,41 15.544,42 16.727,43 17.905,44 6.457,45 8.312,46 4.094,47 11,48 6.823,49 7.343,50 8.248,51 6.681,52 4.263,53 5.078,54 7.006,55 3.832,56 0.958,57 12.356,58 353.333,59 1.143,60 1.143,61 3,62 2.042,64 1.431,65 5.585}
{0 CHEMBL169309,1 0.098,2 2.724,3 6.134,4 6.253,5 4.149,6 6.337,7 6.317,8 0.842,9 0.547,10 5.576,11 5.891,12 0.747,13 3.932,14 8.616,15 10.266,16 11.94,17 10.5,18 8.717,19 9,20 5.595,21 38.423,22 134,23 0.196,24 5.732,25 34.168,26 2.979,27 2.979,28 10256,29 4.535,30 3.065,31 2.341,32 2.341,33 1.715,34 3.961,35 13.566,36 4.486,37 173.511,38 104.042,39 36.105,40 0.186,41 15.544,42 16.727,43 17.905,44 6.482,45 8.329,46 4.094,47 11,48 7.495,49 7.363,50 8.265,51 6.706,52 4.263,53 5.084,54 7.006,55 3.861,56 1.175,57 13.063,58 357.333,59 1.256,60 1.256,61 3,62 2.189,64 1.424,65 5.602}
{0 CHEMBL170557,1 0.098,2 2.724,3 5.885,4 5.861,5 4.149,6 5.455,7 5.706,8 0.827,9 0.464,10 5.468,11 5.721,12 0.727,13 3.932,14 8.615,15 10.266,16 11.94,17 10.5,18 8.054,19 9,20 5.595,21 38.423,22 134,23 0.196,24 5.732,25 34.168,26 2.979,27 2.979,28 9858,29 4.469,30 3.099,31 2.341,32 2.341,33 1.715,34 3.962,35 13.98,36 4.486,37 173.511,38 104.042,39 35.23,40 0.186,41 15.544,42 16.727,43 17.905,44 6.482,45 8.329,46 4.094,47 11,48 7.798,49 7.363,50 8.265,51 6.706,52 4.263,53 5.006,54 7.005,55 3.88,56 1.022,57 13.477,58 337.333,59 1.256,60 1.256,61 3,62 2.189,64 1.424,65 5.745}
{0 CHEMBL1957232,1 0.067,2 3.004,3 6.909,4 7.299,5 4.285,6 7.683,7 7.461,8 0.81,9 0.212,10 6.12,11 6.481,12 0.607,13 4.779,14 6.752,15 8.066,16 9.392,17 12.6,18 11.172,19 20,20 5.79,21 44.042,22 163,23 0.161,24 5.769,25 40.543,26 4.446,27 4.446,28 13403,29 4.982,30 3.46,31 1.953,32 1.953,33 1.938,34 4.021,35 15.43,36 4.67,37 221.871,38 118.211,39 43.488,40 0.159,41 14.732,42 15.837,43 16.92,44 6.671,45 8.48,46 4.771,47 22,48 7.36,49 7.548,50 8.439,51 6.891,52 4.804,53 5.628,54 5.458,55 3.911,56 1.122,57 14.863,58 425.295,59 1.622,60 1.622,62 0.646,64 1.398,65 4.301}
{0 CHEMBL208921,1 0.064,2 3.279,3 6.096,4 6.188,5 4.334,6 6.157,7 6.198,8 0.991,9 0.314,10 5.559,11 5.857,12 0.899,13 4.094,14 6.163,15 7.254,16 8.346,17 12.4,18 8.66,19 9,20 5.727,21 43.339,22 153,23 0.174,24 6.033,25 39.525,26 3.262,27 3.262,28 13946,29 4.557,30 3.482,31 1.727,32 1.727,33 2.253,34 3.997,35 15.038,36 4.668,37 205.69,38 120.211,39 40.36,40 0.165,41 15.987,42 17.161,43 18.332,44 6.627,45 8.492,46 4.22,47 11,48 8.576,49 7.492,50 8.398,51 6.874,52 4.369,53 5.078,54 5.078,55 4.01,56 1.115,57 16.228,58 357.783,59 1.473,60 1.473,61 4,62 2.254,63 -3.984,64 1.464,65 7.432}
{0 CHEMBL209069,1 0.066,2 3.268,3 6.082,4 6.184,5 4.297,6 6.201,7 6.218,8 0.978,9 0.366,10 5.555,11 5.871,12 0.909,13 4.127,14 6.201,15 7.274,16 8.357,17 11.833,18 8.592,19 9,20 5.7,21 42.031,22 149,23 0.181,24 6.005,25 37.976,26 3.196,27 3.196,28 12579,29 4.546,30 3.467,31 1.727,32 1.727,33 2.236,34 3.994,35 14.331,36 4.613,37 197.451,38 114.096,39 39.196,40 0.172,41 15.961,42 17.134,43 18.305,44 6.605,45 8.477,46 4.234,47 11,48 7.92,49 7.474,50 8.385,51 6.853,52 4.357,53 5.071,54 5.146,55 3.966,56 1.113,57 15.429,58 364.292,59 1.294,60 1.294,61 3,62 2.118,63 -4.183,64 1.461,65 7.42}
{0 CHEMBL215311,1 0.036,2 3.933,3 6.885,4 7.122,5 4.881,6 7.163,7 7.084,8 1.117,9 0.178,10 6.294,11 6.592,12 0.993,13 5.323,14 6.169,15 7.256,16 8.347,17 20.167,18 11.767,19 23,20 6.372,21 78.71,22 292,23 0.098,24 6.584,25 69.383,26 7.93,27 7.93,28 68591,29 5.269,30 4.567,31 1.727,32 1.727,33 2.804,34 3.999,35 26.039,36 5.438,37 455.294,38 240.215,39 74.128,40 0.095,41 16.467,42 17.622,43 18.774,44 7.292,45 9.176,46 5.333,47 27,48 12.787,49 8.189,50 9.109,51 7.529,52 5.361,53 5.824,54 5.093,55 4.788,56 2.249,57 24.959,58 794.564,59 2.388,60 2.388,61 2,62 0.748,63 -9.647,64 1.445,65 7.06}
{0 CHEMBL2311206,1 0.035,2 3.889,3 6.954,4 7.214,5 4.932,6 7.319,7 7.216,8 1.07,9 0.239,10 6.327,11 6.646,12 0.97,13 5.352,14 6.174,15 7.258,16 8.348,17 21.333,18 12.409,19 23,20 6.409,21 82.006,22 303,23 0.094,24 6.634,25 72.54,26 7.929,27 7.929,28 75703,29 5.304,30 4.596,31 1.727,32 1.727,33 2.799,34 4.129,35 26.857,36 5.501,37 481.675,38 254.084,39 77.065,40 0.092,41 16.603,42 17.779,43 18.953,44 7.332,45 9.211,46 5.357,47 27,48 13.49,49 8.224,50 9.149,51 7.566,52 5.38,53 5.878,54 5.109,55 4.817,56 2.521,57 26.629,58 789.312,59 2.409,60 2.409,61 3,62 0.746,63 -9.471,64 1.451,65 6.284}
{0 CHEMBL235533,1 0.023,2 3.89,3 6.922,4 7.218,5 4.884,6 7.463,7 7.325,8 1.216,9 0.129,10 6.18,11 6.591,12 1.096,13 5.485,14 2.622,15 2.809,16 3.011,17 20.8,18 11.667,19 24,20 6.389,21 79.921,22 297,23 0.095,24 6.552,25 70.239,26 8.016,27 8.016,28 75169,29 5.227,30 4.717,31 1.151,32 1.151,33 2.816,34 3.977,35 26.582,36 5.465,37 470.927,38 247.133,39 77.884,40 0.094,41 16.34,42 17.498,43 18.657,44 7.31,45 9.169,46 5.489,47 26,48 13.062,49 8.198,50 9.121,51 7.543,52 5.46,53 5.778,54 2.452,55 4.836,56 2.258,57 25.013,58 836.916,59 2.45,60 2.45,61 3,62 0.83,63 -10.784,64 1.433,65 8}
{0 CHEMBL2364562,1 0.024,2 3.886,3 6.658,4 6.977,5 4.841,6 7.067,7 6.962,8 1.219,9 0.135,10 6.034,11 6.372,12 1.084,13 5.361,14 2.622,15 2.809,16 3.011,17 19.8,18 11.302,19 24,20 6.347,21 76.377,22 285,23 0.099,24 6.513,25 67.426,26 7.929,27 7.929,28 66789,29 5.152,30 4.662,31 1.151,32 1.151,33 2.799,34 3.976,35 25.328,36 5.4,37 442.188,38 233.329,39 73.631,40 0.097,41 16.324,42 17.483,43 18.642,44 7.268,45 9.126,46 5.375,47 26,48 12.493,49 8.155,50 9.075,51 7.502,52 5.375,53 5.695,54 2.452,55 4.794,56 2.236,57 24.013,58 798.212,59 2.387,60 2.387,61 2,62 0.756,63 -10.728,64 1.435,65 6.328}
{0 CHEMBL23716,1 0.028,2 3.054,3 7.662,4 8.208,5 4.444,6 9.078,7 8.603,8 0.788,9 0.055,10 6.551,11 7.091,12 0.561,13 5.606,14 0.366,15 0.283,16 0.217,17 13.133,18 12.679,19 23,20 5.932,21 48.698,22 188,23 0.153,24 6.062,25 45.432,26 4.505,27 4.505,28 13758,29 5.269,30 3.566,31 0.86,32 0.86,33 2.003,34 4.164,35 16.197,36 4.727,37 255.959,38 128.382,39 47.745,40 0.152,41 15.768,42 16.927,43 18.078,44 6.849,45 8.696,46 5.497,47 27,48 6.446,49 7.769,50 8.695,51 7.047,52 5.416,53 5.988,54 0.469,55 4.138,56 1.356,57 15.17,58 463.403,59 1.55,60 1.55,61 3,62 0.732,64 1.466,65 6.796}
{0 CHEMBL237760,1 0.098,2 3.151,3 6.077,4 6.196,5 4.2,6 6.213,7 6.242,8 0.801,9 0.585,10 5.567,11 5.857,12 0.679,13 4.078,14 9.022,15 10.764,16 12.527,17 11,18 8.518,19 9,20 5.652,21 40.868,22 142,23 0.188,24 5.805,25 35.372,26 3.147,27 3.147,28 10460,29 4.557,30 3.33,31 2.443,32 2.443,33 2.116,34 3.965,35 14.307,36 4.552,37 187.085,38 110.039,39 36.864,40 0.179,41 15.563,42 16.742,43 17.917,44 6.541,45 8.396,46 4.234,47 11,48 7.818,49 7.426,50 8.326,51 6.772,52 4.357,53 5.065,54 7.32,55 3.931,56 1.253,57 14.394,58 362.848,59 1.217,60 1.217,61 2,62 2.154,64 1.415,65 5.824}
{0 CHEMBL238403,1 0.09,2 3.11,3 6.304,4 6.444,5 4.285,6 6.51,7 6.488,8 0.771,9 0.715,10 5.705,11 6.05,12 0.649,13 4.344,14 9.497,15 11.22,16 12.959,17 11.833,18 8.754,19 9,20 5.72,21 43.78,22 152,23 0.175,24 5.868,25 38.996,26 4.545,27 4.545,28 12656,29 4.588,30 3.541,31 2.443,32 2.443,33 2.083,34 3.968,35 15.091,36 4.665,37 213.752,38 122.211,39 40.452,40 0.166,41 15.598,42 16.78,43 17.957,44 6.619,45 8.461,46 4.477,47 11,48 8.475,49 7.504,50 8.415,51 6.843,52 4.605,53 5.158,54 7.804,55 4.059,56 1.309,57 15.302,58 415.212,59 1.652,60 1.652,61 1,62 2.071,64 1.444,65 5.387}
{0 CHEMBL23843,1 0.032,2 2.836,3 7.256,4 7.748,5 4.287,6 8.543,7 8.243,8 0.906,9 0.064,10 6.28,11 6.737,12 0.939,13 5.081,14 0.366,15 0.283,16 0.217,17 11.3,18 11.235,19 21,20 5.746,21 41.096,22 156,23 0.171,24 5.856,25 39.088,26 3.632,27 3.632,28 10067,29 5.015,30 2.962,31 0.86,32 0.86,33 1.796,34 4.04,35 14.131,36 4.554,37 206.271,38 106.039,39 40.689,40 0.169,41 15.144,42 16.266,43 17.369,44 6.637,45 8.502,46 5.1,47 23,48 5.984,49 7.528,50 8.427,51 6.868,52 4.963,53 5.677,54 0.469,55 3.86,56 0.969,57 12.932,58 404.869,59 1.447,60 1.447,61 3,62 0.681,64 1.448,65 7.004}
{0 CHEMBL238461,1 0.083,2 3.171,3 6.077,4 6.196,5 4.214,6 6.213,7 6.242,8 0.802,9 0.579,10 5.567,11 5.857,12 0.729,13 4.078,14 7.609,15 8.968,16 10.354,17 10.9,18 8.518,19 9,20 5.652,21 40.868,22 142,23 0.188,24 5.825,25 35.691,26 3.147,27 3.147,28 10876,29 4.557,30 3.328,31 2.071,32 2.071,33 2.167,34 3.965,35 14.307,36 4.552,37 187.085,38 110.039,39 36.864,40 0.179,41 15.568,42 16.747,43 17.921,44 6.541,45 8.396,46 4.234,47 11,48 7.792,49 7.426,50 8.326,51 6.772,52 4.357,53 5.065,54 6.286,55 3.929,56 1.254,57 13.933,58 370.082,59 1.217,60 1.217,61 4,62 2.154,64 1.428,65 6.456}
{0 CHEMBL238905,1 0.083,2 3.171,3 5.92,4 5.937,5 4.214,6 5.648,7 5.84,8 0.795,9 0.471,10 5.493,11 5.749,12 0.716,13 4.078,14 7.609,15 8.968,16 10.354,17 10.9,18 8.114,19 9,20 5.652,21 40.868,22 142,23 0.188,24 5.825,25 35.691,26 3.147,27 3.147,28 10675,29 4.514,30 3.341,31 2.071,32 2.071,33 2.167,34 3.963,35 14.644,36 4.552,37 187.085,38 108.039,39 36.803,40 0.178,41 15.568,42 16.747,43 17.921,44 6.541,45 8.396,46 4.234,47 11,48 7.967,49 7.426,50 8.326,51 6.772,52 4.357,53 5.02,54 6.286,55 3.939,56 1.17,57 14.14,58 359.082,59 1.217,60 1.217,61 4,62 2.154,64 1.428,65 5.684}
{0 CHEMBL239105,1 0.06,2 3.335,3 6.236,4 6.371,5 4.462,6 6.39,7 6.397,8 0.842,9 0.415,10 5.872,11 6.038,12 0.745,13 4.317,14 7.038,15 8.238,16 9.452,17 13.967,18 10.068,19 15,20 5.9,21 51.323,22 182,23 0.147,24 6.05,25 46.179,26 4.83,27 4.83,28 20257,29 4.86,30 3.643,31 1.907,32 1.907,33 2.313,34 3.967,35 17.563,36 4.883,37 256.323,38 147.207,39 47.744,40 0.139,41 15.648,42 16.817,43 17.98,44 6.786,45 8.641,46 4.431,47 17,48 9.433,49 7.663,50 8.555,51 7.022,52 4.554,53 5.381,54 5.858,55 4.129,56 1.62,57 17.373,58 442.402,59 1.686,60 1.686,61 5,62 0.817,64 1.443,65 5.548}
{0 CHEMBL246969,1 0.061,2 3.847,3 6.613,4 6.958,5 4.827,6 7.131,7 6.978,8 0.895,9 0.243,10 6.021,11 6.321,12 0.894,13 5.403,14 11.511,15 13.675,16 15.838,17 20.267,18 11.325,19 24,20 6.358,21 77.385,22 288,23 0.101,24 6.426,25 67.881,26 7.458,27 7.458,28 70213,29 5.169,30 4.64,31 2.95,32 2.95,33 2.729,34 4.115,35 25.648,36 5.432,37 451.861,38 236.215,39 74.074,40 0.097,41 15.706,42 16.795,43 17.877,44 7.274,45 9.126,46 5.366,47 26,48 12.834,49 8.155,50 9.072,51 7.509,52 5.352,53 5.724,54 9.348,55 4.767,56 2.22,57 24.891,58 776.167,59 2.296,60 2.296,61 2,62 0.748,64 1.414,65 4.627}
{0 CHEMBL264107,1 0.021,2 3.894,3 7.184,4 7.606,5 4.985,6 8.202,7 7.889,8 1.166,9 0.117,10 6.362,11 6.757,12 1.06,13 5.781,14 2.622,15 2.809,16 3.011,17 22.8,18 13.001,19 30,20 6.482,21 86.768,22 326,23 0.087,24 6.641,25 78.094,26 8.689,27 8.689,28 92109,29 5.352,30 4.825,31 1.151,32 1.151,33 2.843,34 3.988,35 28.891,36 5.587,37 535.802,38 271.121,39 84.518,40 0.086,41 16.379,42 17.535,43 18.689,44 7.399,45 9.258,46 5.727,47 32,48 14.167,49 8.288,50 9.208,51 7.633,52 5.652,53 5.924,54 2.452,55 4.902,56 2.258,57 27.323,58 884.916,59 2.726,60 2.726,61 3,62 0.713,63 -10.798,64 1.446,65 7.699}
{0 CHEMBL265870,1 0.021,2 3.89,3 6.938,4 7.322,5 5.006,6 7.772,7 7.523,8 1.166,9 0.137,10 6.289,11 6.61,12 1.053,13 5.737,14 2.625,15 2.81,16 3.011,17 23.7,18 13.041,19 30,20 6.503,21 89.097,22 333,23 0.083,24 6.643,25 80.319,26 8.025,27 8.025,28 103607,29 5.342,30 4.88,31 1.151,32 1.151,33 2.814,34 3.981,35 30.19,36 5.642,37 556.201,38 285.294,39 86.943,40 0.082,41 16.349,42 17.506,43 18.662,44 7.414,45 9.264,46 5.69,47 32,48 15.348,49 8.295,50 9.209,51 7.649,52 5.613,53 5.891,54 2.458,55 4.912,56 2.335,57 28.53,58 902.606,59 2.556,60 2.556,61 4,62 0.7,63 -10.812,64 1.434,65 7.347}
{0 CHEMBL347721,1 0.033,2 2.827,3 7.223,4 7.718,5 4.227,6 8.465,7 8.192,8 0.921,9 0.066,10 6.191,11 6.719,12 0.943,13 5.017,14 0.366,15 0.283,16 0.217,17 11.133,18 10.882,19 20,20 5.72,21 39.409,22 152,23 0.178,24 5.802,25 36.917,26 3.621,27 3.621,28 9386,29 4.992,30 3.032,31 0.86,32 0.86,33 1.775,34 4.05,35 13.554,36 4.493,37 195.832,38 104.042,39 39.391,40 0.176,41 15.125,42 16.244,43 17.349,44 6.616,45 8.465,46 5.05,47 22,48 5.759,49 7.51,50 8.413,51 6.834,52 4.934,53 5.66,54 0.469,55 3.904,56 0.779,57 13.002,58 403.926,59 1.432,60 1.432,61 3,62 0.7,64 1.42,65 7.26}
{0 CHEMBL348359,1 0.039,2 3.633,3 6.64,4 6.676,5 4.839,6 6.588,7 6.655,8 1.002,9 0.293,10 6.172,11 6.443,12 0.865,13 4.984,14 6.854,15 7.946,16 9.039,17 19.167,18 10.638,19 18,20 6.286,21 73.098,22 268,23 0.107,24 6.6,25 64.499,26 7.876,27 7.876,28 52662,29 5.179,30 4.604,31 1.727,32 1.727,33 2.571,34 4.13,35 24.093,36 5.338,37 412.306,38 179.66,39 67.217,40 0.101,41 16.765,42 17.954,43 19.142,44 7.217,45 9.117,46 5.056,47 22,48 12.234,49 8.11,50 9.042,51 7.451,52 5.124,53 5.742,54 5.766,55 4.758,56 2.521,57 24.504,58 706.218,59 2.377,60 2.377,61 4,62 0.862,63 -9.362,64 1.466,65 5.638}
{0 CHEMBL358876,1 0.03,2 3.186,3 7.311,4 7.816,5 4.391,6 8.666,7 8.333,8 0.894,9 0.059,10 6.341,11 6.812,12 0.947,13 5.247,14 0.366,15 0.283,16 0.217,17 12.3,18 11.479,19 21,20 5.838,21 45.295,22 171,23 0.16,24 5.995,25 42.381,26 4.368,27 4.368,28 12062,29 5.082,30 3.248,31 0.86,32 0.86,33 2.116,34 4.047,35 15.001,36 4.67,37 230.604,38 122.211,39 44.014,40 0.158,41 15.301,42 16.418,43 17.517,44 6.735,45 8.615,46 5.226,47 23,48 6.468,49 7.628,50 8.53,51 6.973,52 5.063,53 5.73,54 0.469,55 3.952,56 1,57 14.777,58 425.869,59 1.521,60 1.521,61 3,62 0.777,64 1.461,65 7.081}
{0 CHEMBL384114,1 0.036,2 3.933,3 6.885,4 7.122,5 4.881,6 7.163,7 7.084,8 1.117,9 0.178,10 6.294,11 6.592,12 0.993,13 5.323,14 6.169,15 7.256,16 8.347,17 20.167,18 11.767,19 23,20 6.372,21 78.71,22 292,23 0.098,24 6.584,25 69.383,26 7.93,27 7.93,28 68599,29 5.269,30 4.561,31 1.727,32 1.727,33 2.804,34 3.995,35 26.039,36 5.438,37 455.294,38 240.215,39 74.128,40 0.095,41 16.467,42 17.622,43 18.774,44 7.292,45 9.176,46 5.333,47 27,48 12.787,49 8.189,50 9.109,51 7.529,52 5.361,53 5.824,54 5.093,55 4.788,56 2.249,57 24.959,58 794.564,59 2.388,60 2.388,61 2,62 0.748,63 -9.647,64 1.445,65 7.699}
{0 CHEMBL389392,1 0.06,2 3.854,3 7.114,4 7.356,5 4.886,6 7.58,7 7.448,8 0.832,9 0.294,10 6.4,11 6.78,12 0.838,13 5.472,14 11.516,15 13.676,16 15.839,17 20.633,18 12.135,19 23,20 6.399,21 80.891,22 300,23 0.099,24 6.54,25 70.168,26 8.016,27 8.016,28 70051,29 5.35,30 4.68,31 2.95,32 2.95,33 2.737,34 4.117,35 26.275,36 5.469,37 476.219,38 243.133,39 76.36,40 0.095,41 16.185,42 17.327,43 18.467,44 7.328,45 9.213,46 5.472,47 27,48 12.509,49 8.225,50 9.156,51 7.559,52 5.46,53 5.948,54 9.362,55 4.798,56 2.512,57 25.423,58 812.84,59 2.45,60 2.45,61 2,62 0.83,64 1.432,65 6.284}
{0 CHEMBL392178,1 0.08,2 3.247,3 6.084,4 6.184,5 4.243,6 6.182,7 6.21,8 0.795,9 0.557,10 5.555,11 5.865,12 0.722,13 4.094,14 7.609,15 8.968,16 10.354,17 11.4,18 8.592,19 9,20 5.68,21 42.082,22 146,23 0.181,24 5.842,25 37.075,26 3.182,27 3.182,28 12371,29 4.567,30 3.347,31 2.071,32 2.071,33 2.237,34 3.965,35 15.014,36 4.61,37 195.347,38 116.096,39 38.19,40 0.172,41 15.567,42 16.746,43 17.92,44 6.564,45 8.412,46 4.22,47 11,48 8.473,49 7.444,50 8.341,51 6.795,52 4.357,53 5.071,54 6.286,55 3.956,56 1.386,57 14.64,58 374.082,59 1.281,60 1.281,61 4,62 2.292,64 1.426,65 6.398}
{0 CHEMBL392203,1 0.023,2 3.89,3 6.802,4 7.121,5 4.884,6 7.269,7 7.179,8 1.184,9 0.129,10 6.127,11 6.509,12 1.066,13 5.485,14 2.622,15 2.809,16 3.011,17 20.8,18 11.501,19 24,20 6.389,21 79.921,22 297,23 0.095,24 6.552,25 70.239,26 8.016,27 8.016,28 73137,29 5.194,30 4.726,31 1.151,32 1.151,33 2.816,34 3.978,35 26.673,36 5.465,37 470.927,38 245.133,39 76.352,40 0.094,41 16.34,42 17.498,43 18.657,44 7.31,45 9.169,46 5.489,47 26,48 13.326,49 8.198,50 9.121,51 7.543,52 5.46,53 5.75,54 2.452,55 4.842,56 2.257,57 25.643,58 818.916,59 2.45,60 2.45,61 3,62 0.83,63 -10.746,64 1.433,65 9}
{0 CHEMBL392204,1 0.035,2 3.891,3 7.003,4 7.254,5 4.914,6 7.363,7 7.289,8 1.07,9 0.174,10 6.349,11 6.703,12 0.968,13 5.472,14 6.169,15 7.256,16 8.347,17 20.833,18 11.958,19 23,20 6.399,21 80.891,22 300,23 0.096,24 6.623,25 70.958,26 8.016,27 8.016,28 67959,29 5.301,30 4.688,31 1.727,32 1.727,33 2.816,34 4.13,35 26.677,36 5.469,37 476.219,38 247.133,39 75.417,40 0.094,41 16.609,42 17.784,43 18.959,44 7.328,45 9.213,46 5.472,47 27,48 13.047,49 8.225,50 9.156,51 7.559,52 5.46,53 5.895,54 5.093,55 4.817,56 2.423,57 26.181,58 784.016,59 2.45,60 2.45,61 3,62 0.83,63 -9.569,64 1.448,65 7.748}
{0 CHEMBL394276,1 0.024,2 3.886,3 6.658,4 6.977,5 4.841,6 7.067,7 6.962,8 1.219,9 0.135,10 6.034,11 6.372,12 1.084,13 5.361,14 2.622,15 2.809,16 3.011,17 19.8,18 11.302,19 24,20 6.347,21 76.377,22 285,23 0.099,24 6.513,25 67.426,26 7.929,27 7.929,28 66789,29 5.152,30 4.662,31 1.151,32 1.151,33 2.799,34 3.976,35 25.328,36 5.4,37 442.188,38 233.329,39 73.631,40 0.097,41 16.324,42 17.483,43 18.642,44 7.268,45 9.126,46 5.375,47 26,48 12.493,49 8.155,50 9.075,51 7.502,52 5.375,53 5.695,54 2.452,55 4.794,56 2.236,57 24.013,58 798.212,59 2.387,60 2.387,61 2,62 0.756,63 -10.728,64 1.435,65 6.959}
{0 CHEMBL394277,1 0.024,2 3.889,3 6.736,4 7.068,5 4.844,6 7.155,7 7.098,8 1.227,9 0.132,10 6.1,11 6.465,12 1.092,13 5.421,14 2.622,15 2.809,16 3.011,17 21.443,18 11.407,19 24,20 6.372,21 78.381,22 292,23 0.097,24 6.515,25 67.679,26 7.987,27 7.987,28 72739,29 5.178,30 4.89,31 1.151,32 1.151,33 2.8,34 3.998,35 25.751,36 5.433,37 457.361,38 240.215,39 75.241,40 0.096,41 16.325,42 17.484,43 18.643,44 7.295,45 9.155,46 5.442,47 26,48 13.163,49 8.182,50 9.106,51 7.529,52 5.425,53 5.736,54 2.452,55 5.048,56 2.257,57 26.471,58 824.226,59 2.427,60 2.427,61 3,62 0.759,63 -10.741,64 1.41,65 7.721}
{0 CHEMBL409560,1 0.024,2 3.89,3 6.736,4 7.068,5 4.866,6 7.155,7 7.098,8 1.238,9 0.132,10 6.1,11 6.465,12 1.112,13 5.421,14 2.622,15 2.809,16 3.011,17 20.2,18 11.407,19 24,20 6.372,21 78.381,22 292,23 0.097,24 6.536,25 68.946,26 7.987,27 7.987,28 70799,29 5.178,30 4.693,31 1.151,32 1.151,33 2.811,34 3.976,35 25.751,36 5.433,37 457.361,38 240.215,39 75.241,40 0.096,41 16.335,42 17.493,43 18.652,44 7.295,45 9.155,46 5.442,47 26,48 12.708,49 8.182,50 9.106,51 7.529,52 5.425,53 5.736,54 2.452,55 4.826,56 2.247,57 24.513,58 821.761,59 2.427,60 2.427,61 2,62 0.759,63 -10.767,64 1.436,65 8.155}
{0 CHEMBL410744,1 0.037,2 3.886,3 6.887,4 7.129,5 4.872,6 7.181,7 7.097,8 1.091,9 0.181,10 6.275,11 6.591,12 0.977,13 5.347,14 6.169,15 7.256,16 8.347,17 19.833,18 11.761,19 23,20 6.358,21 77.36,22 288,23 0.1,24 6.586,25 68.145,26 7.929,27 7.929,28 61979,29 5.263,30 4.621,31 1.727,32 1.727,33 2.799,34 4.129,35 25.332,36 5.404,37 447.462,38 233.329,39 72.7,40 0.097,41 16.597,42 17.773,43 18.948,44 7.287,45 9.172,46 5.357,47 27,48 12.217,49 8.182,50 9.112,51 7.518,52 5.375,53 5.847,54 5.093,55 4.767,56 2.243,57 24.551,58 763.312,59 2.387,60 2.387,61 2,62 0.756,63 -9.55,64 1.45,65 6.481}
{0 CHEMBL410745,1 0.032,2 3.894,3 7.325,4 7.689,5 5.012,6 8.24,7 7.945,8 1.057,9 0.158,10 6.541,11 6.911,12 0.963,13 5.771,14 6.169,15 7.256,16 8.347,17 22.833,18 13.454,19 29,20 6.491,21 87.692,22 329,23 0.087,24 6.706,25 78.813,26 8.933,27 8.933,28 86103,29 5.444,30 4.791,31 1.727,32 1.727,33 2.844,34 4.13,35 28.895,36 5.591,37 541.132,38 271.121,39 83.584,40 0.086,41 16.638,42 17.812,43 18.984,44 7.416,45 9.299,46 5.714,47 33,48 13.89,49 8.313,50 9.241,51 7.647,52 5.652,53 6.047,54 5.093,55 4.878,56 2.521,57 27.861,58 850.016,59 2.663,60 2.663,61 3,62 0.713,63 -9.621,64 1.459,65 7.168}
{0 CHEMBL414564,1 0.02,2 3.89,3 6.907,4 7.263,5 5.019,6 7.638,7 7.409,8 1.154,9 0.125,10 6.284,11 6.598,12 1.044,13 5.724,14 2.622,15 2.809,16 3.011,17 24.2,18 13.06,19 30,20 6.515,21 90.436,22 337,23 0.082,24 6.652,25 81.454,26 8.023,27 8.023,28 109331,29 5.347,30 4.89,31 1.151,32 1.151,33 2.813,34 3.981,35 30.897,36 5.668,37 566.57,38 292.423,39 88.042,40 0.081,41 16.349,42 17.506,43 18.662,44 7.424,45 9.271,46 5.666,47 32,48 15.961,49 8.303,50 9.215,51 7.659,52 5.598,53 5.894,54 2.452,55 4.923,56 2.394,57 29.237,58 906.606,59 2.533,60 2.533,61 4,62 0.693,63 -10.812,64 1.429,65 7.137}
{0 CHEMBL424363,1 0.102,2 2.65,3 5.882,4 5.87,5 4.117,6 5.468,7 5.725,8 0.833,9 0.484,10 5.464,11 5.718,12 0.733,13 3.871,14 8.615,15 10.266,16 11.94,17 10,18 7.99,19 9,20 5.565,21 37.067,22 130,23 0.205,24 5.713,25 32.903,26 2.78,27 2.78,28 8580,29 4.457,30 3.093,31 2.341,32 2.341,33 1.621,34 3.961,35 13.273,36 4.422,37 165.458,38 98.107,39 34.074,40 0.194,41 15.544,42 16.727,43 17.905,44 6.457,45 8.312,46 4.094,47 11,48 7.118,49 7.343,50 8.248,51 6.681,52 4.263,53 5,54 7.005,55 3.852,56 0.894,57 12.77,58 333.333,59 1.143,60 1.143,61 3,62 2.042,64 1.431,65 6.027}
{0 CHEMBL428633,1 0.072,2 3.144,3 6.1,4 6.246,5 4.263,6 6.309,7 6.29,8 0.974,9 0.31,10 5.551,11 5.848,12 0.905,13 4.043,14 6.162,15 7.253,16 8.346,17 11,18 8.44,19 9,20 5.645,21 39.544,22 141,23 0.196,24 6.001,25 35.922,26 3.117,27 3.117,28 9215,29 4.525,30 3.695,31 1.727,32 1.727,33 2.136,34 4.016,35 12.917,36 4.495,37 181.075,38 102.042,39 36.685,40 0.186,41 16.024,42 17.2,43 18.373,44 6.567,45 8.451,46 4.234,47 11,48 6.681,49 7.44,50 8.364,51 6.81,52 4.394,53 5.096,54 5.074,55 3.973,56 0.712,57 14.314,58 336.656,59 1.188,60 1.188,61 7,62 1.82,63 -4.111,64 1.497,65 7.149}
{0 CHEMBL429090,1 0.077,2 2.903,3 5.967,4 6.21,5 4.196,6 6.333,7 6.346,8 0.786,9 0.413,10 5.353,11 5.649,12 0.631,13 3.892,14 7.7,15 9.083,16 10.483,17 11.867,18 8.572,19 11,20 5.609,21 39.653,22 136,23 0.163,24 5.651,25 37.049,26 3.417,27 3.417,28 16222,29 4.496,30 3.349,31 2.071,32 2.071,33 1.861,34 3.897,35 16.115,36 4.666,37 188.783,38 122.211,39 38.005,40 0.151,41 14.379,42 15.465,43 16.522,44 6.438,45 8.191,46 4.025,47 11,48 10.709,49 7.258,50 8.098,51 6.676,52 4.078,53 5.004,54 6.342,55 3.79,56 0.965,57 14.657,58 383.327,59 1.495,60 1.495,61 4,62 2.508,64 1.372,65 5.301}
{0 CHEMBL429702,1 0.023,2 3.89,3 6.863,4 7.171,5 4.884,6 7.37,7 7.255,8 1.199,9 0.129,10 6.154,11 6.551,12 1.091,13 5.485,14 2.622,15 2.809,16 3.011,17 20.8,18 11.588,19 24,20 6.389,21 79.921,22 297,23 0.095,24 6.552,25 70.239,26 8.016,27 8.016,28 74152,29 5.211,30 4.721,31 1.151,32 1.151,33 2.816,34 3.978,35 26.621,36 5.465,37 470.927,38 247.133,39 76.954,40 0.094,41 16.34,42 17.498,43 18.657,44 7.31,45 9.169,46 5.489,47 26,48 13.171,49 8.198,50 9.121,51 7.543,52 5.46,53 5.764,54 2.452,55 4.839,56 2.249,57 25.22,58 826.916,59 2.45,60 2.45,61 3,62 0.83,63 -10.765,64 1.433,65 7.018}
{0 CHEMBL437376,1 0.094,2 3.082,3 6.151,4 6.261,5 4.2,6 6.291,7 6.313,8 0.801,9 0.623,10 5.627,11 5.92,12 0.679,13 4.143,14 8.615,15 10.266,16 11.94,17 11,18 8.528,19 9,20 5.652,21 40.73,22 142,23 0.189,24 5.804,25 35.577,26 3.202,27 3.202,28 10114,29 4.557,30 3.349,31 2.341,32 2.341,33 2.063,34 3.968,35 14.307,36 4.551,37 190.044,38 110.039,39 37.056,40 0.179,41 15.585,42 16.768,43 17.945,44 6.55,45 8.402,46 4.304,47 11,48 7.818,49 7.44,50 8.348,51 6.772,52 4.431,53 5.105,54 7.005,55 3.979,56 1.176,57 14.394,58 362.848,59 1.239,60 1.239,61 1,62 2.04,64 1.423,65 4.174}
{0 CHEMBL441190,1 0.021,2 3.891,3 7.018,4 7.446,5 4.991,6 7.97,7 7.672,8 1.179,9 0.13,10 6.306,11 6.652,12 1.063,13 5.759,14 2.622,15 2.809,16 3.011,17 23.2,18 13.021,19 30,20 6.491,21 87.82,22 329,23 0.085,24 6.632,25 78.845,26 8.069,27 8.069,28 98201,29 5.338,30 4.857,31 1.151,32 1.151,33 2.815,34 3.98,35 29.483,36 5.615,37 545.897,38 278.193,39 85.537,40 0.084,41 16.348,42 17.505,43 18.661,44 7.405,45 9.258,46 5.704,47 32,48 14.742,49 8.289,50 9.206,51 7.64,52 5.638,53 5.9,54 2.452,55 4.908,56 2.259,57 27.823,58 903.17,59 2.611,60 2.611,61 3,62 0.706,63 -10.812,64 1.434,65 7.347}
{0 CHEMBL443417,1 0.094,2 3.054,3 6.206,4 6.467,5 4.145,6 6.729,7 6.676,8 0.86,9 0.434,10 5.541,11 5.884,12 0.747,13 3.97,14 8.526,15 10.216,16 11.912,17 11.067,18 8.844,19 11,20 5.58,21 37.752,22 132,23 0.179,24 5.655,25 34.804,26 2.837,27 2.837,28 10829,29 4.55,30 3.387,31 2.341,32 2.341,33 2.003,34 3.929,35 14.258,36 4.551,37 180.823,38 110.039,39 36.357,40 0.167,41 14.652,42 15.756,43 16.838,44 6.435,45 8.228,46 4.143,47 11,48 8.666,49 7.283,50 8.147,51 6.671,52 4.205,53 5.09,54 6.85,55 3.798,56 0.894,57 14.035,58 358.234,59 1.239,60 1.239,61 1,62 1.993,64 1.392,65 4.892}
{0 CHEMBL443556,1 0.084,2 3.22,3 6.192,4 6.348,5 4.382,6 6.497,7 6.463,8 0.806,9 0.503,10 5.619,11 5.947,12 0.736,13 4.913,14 8.633,15 10.274,16 11.943,17 13.667,18 8.664,19 12,20 5.911,21 49.186,22 184,23 0.183,24 6.225,25 40.521,26 4.831,27 4.831,28 13046,29 4.666,30 4.409,31 2.341,32 2.341,33 2.182,34 4.053,35 15.264,36 4.672,37 230.605,38 120.211,39 44.269,40 0.159,41 17.297,42 18.593,43 19.889,44 6.872,45 8.849,46 4.934,47 14,48 6.764,49 7.824,50 8.793,51 7.102,52 4.913,53 5.138,54 7.046,55 4.465,56 1.254,57 17.861,58 414.8,59 1.686,60 1.686,61 3,62 1.357,64 1.447,65 5.509}
{0 CHEMBL444502,1 0.102,2 2.958,3 5.998,4 6.282,5 4.071,6 6.572,7 6.541,8 0.835,9 0.397,10 5.384,11 5.668,12 0.736,13 3.807,14 8.526,15 10.216,16 11.912,17 10.233,18 8.685,19 11,20 5.476,21 34.194,22 119,23 0.192,24 5.56,25 32.402,26 2.197,27 2.197,28 9196,29 4.45,30 3.088,31 2.341,32 2.341,33 1.915,34 3.926,35 12.888,36 4.426,37 155.419,38 98.107,39 33.532,40 0.178,41 14.377,42 15.467,43 16.528,44 6.319,45 8.093,46 3.951,47 11,48 7.805,49 7.149,50 7.998,51 6.561,52 3.97,53 4.983,54 6.849,55 3.607,56 0.812,57 12.705,58 316.688,59 0.968,60 0.968,61 1,62 1.978,64 1.409,65 4.369}
{0 CHEMBL444916,1 0.06,2 3.854,3 7.016,4 7.272,5 4.886,6 7.409,7 7.32,8 0.816,9 0.294,10 6.358,11 6.712,12 0.819,13 5.472,14 11.516,15 13.676,16 15.839,17 20.633,18 11.97,19 23,20 6.399,21 80.891,22 300,23 0.099,24 6.54,25 70.168,26 8.016,27 8.016,28 68035,29 5.321,30 4.689,31 2.95,32 2.95,33 2.737,34 4.117,35 26.367,36 5.469,37 476.219,38 243.133,39 74.828,40 0.095,41 16.185,42 17.327,43 18.467,44 7.328,45 9.213,46 5.472,47 27,48 12.769,49 8.225,50 9.156,51 7.559,52 5.46,53 5.924,54 9.362,55 4.804,56 2.423,57 26.053,58 794.84,59 2.45,60 2.45,61 2,62 0.83,64 1.432,65 6.086}
{0 CHEMBL446927,1 0.063,2 3.851,3 6.901,4 7.149,5 4.842,6 7.236,7 7.134,8 0.833,9 0.307,10 6.284,11 6.602,12 0.825,13 5.347,14 11.516,15 13.676,16 15.839,17 19.633,18 11.773,19 23,20 6.358,21 77.36,22 288,23 0.103,24 6.499,25 67.355,26 7.929,27 7.929,28 62051,29 5.284,30 4.623,31 2.95,32 2.95,33 2.735,34 4.117,35 25.021,36 5.404,37 447.462,38 229.329,39 72.127,40 0.099,41 16.166,42 17.309,43 18.449,44 7.287,45 9.172,46 5.357,47 27,48 11.942,49 8.182,50 9.112,51 7.518,52 5.375,53 5.878,54 9.362,55 4.754,56 2.238,57 24.423,58 774.136,59 2.387,60 2.387,61 1,62 0.756,64 1.433,65 6.456}
{0 CHEMBL476562,1 0.113,2 3.356,3 5.968,4 6.019,5 4.283,6 5.991,7 6.031,8 0.694,9 0.475,10 5.489,11 5.763,12 0.775,13 4.205,14 11.516,15 13.676,16 15.839,17 11.633,18 8.324,19 9,20 5.733,21 42.713,22 154,23 0.185,24 5.998,25 37.426,26 3.397,27 3.397,28 13473,29 4.567,30 3.894,31 2.95,32 2.95,33 2.324,34 4.106,35 13.747,36 4.618,37 202.597,38 112.096,39 39.258,40 0.178,41 15.828,42 16.986,43 18.143,44 6.668,45 8.568,46 4.331,47 11,48 7.091,49 7.531,50 8.466,51 6.921,52 4.419,53 5.161,54 9.361,55 4.187,56 1.086,57 15.16,58 441.163,59 1.412,60 1.412,61 1,62 1.937,64 1.439,65 4.74}
{0 CHEMBL476563,1 0.102,2 3.313,3 6.4,4 6.755,5 4.34,6 6.878,7 6.721,8 0.858,9 0.275,10 5.687,11 6.036,12 0.917,13 4.86,14 11.511,15 13.675,16 15.838,17 12.3,18 9.527,19 14,20 5.855,21 47.005,22 174,23 0.166,24 5.973,25 41.067,26 4.713,27 4.713,28 17348,29 4.717,30 3.892,31 2.95,32 2.95,33 2.203,34 4.105,35 14.986,36 4.727,37 232.68,38 124.382,39 44.785,40 0.16,41 15.324,42 16.413,43 17.496,44 6.786,45 8.661,46 4.86,47 16,48 7.102,49 7.656,50 8.587,51 7.033,52 4.868,53 5.341,54 9.348,55 4.203,56 1.236,57 15.207,58 498.257,59 1.591,60 1.591,62 1.577,64 1.416,65 4}
{0 CHEMBL477,1 0.05,2 2.481,3 6.332,4 6.677,5 3.976,6 6.661,7 6.592,8 1.141,9 0.099,10 5.621,11 5.972,12 1.153,13 4.304,14 1.383,15 1.444,16 1.506,17 8.333,18 8.762,19 14,20 5.549,21 34.524,22 128,23 0.221,24 5.512,25 29.332,26 2.924,27 2.924,28 5576,29 4.563,30 2.423,31 1.041,32 1.041,33 1.413,34 3.902,35 11.607,36 4.222,37 148.249,38 80.711,39 32.339,40 0.218,41 14.77,42 15.865,43 16.952,44 6.46,45 8.321,46 4.454,47 16,48 4.573,49 7.372,50 8.289,51 6.676,52 4.533,53 5.169,54 1.324,55 3.65,56 0.535,57 9.787,58 331.276,59 1.04,60 1.04,62 0.92,64 1.397,65 4}
{0 CHEMBL486325,1 0.102,2 3.018,3 5.999,4 6.294,5 4.071,6 6.571,7 6.468,8 0.835,9 0.397,10 5.404,11 5.672,12 0.736,13 3.784,14 8.526,15 10.216,16 11.912,17 10.233,18 8.724,19 11,20 5.476,21 34.161,22 119,23 0.192,24 5.56,25 32.432,26 1.97,27 1.97,28 8980,29 4.45,30 3.144,31 2.341,32 2.341,33 1.98,34 3.928,35 12.888,36 4.427,37 156.329,38 98.107,39 33.548,40 0.178,41 14.401,42 15.495,43 16.562,44 6.319,45 8.093,46 3.912,47 11,48 7.805,49 7.151,50 8,51 6.561,52 3.989,53 4.983,54 6.849,55 3.599,56 0.792,57 12.705,58 316.688,59 0.877,60 0.877,61 1,62 1.978,64 1.41,65 4.682}
{0 CHEMBL487564,1 0.09,2 3.066,3 6.319,4 6.578,5 4.206,6 6.815,7 6.747,8 0.855,9 0.417,10 5.613,11 5.989,12 0.75,13 4.06,14 8.526,15 10.216,16 11.912,17 11.567,18 8.899,19 11,20 5.645,21 40.333,22 141,23 0.177,24 5.756,25 36.493,26 2.876,27 2.876,28 11498,29 4.626,30 3.447,31 2.341,32 2.341,33 2.039,34 3.949,35 14.73,36 4.609,37 195.412,38 116.096,39 38.166,40 0.167,41 15.089,42 16.226,43 17.351,44 6.515,45 8.334,46 4.22,47 11,48 8.835,49 7.377,50 8.257,51 6.746,52 4.317,53 5.174,54 6.85,55 3.919,56 0.934,57 14.958,58 370.234,59 1.239,60 1.239,61 1,62 1.976,64 1.404,65 4}
{0 CHEMBL487565,1 0.094,2 3.054,3 6.206,4 6.467,5 4.145,6 6.729,7 6.676,8 0.86,9 0.434,10 5.541,11 5.884,12 0.747,13 3.97,14 8.526,15 10.216,16 11.912,17 11.067,18 8.844,19 11,20 5.58,21 37.752,22 132,23 0.179,24 5.655,25 34.804,26 2.837,27 2.837,28 10829,29 4.55,30 3.387,31 2.341,32 2.341,33 2.003,34 3.929,35 14.258,36 4.551,37 180.823,38 110.039,39 36.357,40 0.167,41 14.652,42 15.756,43 16.838,44 6.435,45 8.228,46 4.143,47 11,48 8.666,49 7.283,50 8.147,51 6.671,52 4.205,53 5.09,54 6.85,55 3.798,56 0.894,57 14.035,58 358.234,59 1.239,60 1.239,61 1,62 1.993,64 1.392,65 4.012}
{0 CHEMBL504308,1 0.096,2 2.312,3 5.806,4 5.708,5 3.893,6 4.619,7 5.363,8 0.908,9 0.358,10 5.43,11 5.669,12 0.842,13 2.89,14 6.162,15 7.253,16 8.346,17 7.667,18 7.505,19 9,20 5.38,21 30.284,22 108,23 0.262,24 5.551,25 25.748,26 1.554,27 1.554,28 3701,29 4.385,30 0.662,31 1.727,32 1.727,33 1.275,34 3.955,35 10.368,36 4.058,37 122.547,38 69.487,39 26.988,40 0.248,41 15.536,42 16.72,43 17.9,44 6.297,45 8.19,46 3.526,47 11,48 4.547,49 7.212,50 8.135,51 6.512,52 3.951,53 4.958,54 5.076,55 3.702,56 0.389,57 9.74,58 274.182,59 0.761,60 0.761,61 1,62 1.363,64 1.43,65 4.812}
{0 CHEMBL508103,1 0.063,2 3.852,3 6.673,4 6.995,5 4.811,6 7.107,7 6.987,8 0.908,9 0.26,10 6.048,11 6.385,12 0.903,13 5.361,14 11.511,15 13.675,16 15.838,17 19.767,18 11.32,19 24,20 6.347,21 76.377,22 285,23 0.103,24 6.419,25 66.631,26 7.929,27 7.929,28 65769,29 5.175,30 4.645,31 2.95,32 2.95,33 2.734,34 4.115,35 25.017,36 5.4,37 442.188,38 229.329,39 73.063,40 0.099,41 15.711,42 16.798,43 17.879,44 7.268,45 9.126,46 5.375,47 26,48 12.24,49 8.155,50 9.075,51 7.502,52 5.375,53 5.731,54 9.349,55 4.777,56 2.235,57 24.184,58 774.167,59 2.387,60 2.387,61 2,62 0.756,64 1.418,65 4.627}
{0 CHEMBL510826,1 0.055,2 3.857,3 7.335,4 7.701,5 4.986,6 8.26,7 7.961,8 0.806,9 0.267,10 6.548,11 6.919,12 0.816,13 5.771,14 11.516,15 13.676,16 15.839,17 22.633,18 13.464,19 29,20 6.491,21 87.692,22 329,23 0.09,24 6.63,25 78.023,26 8.933,27 8.933,28 86187,29 5.461,30 4.792,31 2.95,32 2.95,33 2.742,34 4.118,35 28.584,36 5.591,37 541.132,38 267.121,39 82.998,40 0.086,41 16.23,42 17.371,43 18.506,44 7.416,45 9.299,46 5.714,47 33,48 13.615,49 8.313,50 9.241,51 7.647,52 5.652,53 6.072,54 9.362,55 4.866,56 2.521,57 27.732,58 860.84,59 2.663,60 2.663,61 2,62 0.713,64 1.445,65 6.18}
{0 CHEMBL561640,1 0.102,2 2.459,3 5.037,4 5.202,5 3.868,6 5.154,7 5.104,8 0.708,9 0.306,10 5.2,11 4.911,12 0.616,13 3.219,14 7.174,15 8.557,16 9.952,17 9.281,18 7.956,19 12,20 5.323,21 29.753,22 102,23 0.205,24 5.252,25 27.28,26 2.275,27 2.275,28 6202,29 4.277,30 2.984,31 2.03,32 2.03,33 1.433,34 3.855,35 10.98,36 4.221,37 125.765,38 72.711,39 29.308,40 0.182,41 13.227,42 14.25,43 15.175,44 6.146,45 7.946,46 3.296,47 12,48 6.479,49 6.954,50 7.777,51 6.425,52 3.497,53 4.71,54 5.814,55 3.315,56 0.281,57 11.224,58 272.116,59 1,60 1,62 0.644,64 1.364,65 4.301}
{0 CHEMBL603997,1 0.024,2 3.887,3 6.658,4 6.977,5 4.85,6 7.067,7 6.962,8 1.2,9 0.135,10 6.034,11 6.372,12 1.075,13 5.361,14 2.622,15 2.809,16 3.011,17 19.9,18 11.302,19 24,20 6.347,21 76.377,22 285,23 0.099,24 6.528,25 67.733,26 7.929,27 7.929,28 65977,29 5.152,30 4.658,31 1.151,32 1.151,33 2.799,34 3.991,35 25.328,36 5.4,37 442.188,38 233.329,39 73.631,40 0.097,41 16.343,42 17.501,43 18.66,44 7.268,45 9.126,46 5.375,47 26,48 12.532,49 8.155,50 9.075,51 7.502,52 5.375,53 5.695,54 2.452,55 4.792,56 2.236,57 24.143,58 779.395,59 2.387,60 2.387,61 3,62 0.756,63 -10.702,64 1.441,65 6.451}
{0 CHEMBL605452,1 0.024,2 3.888,3 6.658,4 6.977,5 4.872,6 7.067,7 6.962,8 1.201,9 0.135,10 6.034,11 6.372,12 1.072,13 5.361,14 2.622,15 2.809,16 3.011,17 20.622,18 11.302,19 24,20 6.347,21 76.377,22 285,23 0.099,24 6.561,25 68.626,26 7.929,27 7.929,28 65977,29 5.152,30 4.796,31 1.151,32 1.151,33 2.8,34 4.074,35 25.328,36 5.4,37 442.188,38 233.329,39 73.631,40 0.097,41 16.39,42 17.549,43 18.706,44 7.268,45 9.126,46 5.375,47 26,48 12.625,49 8.155,50 9.075,51 7.502,52 5.375,53 5.695,54 2.452,55 4.968,56 2.236,57 25.04,58 775.595,59 2.387,60 2.387,61 1,62 0.756,63 -10.687,64 1.46,65 6.411}
{0 CHEMBL605601,1 0.031,2 3.886,3 6.673,4 6.992,5 4.892,6 7.099,7 6.988,8 1.08,9 0.191,10 6.043,11 6.385,12 0.969,13 5.46,14 4.92,15 5.696,16 6.494,17 20.538,18 11.32,19 24,20 6.428,21 81.809,22 309,23 0.104,24 6.617,25 70.771,26 7.934,27 7.934,28 73177,29 5.24,30 4.793,31 1.51,32 1.51,33 2.799,34 4.126,35 26.344,36 5.463,37 481.972,38 245.133,39 78.099,40 0.093,41 17.306,42 18.589,43 19.878,44 7.351,45 9.265,46 5.481,47 26,48 12.574,49 8.263,50 9.186,51 7.598,52 5.447,53 5.708,54 4.185,55 4.843,56 2.238,57 24.861,58 852.216,59 2.39,60 2.39,61 2,62 0.762,63 -12.8,64 1.444,65 6.523}
{0 CHEMBL605602,1 0.024,2 3.886,3 6.658,4 6.977,5 4.841,6 7.067,7 6.962,8 1.157,9 0.135,10 6.034,11 6.372,12 1.049,13 5.361,14 2.622,15 2.809,16 3.011,17 19.967,18 11.302,19 24,20 6.347,21 76.377,22 285,23 0.099,24 6.513,25 67.426,26 7.929,27 7.929,28 65697,29 5.152,30 4.651,31 1.151,32 1.151,33 2.799,34 4.128,35 25.328,36 5.4,37 442.188,38 233.329,39 73.631,40 0.097,41 16.324,42 17.483,43 18.642,44 7.268,45 9.126,46 5.375,47 26,48 12.516,49 8.155,50 9.075,51 7.502,52 5.375,53 5.695,54 2.452,55 4.79,56 2.236,57 24.312,58 763.344,59 2.387,60 2.387,61 2,62 0.756,63 -9.728,64 1.435,65 6.959}
{0 CHEMBL606280,1 0.024,2 3.888,3 6.658,4 6.977,5 4.872,6 7.067,7 6.962,8 1.205,9 0.135,10 6.034,11 6.372,12 1.08,13 5.361,14 2.622,15 2.809,16 3.011,17 19.4,18 11.302,19 24,20 6.347,21 76.377,22 285,23 0.099,24 6.561,25 68.626,26 7.929,27 7.929,28 65977,29 5.152,30 4.605,31 1.151,32 1.151,33 2.8,34 3.973,35 25.328,36 5.4,37 442.188,38 233.329,39 73.631,40 0.097,41 16.39,42 17.549,43 18.706,44 7.268,45 9.126,46 5.375,47 26,48 12.301,49 8.155,50 9.075,51 7.502,52 5.375,53 5.695,54 2.452,55 4.725,56 2.236,57 23.327,58 797.359,59 2.387,60 2.387,61 1,62 0.756,63 -10.745,64 1.46,65 4.421}
{0 CHEMBL606286,1 0.024,2 3.887,3 6.658,4 6.977,5 4.863,6 7.067,7 6.962,8 1.22,9 0.135,10 6.034,11 6.372,12 1.081,13 5.361,14 2.622,15 2.809,16 3.011,17 20.522,18 11.302,19 24,20 6.347,21 76.377,22 285,23 0.099,24 6.544,25 68.311,26 7.929,27 7.929,28 66789,29 5.152,30 4.799,31 1.151,32 1.151,33 2.799,34 4.014,35 25.328,36 5.4,37 442.188,38 233.329,39 73.631,40 0.097,41 16.36,42 17.518,43 18.676,44 7.268,45 9.126,46 5.375,47 26,48 12.586,49 8.155,50 9.075,51 7.502,52 5.375,53 5.695,54 2.452,55 4.969,56 2.236,57 24.91,58 794.412,59 2.387,60 2.387,62 0.756,63 -10.713,64 1.453,65 7.345}
{0 CHEMBL608194,1 0.024,2 3.887,3 6.745,4 7.02,5 4.887,6 7.149,7 7.025,8 1.124,9 0.132,10 6.13,11 6.403,12 1.036,13 5.407,14 2.622,15 2.809,16 3.011,17 20.233,18 11.594,19 25,20 6.361,21 77.868,22 289,23 0.097,24 6.569,25 69.882,26 7.929,27 7.929,28 67116,29 5.171,30 4.608,31 1.151,32 1.151,33 2.799,34 4.128,35 25.905,36 5.434,37 455.859,38 240.215,39 74.71,40 0.095,41 16.379,42 17.538,43 18.695,44 7.279,45 9.147,46 5.398,47 27,48 12.787,49 8.163,50 9.081,51 7.519,52 5.389,53 5.712,54 2.452,55 4.727,56 2.236,57 24.372,58 744.127,59 2.388,60 2.388,61 5,62 0.748,63 -9.726,64 1.456,65 6.18}
{0 CHEMBL608195,1 0.033,2 3.886,3 6.953,4 7.204,5 4.96,6 7.271,7 7.191,8 1.053,9 0.216,10 6.32,11 6.645,12 0.956,13 5.318,14 6.169,15 7.256,16 8.347,17 22.333,18 12.417,19 23,20 6.435,21 84.537,22 311,23 0.091,24 6.65,25 75.061,26 7.929,27 7.929,28 88097,29 5.314,30 4.559,31 1.727,32 1.727,33 2.799,34 4.129,35 28.271,36 5.563,37 498.747,38 268.078,39 79.54,40 0.088,41 16.602,42 17.778,43 18.952,44 7.353,45 9.225,46 5.347,47 27,48 14.712,49 8.24,50 9.161,51 7.586,52 5.38,53 5.884,54 5.095,55 4.829,56 2.521,57 28.043,58 797.312,59 2.42,60 2.42,61 3,62 0.733,63 -9.313,64 1.443,65 6.481}
{0 CHEMBL65013,1 0.064,2 2.946,3 6.132,4 6.427,5 4.206,6 6.775,7 6.569,8 0.863,9 0.213,10 5.675,11 5.878,12 0.649,13 4.234,14 5.114,15 6.092,16 7.084,17 11.2,18 9.558,19 17,20 5.638,21 39.034,22 140,23 0.17,24 5.698,25 36.647,26 3.667,27 3.667,28 11156,29 4.708,30 3.268,31 1.656,32 1.656,33 1.899,34 3.904,35 14.104,36 4.557,37 186.051,38 108.039,39 38.204,40 0.157,41 14.477,42 15.559,43 16.61,44 6.5,45 8.304,46 4.205,47 17,48 7.298,49 7.34,50 8.206,51 6.739,52 4.248,53 5.286,54 4.165,55 3.764,56 0.921,57 13.368,58 382.165,59 1.494,60 1.494,61 7,62 0.757,64 1.41,65 7.26}
{0 CHEMBL866,1 0.098,2 3.079,3 6.073,4 6.192,5 4.181,6 6.182,7 6.23,8 0.834,9 0.577,10 5.563,11 5.848,12 0.751,13 4.007,14 8.615,15 10.266,16 11.94,17 10.5,18 8.44,19 9,20 5.617,21 39.267,22 137,23 0.196,24 5.789,25 34.689,26 3.137,27 3.137,28 9431,29 4.525,30 3.278,31 2.341,32 2.341,33 2.06,34 3.965,35 13.384,36 4.49,37 177.797,38 104.042,39 35.928,40 0.186,41 15.56,42 16.74,43 17.916,44 6.512,45 8.369,46 4.205,47 11,48 7.153,49 7.397,50 8.302,51 6.742,52 4.344,53 5.059,54 7.005,55 3.898,56 1.063,57 13.433,58 351.333,59 1.21,60 1.21,61 3,62 2.009,64 1.445,65 7.488}
{0 CHEMBL95601,1 0.038,2 2.948,3 6.735,4 7.108,5 4.319,6 7.474,7 7.202,8 0.853,9 0.137,10 6.072,11 6.396,12 0.628,13 4.673,14 1.603,15 1.663,16 1.734,17 11.7,18 11.016,19 20,20 5.765,21 42.503,22 159,23 0.161,24 5.868,25 40.6,26 3.668,27 3.668,28 12465,29 4.987,30 3.333,31 1.058,32 1.058,33 1.89,34 4.037,35 14.806,36 4.618,37 208.799,38 116.096,39 42.164,40 0.158,41 14.98,42 16.077,43 17.15,44 6.645,45 8.466,46 4.615,47 22,48 6.551,49 7.52,50 8.404,51 6.87,52 4.644,53 5.61,54 1.557,55 3.807,56 0.963,57 13.445,58 419.165,59 1.5,60 1.5,61 3,62 0.663,64 1.45,65 6}
