"molecule_id","FCFP4_1024b815","FCFP4_1024b1","FCFP4_1024b10","FCFP4_1024b100","FCFP4_1024b1000","FCFP4_1024b1001","FCFP4_1024b1002","FCFP4_1024b1003","FCFP4_1024b1004","FCFP4_1024b1005","FCFP4_1024b1006","FCFP4_1024b1007","FCFP4_1024b1008","FCFP4_1024b1009","FCFP4_1024b101","FCFP4_1024b1010","FCFP4_1024b1011","FCFP4_1024b1012","FCFP4_1024b1013","FCFP4_1024b1014","FCFP4_1024b1015","FCFP4_1024b1016","FCFP4_1024b1017","FCFP4_1024b1018","FCFP4_1024b1019","FCFP4_1024b102","FCFP4_1024b1020","FCFP4_1024b1021","FCFP4_1024b1022","FCFP4_1024b1023","FCFP4_1024b1024","FCFP4_1024b103","FCFP4_1024b104","FCFP4_1024b105","FCFP4_1024b106","FCFP4_1024b107","FCFP4_1024b108","FCFP4_1024b109","FCFP4_1024b11","FCFP4_1024b110","FCFP4_1024b111","FCFP4_1024b112","FCFP4_1024b113","FCFP4_1024b114","FCFP4_1024b115","FCFP4_1024b116","FCFP4_1024b117","FCFP4_1024b118","FCFP4_1024b119","FCFP4_1024b12","FCFP4_1024b120","pXC50"
{2 1,52 5.886}
{0 CHEMBL1204189,2 1,3 1,52 6}
{0 CHEMBL121053,1 1,2 1,33 1,49 1,52 8.563}
{0 CHEMBL140197,2 1,12 1,52 7.959}
{0 CHEMBL143210,2 1,16 1,24 1,25 1,52 4}
{0 CHEMBL144151,2 1,52 7}
{0 CHEMBL1629855,1 1,2 1,7 1,36 1,50 1,52 8}
{0 CHEMBL1629861,1 1,2 1,7 1,17 1,36 1,50 1,52 7.538}
{0 CHEMBL1629862,1 1,2 1,7 1,17 1,36 1,50 1,52 8.222}
{0 CHEMBL1629864,2 1,7 1,17 1,36 1,52 7.523}
{0 CHEMBL1629865,1 1,2 1,7 1,17 1,36 1,50 1,52 7.77}
{0 CHEMBL1629866,1 1,2 1,7 1,17 1,36 1,50 1,52 8.523}
{0 CHEMBL1631859,1 1,2 1,7 1,17 1,36 1,50 1,52 7.854}
{0 CHEMBL1684241,2 1,52 5}
{0 CHEMBL1730632,2 1,36 1,52 6.289}
{0 CHEMBL183956,1 1,2 1,49 1,52 7.055}
{0 CHEMBL185210,1 1,2 1,49 1,52 8.265}
{0 CHEMBL185822,1 1,2 1,49 1,52 7.173}
{0 CHEMBL186214,1 1,2 1,49 1,52 7.799}
{0 CHEMBL186453,1 1,2 1,49 1,52 4}
{0 CHEMBL186630,1 1,2 1,49 1,52 8.523}
{0 CHEMBL189814,1 1,2 1,49 1,52 8.321}
{0 CHEMBL2106523,2 1,52 7.42}
{0 CHEMBL2179629,2 1,7 1,8 1,16 1,52 4.523}
{0 CHEMBL2179646,2 1,7 1,16 1,20 1,52 4.523}
{0 CHEMBL259054,2 1,36 1,51 1,52 7.77}
{0 CHEMBL260636,2 1,36 1,51 1,52 7.481}
{0 CHEMBL261288,2 1,36 1,52 7.429}
{0 CHEMBL279956,2 1,8 1,27 1,52 4.398}
{0 CHEMBL280563,2 1,52 6.222}
{0 CHEMBL284193,2 1,52 6.611}
{0 CHEMBL30285,2 1,23 1,52 5}
{0 CHEMBL319279,2 1,52 6.903}
{0 CHEMBL319732,2 1,52 6.914}
{0 CHEMBL325140,2 1,52 7.125}
{0 CHEMBL329920,2 1,52 7}
{0 CHEMBL333519,1 1,2 1,49 1,52 7.236}
{0 CHEMBL334014,1 1,2 1,52 7.262}
{0 CHEMBL334160,2 1,52 7.42}
{0 CHEMBL33567,2 1,52 4}
{0 CHEMBL34453,2 1,52 5.097}
{0 CHEMBL357043,2 1,12 1,52 4}
{0 CHEMBL40086,2 1,49 1,52 5.77}
{0 CHEMBL405895,2 1,36 1,51 1,52 6.914}
{0 CHEMBL412445,2 1,52 4.167}
{0 CHEMBL420262,2 1,52 6}
{0 CHEMBL432038,2 1,52 7.822}
{0 CHEMBL434536,1 1,2 1,49 1,52 8.406}
{0 CHEMBL439775,2 1,52 7.119}
{0 CHEMBL538489,2 1,3 1,17 1,51 1,52 4.678}
{0 CHEMBL539516,2 1,3 1,17 1,52 4.638}
{0 CHEMBL539760,2 1,3 1,17 1,52 4.032}
{0 CHEMBL540015,2 1,3 1,17 1,52 4.569}
{0 CHEMBL543568,2 1,3 1,17 1,52 5.125}
{0 CHEMBL543811,2 1,3 1,17 1,52 4.432}
{0 CHEMBL544508,2 1,3 1,17 1,52 5.167}
{0 CHEMBL552984,2 1,3 1,17 1,52 4.114}
{0 CHEMBL556667,2 1,36 1,52 6.091}
{0 CHEMBL575060,2 1,52 5.523}
{0 CHEMBL76232,2 1,52 5.046}
{0 CHEMBL8759,2 1,52 7.237}
{0 CHEMBL95868,2 1,52 7.538}
{0 CHEMBL97200,2 1,52 7.398}
{0 CHEMBL97574,2 1,52 6}
{0 CHEMBL99462,2 1,52 6.708}
