{
  "data_set_description": {
    "collection_date": "November 2013",
    "creator": "Dr Jeremy Besnard, Dr Ivan Olier, Dr Noureddin Sadawi, Dr Larisa Soldatova, Dr Crina Grosan, Prof Ross King, Dr Richard Bickerton, Prof Andrew Hopkins and Dr Willem van Hoorn",
    "default_target_attribute": "pXC50",
    "description": "This dataset contains QSAR data (from ChEMBL version 17) showing activity values (unit is pseudo-pCI50) of several compounds on drug target ChEMBL_ID: CHEMBL3782 (TID: 10222), and it has 60 rows and 1235 features (not including molecule IDs and class feature: molecule_id and pXC50). The features represent Molecular Descriptors which were generated from SMILES strings. Missing value imputation was applied to this dataset (By choosing the Median).",
    "description_version": "1",
    "file_id": "3249093",
    "format": "ARFF",
    "id": "24580",
    "licence": "Public",
    "md5_checksum": "19a842861846c8ff058ad3a72ebab4a5",
    "minio_url": "https://data.openml.org/datasets/0002/24580/dataset_24580.pq",
    "name": "QSAR-DATASET-FOR-DRUG-TARGET-CHEMBL3782",
    "original_data_url": "https://www.ebi.ac.uk/chembl/target/inspect/CHEMBL3782",
    "parquet_url": "https://data.openml.org/datasets/0002/24580/dataset_24580.pq",
    "processing_date": "2018-10-03 22:52:43",
    "row_id_attribute": "molecule_id",
    "status": "deactivated",
    "tag": [
      "MetaQSAR",
      "study_13"
    ],
    "upload_date": "2016-07-14T14:58:02",
    "url": "https://api.openml.org/data/v1/download/3249093/QSAR-DATASET-FOR-DRUG-TARGET-CHEMBL3782.arff",
    "version": "7",
    "visibility": "public"
  }
}