"molecule_id","AMW","C.","H.","Me","Mi","Mp","Mv","MW","N.","nAB","nAT","nB","nBM","nBO","nBR","nBT","nC","nCL","nCsp","nCsp2","nCsp3","nDB","nF","nH","nHet","nHM","nI","nN","nO","nP","nS","nSK","nTB","nX","O.","RBF","RBN","SCBO","Se","Si","Sp","Sv","X.","pXC50"
{1 8.709,2 36.7,3 36.7,4 1.038,5 1.146,6 0.656,7 0.661,8 261.27,9 16.7,10 12,11 30,13 14,14 20,16 31,17 11,20 10,21 1,22 2,24 11,25 8,28 5,29 3,32 19,35 10,36 0.129,37 4,38 28,39 31.142,40 34.365,41 19.676,42 19.832,44 5.886}
{0 CHEMBL129850,1 8.009,2 33.3,3 50,4 1.011,5 1.138,6 0.639,7 0.599,8 672.72,9 6,10 15,11 84,13 15,14 45,15 1,16 87,17 28,20 9,21 19,24 42,25 14,26 2,28 5,29 7,31 1,32 42,34 1,35 8.3,36 0.207,37 18,38 52.5,39 84.894,40 95.608,41 53.677,42 50.332,43 1.2,44 7.523}
{0 CHEMBL131351,1 9.86,2 33.3,3 40.7,4 1.038,5 1.138,6 0.668,7 0.649,8 532.42,9 9.3,10 15,11 54,13 15,14 35,15 1,16 57,17 18,20 9,21 9,24 22,25 14,26 2,28 5,29 7,31 1,32 32,34 1,35 13,36 0.14,37 8,38 42.5,39 56.058,40 61.456,41 36.063,42 35.064,43 1.9,44 6.167}
{0 CHEMBL131510,1 8.265,2 33.3,3 48.7,4 1.014,5 1.138,6 0.643,7 0.606,8 644.66,9 6.4,10 15,11 78,13 15,14 43,15 1,16 81,17 26,20 9,21 17,24 38,25 14,26 2,28 5,29 7,31 1,32 40,34 1,35 9,36 0.198,37 16,38 50.5,39 79.127,40 88.777,41 50.154,42 47.278,43 1.3,44 7.523}
{0 CHEMBL134079,1 9.341,2 33.3,3 43.3,4 1.03,5 1.138,6 0.66,7 0.635,8 560.48,9 8.3,10 15,11 60,13 15,14 37,15 1,16 63,17 20,20 9,21 11,24 26,25 14,26 2,28 5,29 7,31 1,32 34,34 1,35 11.7,36 0.159,37 10,38 44.5,39 61.825,40 68.286,41 39.585,42 38.118,43 1.7,44 6.347}
{0 CHEMBL146469,1 9.043,2 34.5,3 34.5,4 1.047,5 1.153,6 0.652,7 0.666,8 262.26,9 20.7,10 12,11 29,13 14,14 20,16 30,17 10,20 9,21 1,22 2,24 10,25 9,28 6,29 3,32 19,35 10.3,36 0.133,37 4,38 28,39 30.36,40 33.448,41 18.921,42 19.326,44 5.721}
{0 CHEMBL146734,1 8.143,2 36.7,3 40,4 1.02,5 1.148,6 0.659,7 0.647,8 244.29,9 20,10 11,11 30,13 12,14 20,16 32,17 11,20 9,21 2,22 1,24 12,25 7,28 6,29 1,32 18,35 3.3,36 0.094,37 3,38 26.5,39 30.589,40 34.445,41 19.773,42 19.424,44 6.793}
{0 CHEMBL146768,1 8.331,2 35.7,3 39.3,4 1.029,5 1.148,6 0.651,7 0.647,8 233.26,9 17.9,10 10,11 28,13 11,14 19,16 30,17 10,20 8,21 2,22 1,24 11,25 7,28 5,29 2,32 17,35 7.1,36 0.1,37 3,38 25,39 28.814,40 32.156,41 18.222,42 18.117,44 6.921}
{0 CHEMBL146769,1 11.722,2 35.7,3 35.7,4 1.028,5 1.132,6 0.742,7 0.701,8 328.22,9 17.9,10 10,11 28,13 11,14 20,15 1,16 30,17 10,20 8,21 2,22 1,24 10,25 8,26 2,28 5,29 1,31 1,32 18,34 1,35 3.6,36 0.1,37 3,38 26,39 28.793,40 31.708,41 20.767,42 19.615,43 3.6,44 8.151}
{0 CHEMBL146977,1 8.143,2 36.7,3 40,4 1.02,5 1.148,6 0.659,7 0.647,8 244.29,9 20,10 11,11 30,13 12,14 20,16 32,17 11,20 9,21 2,22 1,24 12,25 7,28 6,29 1,32 18,35 3.3,36 0.094,37 3,38 26.5,39 30.589,40 34.445,41 19.773,42 19.424,44 4.456}
{0 CHEMBL147472,1 7.977,2 32.3,3 41.9,4 1.022,5 1.159,6 0.638,7 0.627,8 247.3,9 22.6,10 10,11 31,13 11,14 20,16 33,17 10,20 7,21 3,22 1,24 13,25 8,28 7,29 1,32 18,35 3.2,36 0.091,37 3,38 26,39 31.691,40 35.943,41 19.779,42 19.445,44 4.678}
{0 CHEMBL149722,1 9.078,2 37.9,3 34.5,4 1.046,5 1.155,6 0.661,7 0.672,8 263.26,9 17.2,10 12,11 29,13 13,14 20,16 30,17 11,20 10,21 1,22 1,23 1,24 10,25 8,28 5,29 2,32 19,34 1,35 6.9,36 0.133,37 4,38 27,39 30.327,40 33.496,41 19.159,42 19.5,43 3.4,44 7.292}
{0 CHEMBL150324,1 9.271,2 33.3,3 37,4 1.029,5 1.146,6 0.691,7 0.67,8 250.32,9 22.2,10 10,11 27,13 11,14 19,16 29,17 9,20 7,21 2,22 1,24 10,25 8,26 1,28 6,29 1,31 1,32 17,35 3.7,36 0.103,37 3,38 25,39 27.782,40 30.95,41 18.659,42 18.084,44 7.155}
{0 CHEMBL150427,1 8.676,2 33.3,3 37,4 1.038,5 1.157,6 0.647,7 0.652,8 234.25,9 22.2,10 10,11 27,13 11,14 19,16 29,17 9,20 7,21 2,22 1,24 10,25 8,28 6,29 2,32 17,35 7.4,36 0.103,37 3,38 25,39 28.033,40 31.239,41 17.466,42 17.612,44 6.557}
{0 CHEMBL150918,1 8.736,2 36.4,3 36.4,4 1.038,5 1.147,6 0.657,7 0.662,8 288.3,9 18.2,10 11,11 33,13 12,14 24,16 36,17 12,20 9,21 3,22 1,24 12,25 9,28 6,29 3,32 21,35 9.1,36 0.083,37 3,38 30.5,39 34.244,40 37.864,41 21.682,42 21.853,44 6.638}
{0 CHEMBL151495,1 9.291,2 36.7,3 36.7,4 1.03,5 1.146,6 0.688,7 0.675,8 278.73,9 20,10 11,11 30,13 12,14 21,16 32,17 11,18 1,20 9,21 2,22 1,24 11,25 8,26 1,28 6,29 1,32 19,34 1,35 3.3,36 0.094,37 3,38 27.5,39 30.913,40 34.389,41 20.631,42 20.251,43 3.3,44 7.35}
{0 CHEMBL151552,1 10.773,2 36.7,3 36.7,4 1.027,5 1.143,6 0.704,7 0.682,8 323.18,9 20,10 11,11 30,13 12,14 21,15 1,16 32,17 11,20 9,21 2,22 1,24 11,25 8,26 1,28 6,29 1,32 19,34 1,35 3.3,36 0.094,37 3,38 27.5,39 30.818,40 34.286,41 21.125,42 20.449,43 3.3,44 6.651}
{0 CHEMBL151579,1 8.905,2 35.7,3 39.3,4 1.02,5 1.138,6 0.693,7 0.664,8 249.33,9 17.9,10 10,11 28,13 11,14 19,16 30,17 10,20 8,21 2,22 1,24 11,25 7,26 1,28 5,29 1,31 1,32 17,35 3.6,36 0.1,37 3,38 25,39 28.564,40 31.867,41 19.415,42 18.589,44 7.634}
{0 CHEMBL151784,1 8.396,2 35.5,3 38.7,4 1.03,5 1.15,6 0.652,7 0.65,8 260.29,9 19.4,10 11,11 31,13 13,14 21,16 33,17 11,20 9,21 2,22 2,24 12,25 8,28 6,29 2,32 19,35 6.5,36 0.091,37 3,38 28.5,39 31.916,40 35.654,41 20.227,42 20.138,44 5.561}
{0 CHEMBL151785,1 9.291,2 36.7,3 36.7,4 1.03,5 1.146,6 0.688,7 0.675,8 278.73,9 20,10 11,11 30,13 12,14 21,16 32,17 11,18 1,20 9,21 2,22 1,24 11,25 8,26 1,28 6,29 1,32 19,34 1,35 3.3,36 0.094,37 3,38 27.5,39 30.913,40 34.389,41 20.631,42 20.251,43 3.3,44 6.81}
{0 CHEMBL1683162,1 10.955,2 34.2,3 36.8,4 1.041,5 1.136,6 0.701,7 0.679,8 416.29,9 13.2,10 11,11 38,13 13,14 26,15 1,16 40,17 13,20 8,21 5,22 2,24 14,25 11,26 2,28 5,29 4,31 1,32 24,34 1,35 10.5,36 0.125,37 5,38 33.5,39 39.542,40 43.167,41 26.654,42 25.813,43 2.6,44 6}
{0 CHEMBL1683163,1 8.082,2 36.6,3 41.5,4 1.027,5 1.142,6 0.644,7 0.637,8 331.37,9 12.2,10 12,11 41,13 14,14 26,16 43,17 15,20 10,21 5,22 2,24 17,25 9,28 5,29 4,32 24,35 9.8,36 0.116,37 5,38 34,39 42.12,40 46.82,41 26.415,42 26.127,44 4.721}
{0 CHEMBL1683164,1 10.143,2 42.3,3 36.5,4 1.021,5 1.121,6 0.726,7 0.696,8 527.44,9 11.5,10 23,11 52,13 25,14 36,15 1,16 55,17 22,20 20,21 2,22 2,24 19,25 11,26 2,28 6,29 3,31 1,32 33,34 1,35 5.8,36 0.145,37 8,38 49.5,39 53.083,40 58.286,41 37.727,42 36.173,43 1.9,44 4.699}
{0 CHEMBL1683165,1 10.361,2 41.2,3 35.3,4 1.026,5 1.125,6 0.725,7 0.699,8 528.43,9 13.7,10 23,11 51,13 25,14 36,15 1,16 54,17 21,20 20,21 1,22 2,24 18,25 12,26 2,28 7,29 3,31 1,32 33,34 1,35 5.9,36 0.148,37 8,38 49.5,39 52.302,40 57.369,41 36.972,42 35.667,43 2,44 5.328}
{0 CHEMBL1683166,1 10.588,2 42,3 34,4 1.031,5 1.122,6 0.728,7 0.707,8 529.41,9 12,10 23,11 50,13 25,14 36,15 1,16 53,17 21,20 20,21 1,22 2,24 17,25 12,26 2,28 6,29 4,31 1,32 33,34 1,35 8,36 0.151,37 8,38 49.5,39 51.527,40 56.08,41 36.421,42 35.361,43 2,44 4.886}
{0 CHEMBL1683167,1 10.616,2 43.1,3 33.3,4 1.03,5 1.119,6 0.734,7 0.713,8 541.42,9 11.8,10 23,11 51,13 26,14 37,15 1,16 54,17 22,20 21,21 1,22 3,24 17,25 12,26 2,28 6,29 4,31 1,32 34,34 1,35 7.8,36 0.148,37 8,38 51.5,39 52.527,40 57.08,41 37.421,42 36.361,43 2,44 5.244}
{0 CHEMBL1683172,1 12.822,2 33.3,3 29.6,4 1.058,5 1.137,6 0.738,7 0.723,8 346.19,9 18.5,10 11,11 27,13 13,14 20,15 1,16 28,17 9,20 8,21 1,22 2,24 8,25 10,26 2,28 5,29 3,31 1,32 19,34 1,35 11.1,36 0.143,37 4,38 27.5,39 28.564,40 30.712,41 19.915,42 19.517,43 3.7,44 6.495}
{0 CHEMBL2171202,1 8.009,2 38.5,3 41,4 1.018,5 1.141,6 0.66,7 0.646,8 312.37,9 15.4,10 16,11 39,13 17,14 25,16 41,17 15,20 12,21 3,22 1,24 16,25 8,28 6,29 2,32 23,35 5.1,36 0.122,37 5,38 34,39 39.683,40 44.485,41 25.75,42 25.192,44 7.066}
{0 CHEMBL2171205,1 7.46,2 37.5,3 45,4 1.006,5 1.142,6 0.651,7 0.625,8 298.39,9 15,10 16,11 40,13 16,14 24,16 42,17 15,20 11,21 4,24 18,25 7,28 6,29 1,32 22,35 2.5,36 0.119,37 5,38 32,39 40.24,40 45.69,41 26.057,42 25.004,44 7.602}
{0 CHEMBL270483,1 9.01,2 38.1,3 33.3,4 1.034,5 1.148,6 0.678,7 0.683,8 189.2,9 23.8,10 10,11 21,13 11,14 15,16 22,17 8,19 2,20 5,21 1,24 7,25 6,28 5,29 1,32 14,33 1,35 4.8,36 0.091,37 2,38 22,39 21.72,40 24.116,41 14.244,42 14.349,44 4.924}
{0 CHEMBL270945,1 6.739,2 32.4,3 51.4,4 1.001,5 1.152,6 0.617,7 0.581,8 249.36,9 13.5,10 10,11 37,13 10,14 19,16 38,17 12,20 5,21 7,24 19,25 6,28 5,29 1,32 18,35 2.7,36 0.184,37 7,38 24,39 37.022,40 42.607,41 22.813,42 21.509,44 4}
{0 CHEMBL270982,1 7.561,2 34.5,3 44.8,4 1.013,5 1.15,6 0.639,7 0.618,8 219.28,9 17.2,10 10,11 29,13 11,14 17,16 30,17 10,20 7,21 3,22 1,24 13,25 6,28 5,29 1,32 16,35 3.4,36 0.133,37 4,38 23,39 29.371,40 33.362,41 18.529,42 17.929,44 4.796}
{0 CHEMBL272182,1 7.135,2 37.5,3 47.5,4 1.001,5 1.14,6 0.645,7 0.613,8 285.39,9 12.5,10 10,11 40,13 12,14 23,16 42,17 15,20 9,21 6,22 2,24 19,25 6,28 5,29 1,32 21,35 2.5,36 0.095,37 4,38 30,39 40.022,40 45.607,41 25.813,42 24.509,44 5.585}
{0 CHEMBL272689,1 8.634,2 33.3,3 37.5,4 1.039,5 1.156,6 0.644,7 0.65,8 207.22,9 20.8,10 10,11 24,13 11,14 16,16 25,17 8,20 6,21 2,22 1,24 9,25 7,28 5,29 2,32 15,35 8.3,36 0.12,37 3,38 22,39 24.931,40 27.741,41 15.46,42 15.59,44 4.022}
{0 CHEMBL325053,1 8.314,2 34.8,3 39.1,4 1.026,5 1.154,6 0.652,7 0.647,8 191.22,9 21.7,10 10,11 23,13 11,14 15,16 24,17 8,20 7,21 1,22 1,24 9,25 6,28 5,29 1,32 14,35 4.3,36 0.125,37 3,38 21,39 23.604,40 26.531,41 15.006,42 14.875,44 5.292}
{0 CHEMBL333928,1 8.652,2 39.3,3 35.7,4 1.025,5 1.144,6 0.679,7 0.675,8 242.27,9 21.4,10 16,11 28,13 16,14 20,16 30,17 11,20 10,21 1,24 10,25 7,28 6,29 1,32 18,35 3.6,36 0.1,37 3,38 28,39 28.705,40 32.03,41 19.012,42 18.897,44 7.42}
{0 CHEMBL334050,1 8.101,2 42.4,3 39.4,4 1.011,5 1.132,6 0.683,7 0.665,8 267.32,9 15.2,10 16,11 33,13 17,14 22,16 35,17 14,20 13,21 1,22 1,24 13,25 6,28 5,29 1,32 20,35 3,36 0.114,37 4,38 31,39 33.371,40 37.362,41 22.529,42 21.929,44 4.402}
{0 CHEMBL336215,1 9.936,2 35.7,3 39.3,4 1.037,5 1.133,6 0.68,7 0.662,8 556.44,9 8.9,10 15,11 56,13 16,14 37,15 1,16 59,17 20,19 2,20 9,21 9,24 22,25 14,26 2,28 5,29 7,31 1,32 34,33 1,34 1,35 12.5,36 0.119,37 7,38 46.5,39 58.058,40 63.456,41 38.063,42 37.064,43 1.8,44 6.602}
{0 CHEMBL336404,1 7.851,2 35.1,3 43.9,4 1.029,5 1.142,6 0.628,7 0.621,8 447.5,9 8.8,10 16,11 57,13 16,14 35,16 60,17 20,20 11,21 9,24 25,25 12,28 5,29 7,32 32,35 12.3,36 0.133,37 8,38 43,39 58.636,40 65.109,41 35.824,42 35.379,44 4.602}
{0 CHEMBL336947,1 8.564,2 33.3,3 47.2,4 1.019,5 1.138,6 0.648,7 0.614,8 616.6,9 6.9,10 15,11 72,13 15,14 41,15 1,16 75,17 24,20 9,21 15,24 34,25 14,26 2,28 5,29 7,31 1,32 38,34 1,35 9.7,36 0.187,37 14,38 48.5,39 73.36,40 81.947,41 46.631,42 44.225,43 1.4,44 7.495}
{0 CHEMBL337677,1 10.143,2 39.1,3 30.4,4 1.035,5 1.132,6 0.734,7 0.719,8 233.28,9 21.7,10 15,11 23,13 15,14 18,16 25,17 9,20 9,24 7,25 7,26 1,28 5,29 1,31 1,32 16,35 4.3,36 0.08,37 2,38 25.5,39 23.796,40 26.036,41 16.892,42 16.536,44 8.523}
{0 CHEMBL337713,1 8.194,2 33.3,3 40.7,4 1.03,5 1.154,6 0.638,7 0.634,8 221.25,9 18.5,10 10,11 27,13 11,14 17,16 28,17 9,20 6,21 3,22 1,24 11,25 7,28 5,29 2,32 16,35 7.4,36 0.143,37 4,38 23,39 27.814,40 31.156,41 17.222,42 17.117,44 4.028}
{0 CHEMBL339016,1 8.917,2 33.3,3 45.5,4 1.024,5 1.138,6 0.653,7 0.624,8 588.54,9 7.6,10 15,11 66,13 15,14 39,15 1,16 69,17 22,20 9,21 13,24 30,25 14,26 2,28 5,29 7,31 1,32 36,34 1,35 10.6,36 0.174,37 12,38 46.5,39 67.592,40 75.117,41 43.108,42 41.171,43 1.5,44 6.347}
{0 CHEMBL339133,1 12.546,2 38.5,3 30.8,4 1.035,5 1.127,6 0.769,7 0.734,8 326.2,9 19.2,10 15,11 26,13 15,14 20,15 1,16 28,17 10,20 9,21 1,24 8,25 8,26 2,28 5,29 1,31 1,32 18,34 1,35 3.8,36 0.107,37 3,38 27.5,39 26.909,40 29.293,41 20.006,42 19.088,43 3.8,44 8.285}
{0 CHEMBL342497,1 8.143,2 36.7,3 40,4 1.02,5 1.148,6 0.659,7 0.647,8 244.29,9 20,10 11,11 30,13 12,14 20,16 32,17 11,20 9,21 2,22 1,24 12,25 7,28 6,29 1,32 18,35 3.3,36 0.094,37 3,38 26.5,39 30.589,40 34.445,41 19.773,42 19.424,44 6.513}
{0 CHEMBL343460,1 9.309,2 36.7,3 33.3,4 1.055,5 1.157,6 0.654,7 0.674,8 279.26,9 16.7,10 12,11 30,13 14,14 21,16 31,17 11,20 10,21 1,22 2,23 1,24 10,25 9,28 5,29 3,32 20,34 1,35 10,36 0.129,37 4,38 29,39 31.654,40 34.705,41 19.614,42 20.215,43 3.3,44 4.921}
{0 CHEMBL345550,1 9.271,2 33.3,3 37,4 1.029,5 1.146,6 0.691,7 0.67,8 250.32,9 22.2,10 10,11 27,13 11,14 19,16 29,17 9,20 7,21 2,22 1,24 10,25 8,26 1,28 6,29 1,31 1,32 17,35 3.7,36 0.103,37 3,38 25,39 27.782,40 30.95,41 18.659,42 18.084,44 7.352}
{0 CHEMBL356396,1 9.309,2 36.7,3 33.3,4 1.055,5 1.157,6 0.654,7 0.674,8 279.26,9 16.7,10 12,11 30,13 14,14 21,16 31,17 11,20 10,21 1,22 2,23 1,24 10,25 9,28 5,29 3,32 20,34 1,35 10,36 0.129,37 4,38 29,39 31.654,40 34.705,41 19.614,42 20.215,43 3.3,44 6.456}
{0 CHEMBL358146,1 9.043,2 34.5,3 34.5,4 1.047,5 1.153,6 0.652,7 0.666,8 262.26,9 20.7,10 12,11 29,13 14,14 20,16 30,17 10,20 9,21 1,22 2,24 10,25 9,28 6,29 3,32 19,35 10.3,36 0.133,37 4,38 28,39 30.36,40 33.448,41 18.921,42 19.326,44 4.745}
{0 CHEMBL358460,1 9.309,2 36.7,3 33.3,4 1.055,5 1.157,6 0.654,7 0.674,8 279.26,9 16.7,10 12,11 30,13 14,14 21,16 31,17 11,20 10,21 1,22 2,23 1,24 10,25 9,28 5,29 3,32 20,34 1,35 10,36 0.129,37 4,38 29,39 31.654,40 34.705,41 19.614,42 20.215,43 3.3,44 5.602}
{0 CHEMBL358907,1 8.795,2 35.7,3 35.7,4 1.037,5 1.151,6 0.66,7 0.665,8 246.26,9 21.4,10 12,11 28,13 13,14 19,16 29,17 10,20 9,21 1,22 1,24 10,25 8,28 6,29 2,32 18,35 7.1,36 0.138,37 4,38 26,39 29.033,40 32.239,41 18.466,42 18.612,44 6.638}
{0 CHEMBL359048,1 9.043,2 34.5,3 34.5,4 1.047,5 1.153,6 0.652,7 0.666,8 262.26,9 20.7,10 12,11 29,13 14,14 20,16 30,17 10,20 9,21 1,22 2,24 10,25 9,28 6,29 3,32 19,35 10.3,36 0.133,37 4,38 28,39 30.36,40 33.448,41 18.921,42 19.326,44 5.796}
{0 CHEMBL405259,1 7.71,2 36.7,3 43.3,4 1.012,5 1.145,6 0.651,7 0.631,8 231.29,9 16.7,10 10,11 30,13 11,14 19,16 32,17 11,20 7,21 4,22 1,24 13,25 6,28 5,29 1,32 17,35 3.3,36 0.094,37 3,38 25,39 30.371,40 34.362,41 19.529,42 18.929,44 6.554}
{0 CHEMBL407874,1 8.32,2 41.4,3 37.9,4 1.017,5 1.136,6 0.682,7 0.669,8 241.28,9 17.2,10 16,11 29,13 16,14 20,16 31,17 12,20 11,21 1,24 11,25 6,28 5,29 1,32 18,35 3.4,36 0.097,37 3,38 28,39 29.487,40 32.947,41 19.767,42 19.402,44 7.318}
{0 CHEMBL407876,1 7.894,2 34.6,3 42.3,4 1.019,5 1.152,6 0.645,7 0.631,8 205.25,9 19.2,10 10,11 26,13 11,14 16,16 27,17 9,20 7,21 2,22 1,24 11,25 6,28 5,29 1,32 15,35 3.8,36 0.111,37 3,38 22,39 26.487,40 29.947,41 16.767,42 16.402,44 4.736}
{0 CHEMBL429409,1 7.434,2 36.4,3 45.5,4 1.008,5 1.145,6 0.645,7 0.62,8 245.32,9 15.2,10 10,11 33,13 11,14 20,16 35,17 12,20 7,21 5,22 1,24 15,25 6,28 5,29 1,32 18,35 3,36 0.086,37 3,38 26,39 33.254,40 37.777,41 21.29,42 20.456,44 5.796}
{0 CHEMBL434225,1 8.009,2 33.9,3 42.9,4 1.033,5 1.146,6 0.626,7 0.623,8 448.49,9 10.7,10 16,11 56,13 16,14 35,16 59,17 19,20 10,21 9,24 24,25 13,28 6,29 7,32 32,35 12.5,36 0.136,37 8,38 43,39 57.854,40 64.192,41 35.068,42 34.873,44 5.699}
{0 CHEMBL439608,1 8.047,2 37,3 40.7,4 1.018,5 1.146,6 0.658,7 0.645,8 217.26,9 18.5,10 10,11 27,13 11,14 18,16 29,17 10,20 7,21 3,22 1,24 11,25 6,28 5,29 1,32 16,35 3.7,36 0.103,37 3,38 24,39 27.487,40 30.947,41 17.767,42 17.402,44 6.26}
{0 CHEMBL485756,1 7.951,2 38.2,3 41.2,4 1.014,5 1.143,6 0.663,7 0.646,8 270.33,9 17.6,10 16,11 34,13 16,14 22,16 36,17 13,20 11,21 2,24 14,25 7,28 6,29 1,32 20,35 2.9,36 0.111,37 4,38 30,39 34.473,40 38.86,41 22.534,42 21.95,44 8.046}
{0 CHEMBL71484,1 8.458,2 37.9,3 37.9,4 1.028,5 1.143,6 0.663,7 0.659,8 245.27,9 17.2,10 12,11 29,13 13,14 19,16 30,17 11,20 10,21 1,22 1,24 11,25 7,28 5,29 2,32 18,35 6.9,36 0.133,37 4,38 26,39 29.814,40 33.156,41 19.222,42 19.117,44 6.886}
