{
  "data_qualities": {
    "quality": [
      {
        "name": "AutoCorrelation",
        "value": "-0.42313203274690553"
      },
      {
        "name": "CfsSubsetEval_DecisionStumpAUC",
        "value": []
      },
      {
        "name": "CfsSubsetEval_DecisionStumpErrRate",
        "value": []
      },
      {
        "name": "CfsSubsetEval_DecisionStumpKappa",
        "value": []
      },
      {
        "name": "CfsSubsetEval_NaiveBayesAUC",
        "value": []
      },
      {
        "name": "CfsSubsetEval_NaiveBayesErrRate",
        "value": []
      },
      {
        "name": "CfsSubsetEval_NaiveBayesKappa",
        "value": []
      },
      {
        "name": "CfsSubsetEval_kNN1NAUC",
        "value": []
      },
      {
        "name": "CfsSubsetEval_kNN1NErrRate",
        "value": []
      },
      {
        "name": "CfsSubsetEval_kNN1NKappa",
        "value": []
      },
      {
        "name": "ClassEntropy",
        "value": []
      },
      {
        "name": "DecisionStumpAUC",
        "value": []
      },
      {
        "name": "DecisionStumpErrRate",
        "value": []
      },
      {
        "name": "DecisionStumpKappa",
        "value": []
      },
      {
        "name": "Dimensionality",
        "value": "0.007836990595611285"
      },
      {
        "name": "EquivalentNumberOfAtts",
        "value": []
      },
      {
        "name": "J48.00001.AUC",
        "value": []
      },
      {
        "name": "J48.00001.ErrRate",
        "value": []
      },
      {
        "name": "J48.00001.Kappa",
        "value": []
      },
      {
        "name": "J48.0001.AUC",
        "value": []
      },
      {
        "name": "J48.0001.ErrRate",
        "value": []
      },
      {
        "name": "J48.0001.Kappa",
        "value": []
      },
      {
        "name": "J48.001.AUC",
        "value": []
      },
      {
        "name": "J48.001.ErrRate",
        "value": []
      },
      {
        "name": "J48.001.Kappa",
        "value": []
      },
      {
        "name": "MajorityClassPercentage",
        "value": []
      },
      {
        "name": "MajorityClassSize",
        "value": []
      },
      {
        "name": "MaxAttributeEntropy",
        "value": []
      },
      {
        "name": "MaxKurtosisOfNumericAtts",
        "value": "103.58408073411994"
      },
      {
        "name": "MaxMeansOfNumericAtts",
        "value": "492.4728108672937"
      },
      {
        "name": "MaxMutualInformation",
        "value": []
      },
      {
        "name": "MaxNominalAttDistinctValues",
        "value": []
      },
      {
        "name": "MaxSkewnessOfNumericAtts",
        "value": "7.827092771726564"
      },
      {
        "name": "MaxStdDevOfNumericAtts",
        "value": "183.8306482454847"
      },
      {
        "name": "MeanAttributeEntropy",
        "value": []
      },
      {
        "name": "MeanKurtosisOfNumericAtts",
        "value": "38.52768124923331"
      },
      {
        "name": "MeanMeansOfNumericAtts",
        "value": "48.56424799721352"
      },
      {
        "name": "MeanMutualInformation",
        "value": []
      },
      {
        "name": "MeanNoiseToSignalRatio",
        "value": []
      },
      {
        "name": "MeanNominalAttDistinctValues",
        "value": []
      },
      {
        "name": "MeanSkewnessOfNumericAtts",
        "value": "3.2546195933078046"
      },
      {
        "name": "MeanStdDevOfNumericAtts",
        "value": "17.028757695413095"
      },
      {
        "name": "MinAttributeEntropy",
        "value": []
      },
      {
        "name": "MinKurtosisOfNumericAtts",
        "value": "0.38004558785480436"
      },
      {
        "name": "MinMeansOfNumericAtts",
        "value": "0.13105067920585162"
      },
      {
        "name": "MinMutualInformation",
        "value": []
      },
      {
        "name": "MinNominalAttDistinctValues",
        "value": []
      },
      {
        "name": "MinSkewnessOfNumericAtts",
        "value": "-0.5107677059192428"
      },
      {
        "name": "MinStdDevOfNumericAtts",
        "value": "0.0120490649163419"
      },
      {
        "name": "MinorityClassPercentage",
        "value": []
      },
      {
        "name": "MinorityClassSize",
        "value": []
      },
      {
        "name": "NaiveBayesAUC",
        "value": []
      },
      {
        "name": "NaiveBayesErrRate",
        "value": []
      },
      {
        "name": "NaiveBayesKappa",
        "value": []
      },
      {
        "name": "NumberOfBinaryFeatures",
        "value": "0.0"
      },
      {
        "name": "NumberOfClasses",
        "value": "0.0"
      },
      {
        "name": "NumberOfFeatures",
        "value": "45.0"
      },
      {
        "name": "NumberOfInstances",
        "value": "5742.0"
      },
      {
        "name": "NumberOfInstancesWithMissingValues",
        "value": "0.0"
      },
      {
        "name": "NumberOfMissingValues",
        "value": "0.0"
      },
      {
        "name": "NumberOfNumericFeatures",
        "value": "18.0"
      },
      {
        "name": "NumberOfSymbolicFeatures",
        "value": "1.0"
      },
      {
        "name": "PercentageOfBinaryFeatures",
        "value": "0.0"
      },
      {
        "name": "PercentageOfInstancesWithMissingValues",
        "value": "0.0"
      },
      {
        "name": "PercentageOfMissingValues",
        "value": "0.0"
      },
      {
        "name": "PercentageOfNumericFeatures",
        "value": "40.0"
      },
      {
        "name": "PercentageOfSymbolicFeatures",
        "value": "2.2222222222222223"
      },
      {
        "name": "Quartile1AttributeEntropy",
        "value": []
      },
      {
        "name": "Quartile1KurtosisOfNumericAtts",
        "value": "0.6240095450709845"
      },
      {
        "name": "Quartile1MeansOfNumericAtts",
        "value": "1.1012293625914316"
      },
      {
        "name": "Quartile1MutualInformation",
        "value": []
      },
      {
        "name": "Quartile1SkewnessOfNumericAtts",
        "value": "0.5148249504960115"
      },
      {
        "name": "Quartile1StdDevOfNumericAtts",
        "value": "0.03784280384641554"
      },
      {
        "name": "Quartile2AttributeEntropy",
        "value": []
      },
      {
        "name": "Quartile2KurtosisOfNumericAtts",
        "value": "22.734898044114622"
      },
      {
        "name": "Quartile2MeansOfNumericAtts",
        "value": "8.031838383838384"
      },
      {
        "name": "Quartile2MutualInformation",
        "value": []
      },
      {
        "name": "Quartile2SkewnessOfNumericAtts",
        "value": "2.2027476746006425"
      },
      {
        "name": "Quartile2StdDevOfNumericAtts",
        "value": "2.699219764371403"
      },
      {
        "name": "Quartile3AttributeEntropy",
        "value": []
      },
      {
        "name": "Quartile3KurtosisOfNumericAtts",
        "value": "84.61806449884509"
      },
      {
        "name": "Quartile3MeansOfNumericAtts",
        "value": "45.269048241031015"
      },
      {
        "name": "Quartile3MutualInformation",
        "value": []
      },
      {
        "name": "Quartile3SkewnessOfNumericAtts",
        "value": "6.785841564992401"
      },
      {
        "name": "Quartile3StdDevOfNumericAtts",
        "value": "15.824844711131973"
      },
      {
        "name": "REPTreeDepth1AUC",
        "value": []
      },
      {
        "name": "REPTreeDepth1ErrRate",
        "value": []
      },
      {
        "name": "REPTreeDepth1Kappa",
        "value": []
      },
      {
        "name": "REPTreeDepth2AUC",
        "value": []
      },
      {
        "name": "REPTreeDepth2ErrRate",
        "value": []
      },
      {
        "name": "REPTreeDepth2Kappa",
        "value": []
      },
      {
        "name": "REPTreeDepth3AUC",
        "value": []
      },
      {
        "name": "REPTreeDepth3ErrRate",
        "value": []
      },
      {
        "name": "REPTreeDepth3Kappa",
        "value": []
      },
      {
        "name": "RandomTreeDepth1AUC",
        "value": []
      },
      {
        "name": "RandomTreeDepth1ErrRate",
        "value": []
      },
      {
        "name": "RandomTreeDepth1Kappa",
        "value": []
      },
      {
        "name": "RandomTreeDepth2AUC",
        "value": []
      },
      {
        "name": "RandomTreeDepth2ErrRate",
        "value": []
      },
      {
        "name": "RandomTreeDepth2Kappa",
        "value": []
      },
      {
        "name": "RandomTreeDepth3AUC",
        "value": []
      },
      {
        "name": "RandomTreeDepth3ErrRate",
        "value": []
      },
      {
        "name": "RandomTreeDepth3Kappa",
        "value": []
      },
      {
        "name": "StdvNominalAttDistinctValues",
        "value": []
      },
      {
        "name": "kNN1NAUC",
        "value": []
      },
      {
        "name": "kNN1NErrRate",
        "value": []
      },
      {
        "name": "kNN1NKappa",
        "value": []
      }
    ]
  }
}