"molecule_id","X.","AMW","pXC50"
{1 1.4,2 6.821,3 5.9}
{0 CHEMBL2013212,2 6.695,3 6.4}
{0 CHEMBL2013213,2 6.888,3 5.8}
{0 CHEMBL2013214,2 6.409,3 6.7}
{0 CHEMBL2013215,2 6.56,3 7.8}
{0 CHEMBL2013216,2 6.56,3 7.9}
{0 CHEMBL2013217,2 6.646,3 6.1}
{0 CHEMBL2013218,2 6.502,3 5.9}
{0 CHEMBL2013219,2 6.502,3 7.6}
{0 CHEMBL2013220,2 6.353,3 6.1}
{0 CHEMBL2013221,2 6.676,3 6.1}
{0 CHEMBL2013222,1 2.9,2 7.082,3 7.5}
{0 CHEMBL2013223,1 3.1,2 7.055,3 7}
{0 CHEMBL2013224,1 1.4,2 6.821,3 7.3}
{0 CHEMBL2013225,1 1.5,2 6.779,3 7.1}
{0 CHEMBL2013226,1 1.4,2 6.821,3 7.1}
{0 CHEMBL2013227,1 1.5,2 6.779,3 7}
{0 CHEMBL2013228,1 5.6,2 7.481,3 5.577}
{0 CHEMBL2013229,1 5.9,2 7.48,3 5.3}
{0 CHEMBL2013230,1 1.4,2 6.821,3 8.448}
{0 CHEMBL2013231,1 1.5,2 6.779,3 7.663}
{0 CHEMBL2013232,1 1.4,2 6.858,3 5.9}
{0 CHEMBL2013233,1 3.2,2 7.247,3 5.8}
{0 CHEMBL2013234,1 3.3,2 7.376,3 5.5}
