"molecule_id","nBO","C.","nCsp2","Sp","nC","Sv","pXC50"
{1 30,2 47.5,3 15,4 29.455,5 19,6 28.505,7 4.523}
{0 CHEMBL1121,1 81,2 35,3 30,4 91.069,5 49,6 87.909,7 7.552}
{0 CHEMBL113718,1 45,2 39.7,3 18,4 50.483,5 31,6 48.11,7 9.2}
{0 CHEMBL1161950,1 46,2 39.7,3 18,4 50.728,5 31,6 48.604,7 5.16}
{0 CHEMBL1172244,1 108,2 38.3,3 46,4 124.024,5 74,6 118.224,7 5}
{0 CHEMBL1172246,1 105,2 36.7,3 42,4 115.688,5 66,6 112.078,7 6.576}
{0 CHEMBL1172247,1 102,2 36.6,3 41,4 113.904,5 64,6 109.361,7 5}
{0 CHEMBL1172249,1 112,2 39.2,3 50,4 125.717,5 76,6 120.412,7 7.498}
{0 CHEMBL1172250,1 112,2 39.2,3 50,4 125.717,5 76,6 120.412,7 7.812}
{0 CHEMBL1172251,1 112,2 37.4,3 48,4 126.637,5 74,6 121.884,7 5.727}
{0 CHEMBL1172252,1 117,2 38.2,3 52,4 131.399,5 78,6 126.411,7 8.023}
{0 CHEMBL1172253,1 119,2 38.1,3 52,4 134.922,5 80,6 129.464,7 7.723}
{0 CHEMBL1172428,1 115,2 38.4,3 51,4 130.7,5 78,6 125.201,7 9.1}
{0 CHEMBL1172429,1 113,2 38.6,3 51,4 127.177,5 76,6 122.148,7 8.799}
{0 CHEMBL1210154,1 26,2 47.5,3 18,4 28.898,5 19,6 27.347,7 9}
{0 CHEMBL1269257,1 49,2 44.7,3 29,4 51.654,5 34,6 50.244,7 6.716}
{0 CHEMBL1269258,1 51,2 46.8,3 30,4 54.603,5 37,6 51.933,7 6.706}
{0 CHEMBL1269259,1 49,2 45.9,3 29,4 50.989,5 34,6 49.309,7 6.796}
{0 CHEMBL1269260,1 50,2 45.5,3 29,4 52.75,5 35,6 50.836,7 6.19}
{0 CHEMBL1269261,1 47,2 45.9,3 28,4 50.841,5 34,6 48.406,7 7.327}
{0 CHEMBL1269262,1 47,2 46.6,3 28,4 50.29,5 34,6 48.1,7 6.202}
{0 CHEMBL1269263,1 50,2 46.7,3 29,4 52.086,5 35,6 49.901,7 6.282}
{0 CHEMBL1269264,1 50,2 47.4,3 30,4 52.841,5 36,6 50.406,7 5}
{0 CHEMBL1270487,1 46,2 47.2,3 28,4 49.836,5 34,6 47.385,7 5.742}
{0 CHEMBL132314,1 70,2 36.9,3 28,4 82.154,5 48,6 78.564,7 5.409}
{0 CHEMBL147186,1 49,2 44.7,3 29,4 51.654,5 34,6 50.244,7 6.9}
{0 CHEMBL150869,1 43,2 43.8,3 22,4 48.807,5 32,6 46.132,7 6.319}
{0 CHEMBL151483,1 42,2 44.3,3 22,4 47.046,5 31,6 44.605,7 6.533}
{0 CHEMBL153308,1 38,2 44.4,3 22,4 42.523,5 28,6 40.552,7 5.921}
{0 CHEMBL1628610,1 35,2 49,3 23,4 36.023,5 25,6 34.73,7 9.699}
{0 CHEMBL1628665,1 41,2 47.5,3 24,4 40.841,5 28,6 40.289,7 9.6}
{0 CHEMBL168182,1 46,2 41.3,3 17,4 51.995,5 33,6 49.121,7 8.523}
{0 CHEMBL1773877,1 51,2 47.3,3 28,4 51.131,5 35,6 49.891,7 10.328}
{0 CHEMBL1773878,1 44,2 47.7,3 26,4 45.25,5 31,6 43.715,7 7.356}
{0 CHEMBL1773879,1 44,2 47.8,3 27,4 47.83,5 33,6 45.364,7 5}
{0 CHEMBL1773880,1 44,2 47.8,3 27,4 47.83,5 33,6 45.364,7 5.534}
{0 CHEMBL1773881,1 44,2 48.6,3 28,4 48.586,5 34,6 45.869,7 5}
{0 CHEMBL1773882,1 44,2 48.6,3 28,4 48.586,5 34,6 45.869,7 7.456}
{0 CHEMBL1773883,1 44,2 47.8,3 27,4 47.83,5 33,6 45.364,7 7.481}
{0 CHEMBL1773884,1 44,2 47.1,3 26,4 47.074,5 32,6 44.858,7 6.664}
{0 CHEMBL1773885,1 44,2 47.1,3 26,4 47.074,5 32,6 44.858,7 7.417}
{0 CHEMBL1773886,1 45,2 46.5,3 26,4 48.836,5 33,6 46.385,7 7.536}
{0 CHEMBL1773887,1 44,2 47.1,3 26,4 47.074,5 32,6 44.858,7 8.753}
{0 CHEMBL1773888,1 45,2 46.5,3 26,4 48.836,5 33,6 46.385,7 7.678}
{0 CHEMBL1773889,1 46,2 45.8,3 26,4 49.29,5 33,6 47.1,7 6.33}
{0 CHEMBL1773890,1 44,2 47,3 26,4 45.767,5 31,6 44.046,7 5.787}
{0 CHEMBL1773891,1 47,2 47.1,3 26,4 48.529,5 33,6 46.573,7 9.441}
{0 CHEMBL1773892,1 43,2 47.7,3 26,4 45.313,5 31,6 43.331,7 7.747}
{0 CHEMBL1773893,1 44,2 47.1,3 26,4 47.074,5 32,6 44.858,7 7.346}
{0 CHEMBL1773894,1 44,2 47.1,3 26,4 47.074,5 32,6 44.858,7 6.734}
{0 CHEMBL1773895,1 44,2 47.7,3 26,4 46.171,5 31,6 44.159,7 7.336}
{0 CHEMBL1773896,1 44,2 47.7,3 26,4 45.25,5 31,6 43.715,7 8.46}
{0 CHEMBL1774032,1 44,2 47.7,3 26,4 45.25,5 31,6 43.715,7 8.854}
{0 CHEMBL1774033,1 45,2 47.1,3 26,4 47.012,5 32,6 45.241,7 9.603}
{0 CHEMBL1774034,1 44,2 47.8,3 27,4 47.83,5 33,6 45.364,7 7.671}
{0 CHEMBL1774035,1 44,2 47.1,3 26,4 47.074,5 32,6 44.858,7 7.828}
{0 CHEMBL1774036,1 44,2 47.1,3 26,4 47.074,5 32,6 44.858,7 7.721}
{0 CHEMBL1774037,1 43,2 47,3 25,4 45.523,5 31,6 43.552,7 8.002}
{0 CHEMBL1774038,1 43,2 46.3,3 25,4 46.074,5 31,6 43.858,7 7.284}
{0 CHEMBL1774039,1 48,2 46.7,3 28,4 51.5,5 35,6 49.32,7 5.299}
{0 CHEMBL1774040,1 47,2 47.2,3 28,4 49.739,5 34,6 47.793,7 7.126}
{0 CHEMBL1774041,1 48,2 46.7,3 28,4 51.5,5 35,6 49.32,7 8.173}
{0 CHEMBL1774042,1 47,2 47.2,3 28,4 49.739,5 34,6 47.793,7 8.699}
{0 CHEMBL1774043,1 48,2 47.2,3 28,4 49.676,5 34,6 48.176,7 9.658}
{0 CHEMBL1806526,1 112,2 33.7,3 35,4 125.887,5 68,6 122.515,7 6.155}
{0 CHEMBL1806527,1 112,2 34,3 36,4 126.984,5 69,6 123.107,7 6.155}
{0 CHEMBL1806528,1 121,2 33.6,3 38,4 137.188,5 74,6 133.16,7 6.155}
{0 CHEMBL1806529,1 130,2 32.8,3 32,4 154.302,5 83,6 148.222,7 6.155}
{0 CHEMBL1806530,1 121,2 33.8,3 38,4 137.302,5 75,6 133.499,7 6.155}
{0 CHEMBL1806531,1 130,2 33.3,3 40,4 147.393,5 79,6 143.212,7 6.155}
{0 CHEMBL1806532,1 148,2 32.8,3 44,4 167.802,5 89,6 163.318,7 6.155}
{0 CHEMBL1806772,1 148,2 33.6,3 44,4 164.495,5 89,6 161.478,7 6.155}
{0 CHEMBL1807149,1 106,2 34,3 32,4 122.484,5 67,6 118.075,7 6.155}
{0 CHEMBL1807150,1 112,2 33.6,3 32,4 130.438,5 71,6 125.612,7 6.155}
{0 CHEMBL1807151,1 106,2 34,3 34,4 119.45,5 65,6 116.011,7 6.155}
{0 CHEMBL189634,1 44,2 40,3 18,4 48.722,5 30,6 46.583,7 7.454}
{0 CHEMBL1933100,1 36,2 46.4,3 23,4 38.449,5 26,6 37.191,7 8.409}
{0 CHEMBL1933103,1 36,2 46.4,3 23,4 38.449,5 26,6 37.191,7 6.012}
{0 CHEMBL1933104,1 36,2 46.4,3 23,4 38.449,5 26,6 37.191,7 8.438}
{0 CHEMBL2017690,1 50,2 43.8,3 24,4 53.819,5 35,6 51.175,7 7.294}
{0 CHEMBL2017691,1 48,2 44.7,3 24,4 51.603,5 34,6 48.933,7 6.398}
{0 CHEMBL2017692,1 53,2 47.5,3 30,4 55.603,5 38,6 52.933,7 5.883}
{0 CHEMBL2017823,1 53,2 46.8,3 29,4 54.847,5 37,6 52.428,7 6.34}
{0 CHEMBL2017824,1 53,2 47.5,3 30,4 55.603,5 38,6 52.933,7 5.777}
{0 CHEMBL2017825,1 52,2 48.1,3 30,4 53.841,5 37,6 51.406,7 5.674}
{0 CHEMBL2017826,1 49,2 44.3,3 24,4 53.364,5 35,6 50.46,7 6.306}
{0 CHEMBL2017827,1 54,2 47,3 30,4 57.364,5 39,6 54.46,7 7.213}
{0 CHEMBL2017828,1 54,2 43.8,3 24,4 59.648,5 39,6 56.04,7 6.592}
{0 CHEMBL2017829,1 54,2 46.3,3 29,4 56.608,5 38,6 53.955,7 7.263}
{0 CHEMBL2017830,1 54,2 46.3,3 29,4 56.608,5 38,6 53.955,7 6.423}
{0 CHEMBL2017831,1 51,2 46.2,3 29,4 53.847,5 36,6 51.428,7 6.42}
{0 CHEMBL2017832,1 50,2 43,3 23,4 53.063,5 34,6 50.669,7 8.287}
{0 CHEMBL2017833,1 54,2 46.3,3 29,4 56.608,5 38,6 53.955,7 7.667}
{0 CHEMBL2017834,1 55,2 45.9,3 29,4 58.37,5 39,6 55.481,7 6.175}
{0 CHEMBL2017835,1 56,2 45.5,3 29,4 60.131,5 40,6 57.008,7 7.644}
{0 CHEMBL202861,1 35,2 47.2,3 23,4 36.688,5 25,6 35.665,7 7.362}
{0 CHEMBL204154,1 40,2 39.2,3 16,4 47.574,5 29,6 44.68,7 5}
{0 CHEMBL205198,1 40,2 39.7,3 16,4 47.023,5 29,6 44.374,7 5.23}
{0 CHEMBL205455,1 41,2 40.3,3 17,4 46.716,5 29,6 44.562,7 5}
{0 CHEMBL205751,1 40,2 40,3 16,4 48.33,5 30,6 45.186,7 5.93}
{0 CHEMBL205965,1 70,2 37.6,3 28,4 79.631,5 47,6 76.511,7 5}
{0 CHEMBL206025,1 30,2 35,3 9,4 38.421,5 21,6 36.174,7 6.71}
{0 CHEMBL206079,1 44,2 38.1,3 16,4 53.313,5 32,6 49.975,7 5}
{0 CHEMBL206974,1 67,2 37.2,3 28,4 76.87,5 45,6 73.984,7 6.495}
{0 CHEMBL208171,1 37,2 45,3 24,4 40.665,5 27,6 39.433,7 4.896}
{0 CHEMBL208479,1 69,2 37,3 28,4 80.393,5 47,6 77.037,7 5.601}
{0 CHEMBL214235,1 32,2 39.6,3 13,4 35.125,5 19,6 32.844,7 5}
{0 CHEMBL214277,1 37,2 39,3 13,4 40.512,5 23,6 38.114,7 5}
{0 CHEMBL214283,1 33,2 38.9,3 13,4 37.296,5 21,6 34.872,7 5}
{0 CHEMBL214728,1 34,2 38.5,3 14,4 36.233,5 20,6 34.555,7 5}
{0 CHEMBL214785,1 30,2 43.2,3 14,4 32.262,5 19,6 30.415,7 5}
{0 CHEMBL214836,1 32,2 40,3 13,4 34.716,5 18,6 32.342,7 5}
{0 CHEMBL215111,1 37,2 43.6,3 19,4 39.534,5 24,6 37.345,7 5}
{0 CHEMBL215415,1 32,2 38.3,3 13,4 33.875,5 18,6 32.141,7 5}
{0 CHEMBL215416,1 32,2 41.3,3 15,4 33.171,5 19,6 31.845,7 5}
{0 CHEMBL216124,1 34,2 43.8,3 19,4 35.869,5 21,6 34.119,7 5}
{0 CHEMBL216134,1 35,2 43.1,3 17,4 36.773,5 22,6 34.819,7 5}
{0 CHEMBL216233,1 30,2 40,3 13,4 30.994,5 16,6 29.253,7 5}
{0 CHEMBL216271,1 38,2 38.3,3 13,4 41.921,5 23,6 39.248,7 5}
{0 CHEMBL216320,1 32,2 39.6,3 13,4 34.631,5 19,6 32.646,7 5}
{0 CHEMBL216360,1 39,2 40.3,3 17,4 43.063,5 25,6 40.42,7 5}
{0 CHEMBL216396,1 33,2 39.6,3 14,4 33.921,5 19,6 32.721,7 5}
{0 CHEMBL216483,1 32,2 41.3,3 15,4 34.477,5 19,6 32.136,7 5}
{0 CHEMBL216559,1 31,2 38.3,3 13,4 33.017,5 18,6 31.313,7 5}
{0 CHEMBL216623,1 34,2 37.7,3 13,4 36.443,5 20,6 34.775,7 5}
{0 CHEMBL216707,1 33,2 38.3,3 13,4 33.165,5 18,6 32.216,7 5}
{0 CHEMBL217170,1 32,2 39.6,3 13,4 35.125,5 19,6 32.844,7 5}
{0 CHEMBL217225,1 31,2 39.5,3 13,4 33.364,5 17,6 30.797,7 5}
{0 CHEMBL217255,1 32,2 41.3,3 15,4 32.676,5 19,6 31.647,7 5}
{0 CHEMBL217270,1 32,2 38.8,3 13,4 34.227,5 19,6 32.533,7 5}
{0 CHEMBL217276,1 30,2 39.5,3 13,4 30.705,5 17,6 29.48,7 5}
{0 CHEMBL217353,1 32,2 39.6,3 13,4 35.125,5 19,6 32.844,7 5}
{0 CHEMBL217373,1 34,2 40.4,3 15,4 36.199,5 21,6 34.701,7 5}
{0 CHEMBL217453,1 31,2 40,3 13,4 33.364,5 18,6 31.317,7 5}
{0 CHEMBL217492,1 33,2 44.4,3 19,4 34.108,5 20,6 32.593,7 5}
{0 CHEMBL217514,1 33,2 37.7,3 13,4 36.54,5 20,6 34.367,7 5}
{0 CHEMBL217553,1 32,2 44,3 17,4 35.989,5 22,6 33.668,7 5}
{0 CHEMBL217595,1 37,2 44.4,3 22,4 39.142,5 24,6 37.592,7 6.7}
{0 CHEMBL217648,1 32,2 41.3,3 15,4 33.869,5 19,6 32.119,7 5}
{0 CHEMBL217715,1 33,2 38.8,3 13,4 35.085,5 19,6 33.361,7 5}
{0 CHEMBL217720,1 32,2 39.6,3 13,4 34.631,5 19,6 32.646,7 5}
{0 CHEMBL217878,1 38,2 43.6,3 19,4 40.392,5 24,6 38.173,7 5}
{0 CHEMBL217957,1 86,2 37.4,3 36,4 98.575,5 58,6 94.859,7 5}
{0 CHEMBL218327,1 74,2 38.9,3 34,4 84.393,5 51,6 81.037,7 5.959}
{0 CHEMBL218344,1 32,2 38.3,3 13,4 33.875,5 18,6 32.141,7 5}
{0 CHEMBL218600,1 86,2 37.4,3 36,4 98.575,5 58,6 94.859,7 6.886}
{0 CHEMBL218651,1 79,2 37.9,3 35,4 89.62,5 53,6 86.322,7 5.721}
{0 CHEMBL218729,1 40,2 42.4,3 20,4 41.994,5 25,6 40.082,7 5.6}
{0 CHEMBL218763,1 74,2 38.9,3 34,4 84.393,5 51,6 81.037,7 5.444}
{0 CHEMBL226533,1 44,2 39.2,3 17,4 48.307,5 29,6 46.164,7 5.76}
{0 CHEMBL226570,1 35,2 41.4,3 16,4 38.216,5 24,6 36.74,7 5}
{0 CHEMBL226571,1 38,2 41.3,3 17,4 41.432,5 26,6 39.981,7 5}
{0 CHEMBL226583,1 45,2 40,3 18,4 48.966,5 30,6 47.078,7 6.23}
{0 CHEMBL226620,1 43,2 41.1,3 17,4 47.716,5 30,6 45.562,7 5}
{0 CHEMBL226622,1 44,2 40.8,3 17,4 49.478,5 31,6 47.088,7 5.1}
{0 CHEMBL226673,1 42,2 40,3 17,4 48.478,5 30,6 46.088,7 5}
{0 CHEMBL226675,1 43,2 39.7,3 17,4 50.239,5 31,6 47.615,7 5}
{0 CHEMBL226726,1 44,2 38.8,3 17,4 51.245,5 31,6 48.637,7 5.19}
{0 CHEMBL226729,1 43,2 39.5,3 17,4 48.932,5 30,6 46.803,7 5.39}
{0 CHEMBL227097,1 40,2 40.6,3 17,4 44.955,5 28,6 43.035,7 5}
{0 CHEMBL227147,1 42,2 40,3 17,4 48.478,5 30,6 46.088,7 5.24}
{0 CHEMBL227254,1 46,2 38,3 17,4 51.074,5 30,6 48.712,7 5.19}
{0 CHEMBL227275,1 47,2 41,3 20,4 52.37,5 32,6 49.77,7 5}
{0 CHEMBL227276,1 47,2 40.8,3 18,4 49.966,5 31,6 48.078,7 6.33}
{0 CHEMBL227277,1 46,2 40.5,3 19,4 51.483,5 32,6 49.11,7 5}
{0 CHEMBL227330,1 45,2 40.5,3 17,4 51.239,5 32,6 48.615,7 5.6}
{0 CHEMBL227333,1 45,2 40.3,3 17,4 51.125,5 31,6 48.275,7 5.68}
{0 CHEMBL227369,1 47,2 41.3,3 17,4 52.239,5 33,6 49.615,7 6.43}
{0 CHEMBL2310857,1 77,2 35.6,3 27,4 86.716,5 48,6 83.491,7 7.796}
{0 CHEMBL235970,1 89,2 34.6,3 31,4 99.057,5 53,6 95.72,7 5.127}
{0 CHEMBL238269,1 91,2 34.6,3 31,4 102.58,5 55,6 98.774,7 5.19}
{0 CHEMBL238270,1 90,2 34.6,3 31,4 100.819,5 54,6 97.247,7 5.159}
{0 CHEMBL248552,1 36,2 46.4,3 22,4 39.063,5 26,6 37.524,7 7.6}
{0 CHEMBL248752,1 36,2 46.4,3 22,4 39.063,5 26,6 37.524,7 7.6}
{0 CHEMBL248754,1 35,2 47.3,3 22,4 38.608,5 26,6 36.809,7 7.6}
{0 CHEMBL248948,1 34,2 48.1,3 22,4 36.847,5 25,6 35.283,7 7.6}
{0 CHEMBL248949,1 35,2 47.3,3 22,4 38.608,5 26,6 36.809,7 7.6}
{0 CHEMBL248950,1 36,2 45.8,3 22,4 39.966,5 27,6 38.224,7 7.6}
{0 CHEMBL249151,1 36,2 45.8,3 22,4 39.966,5 27,6 38.224,7 7.6}
{0 CHEMBL249153,1 36,2 45.8,3 22,4 39.966,5 27,6 38.224,7 7.6}
{0 CHEMBL249361,1 35,2 46.6,3 22,4 39.512,5 27,6 37.509,7 7.6}
{0 CHEMBL24938,1 30,2 35.5,3 9,4 39.728,5 22,6 36.986,7 7.2}
{0 CHEMBL249560,1 35,2 46.6,3 22,4 39.512,5 27,6 37.509,7 7.6}
{0 CHEMBL249763,1 34,2 47.3,3 22,4 37.75,5 26,6 35.982,7 7.6}
{0 CHEMBL249973,1 31,2 47.6,3 19,4 31.455,5 20,6 30.384,7 9.2}
{0 CHEMBL250576,1 35,2 48.1,3 22,4 37.705,5 25,6 36.11,7 7.6}
{0 CHEMBL250699,1 27,2 46.3,3 17,4 28.773,5 19,6 27.923,7 5.699}
{0 CHEMBL258486,1 41,2 39.5,3 16,4 48.785,5 30,6 45.9,7 6.35}
{0 CHEMBL258782,1 48,2 39,3 18,4 52.944,5 32,6 50.846,7 7.14}
{0 CHEMBL258863,1 45,2 38.8,3 17,4 52.341,5 31,6 49.517,7 6.55}
{0 CHEMBL259224,1 31,2 40.4,3 14,4 33.478,5 19,6 31.657,7 5}
{0 CHEMBL259276,1 44,2 39.2,3 17,4 50.694,5 31,6 48.33,7 5.63}
{0 CHEMBL259390,1 44,2 43.3,3 23,4 45.131,5 29,6 44.191,7 5}
{0 CHEMBL259557,1 46,2 40.5,3 19,4 52.677,5 32,6 49.582,7 5.81}
{0 CHEMBL259751,1 32,2 38.8,3 13,4 34.483,5 19,6 32.678,7 5}
{0 CHEMBL259762,1 31,2 41.3,3 14,4 34.12,5 19,6 31.822,7 5}
{0 CHEMBL260394,1 41,2 38.7,3 16,4 48.029,5 29,6 45.395,7 5.63}
{0 CHEMBL261636,1 32,2 38.8,3 13,4 34.483,5 19,6 32.678,7 5}
{0 CHEMBL261682,1 32,2 41.7,3 15,4 34.478,5 20,6 32.657,7 5}
{0 CHEMBL262172,1 66,2 37.3,3 28,4 75.109,5 44,6 72.457,7 5.244}
{0 CHEMBL263475,1 32,2 40.4,3 14,4 33.722,5 19,6 32.151,7 5}
{0 CHEMBL263742,1 73,2 36.4,3 28,4 84.16,5 48,6 80.874,7 9.004}
{0 CHEMBL264150,1 47,2 37.5,3 17,4 51.529,5 30,6 49.427,7 5.68}
{0 CHEMBL265595,1 82,2 38.2,3 36,4 92.285,5 55,6 89.257,7 5.478}
{0 CHEMBL267290,1 32,2 40,3 13,4 34.716,5 18,6 32.342,7 5}
{0 CHEMBL269016,1 73,2 36.4,3 28,4 84.16,5 48,6 80.874,7 9.301}
{0 CHEMBL269355,1 76,2 36.8,3 28,4 86.921,5 50,6 83.401,7 8.377}
{0 CHEMBL269790,1 39,2 40,3 16,4 45.262,5 28,6 42.847,7 5}
{0 CHEMBL276645,1 45,2 39,3 17,4 50.069,5 30,6 47.691,7 5}
{0 CHEMBL283117,1 46,2 44.9,3 22,4 46.983,5 31,6 45.288,7 5.854}
{0 CHEMBL292097,1 48,2 36.8,3 20,4 55.165,5 32,6 53.109,7 5.663}
{0 CHEMBL292492,1 57,2 43.5,3 30,4 61.705,5 40,6 59.373,7 5}
{0 CHEMBL292493,1 51,2 37.4,3 20,4 57.927,5 34,6 55.636,7 5.569}
{0 CHEMBL293456,1 63,2 38.4,3 26,4 71.984,5 43,6 68.786,7 6.439}
{0 CHEMBL294329,1 48,2 36.9,3 19,4 53.745,5 31,6 51.669,7 5}
{0 CHEMBL317181,1 46,2 45.9,3 28,4 50.5,5 34,6 48.32,7 6.8}
{0 CHEMBL319438,1 60,2 38.3,3 27,4 68.671,5 41,6 65.952,7 8.4}
{0 CHEMBL320141,1 42,2 40,3 16,4 45.444,5 28,6 43.725,7 7.1}
{0 CHEMBL320624,1 48,2 43.2,3 22,4 49.381,5 32,6 48.108,7 8}
{0 CHEMBL321761,1 46,2 45.2,3 28,4 49.745,5 33,6 47.815,7 7.3}
{0 CHEMBL324547,1 40,2 41.8,3 21,4 44.534,5 28,6 42.594,7 7.52}
{0 CHEMBL332261,1 45,2 39.7,3 18,4 50.483,5 31,6 48.11,7 4.681}
{0 CHEMBL336381,1 66,2 37.3,3 28,4 75.109,5 44,6 72.457,7 6.06}
{0 CHEMBL337366,1 64,2 37.6,3 27,4 74.41,5 44,6 71.248,7 5.721}
{0 CHEMBL341403,1 65,2 37.8,3 26,4 76.91,5 45,6 72.532,7 5.131}
{0 CHEMBL347329,1 41,2 44.8,3 22,4 45.284,5 30,6 43.078,7 5.602}
{0 CHEMBL356191,1 40,2 43.5,3 22,4 46.046,5 30,6 43.605,7 6.143}
{0 CHEMBL356386,1 43,2 43.8,3 22,4 48.807,5 32,6 46.132,7 5}
{0 CHEMBL356898,1 46,2 41.3,3 17,4 51.995,5 33,6 49.121,7 8.6}
{0 CHEMBL357502,1 41,2 44.8,3 22,4 45.284,5 30,6 43.078,7 6.357}
{0 CHEMBL358646,1 39,2 43.9,3 22,4 44.284,5 29,6 42.078,7 6.955}
{0 CHEMBL363916,1 45,2 38.8,3 17,4 52.438,5 31,6 49.109,7 7.554}
{0 CHEMBL366344,1 49,2 42,3 22,4 53.483,5 34,6 51.11,7 8.102}
{0 CHEMBL373703,1 32,2 39.2,3 13,4 35.534,5 20,6 33.345,7 5}
{0 CHEMBL374325,1 87,2 37.8,3 36,4 99.234,5 59,6 95.772,7 5.721}
{0 CHEMBL374388,1 50,2 41.7,3 17,4 55,5 35,6 52.142,7 5.72}
{0 CHEMBL374389,1 45,2 38.5,3 17,4 51.034,5 30,6 48.705,7 5}
{0 CHEMBL374390,1 45,2 38,3 17,4 51.586,5 30,6 49.012,7 5.53}
{0 CHEMBL375360,1 81,2 35.3,3 30,4 90.517,5 49,6 87.602,7 7.553}
{0 CHEMBL375412,1 79,2 38.4,3 35,4 88.518,5 53,6 85.709,7 5}
{0 CHEMBL377157,1 33,2 47.2,3 23,4 36.443,5 25,6 35.17,7 5.398}
{0 CHEMBL378388,1 39,2 40,3 16,4 45.262,5 28,6 42.847,7 5.82}
{0 CHEMBL379405,1 73,2 39.1,3 34,4 82.631,5 50,6 79.511,7 5.699}
{0 CHEMBL379902,1 40,2 40,3 16,4 48.33,5 30,6 45.186,7 6.14}
{0 CHEMBL380355,1 28,2 44.2,3 17,4 29.165,5 19,6 28.611,7 5.553}
{0 CHEMBL380907,1 44,2 39.5,3 16,4 52.097,5 32,6 48.734,7 5}
{0 CHEMBL381805,1 44,2 37.6,3 16,4 53.864,5 32,6 50.282,7 5.06}
{0 CHEMBL382051,1 73,2 39.1,3 34,4 82.631,5 50,6 79.511,7 6.527}
{0 CHEMBL382349,1 67,2 37.2,3 28,4 76.87,5 45,6 73.984,7 5.292}
{0 CHEMBL383458,1 66,2 37.3,3 28,4 75.109,5 44,6 72.457,7 5.187}
{0 CHEMBL383919,1 32,2 38.8,3 13,4 35.421,5 19,6 33.006,7 5}
{0 CHEMBL384097,1 31,2 40,3 13,4 34.671,5 18,6 31.609,7 5}
{0 CHEMBL384109,1 36,2 44.9,3 19,4 36.869,5 22,6 35.119,7 5}
{0 CHEMBL384126,1 31,2 40,3 13,4 32.869,5 18,6 31.119,7 5}
{0 CHEMBL384387,1 33,2 39.2,3 13,4 36.392,5 20,6 34.173,7 5}
{0 CHEMBL384457,1 34,2 40.4,3 15,4 36.199,5 21,6 34.701,7 5}
{0 CHEMBL384573,1 31,2 40,3 13,4 31.676,5 18,6 30.647,7 5}
{0 CHEMBL384707,1 31,2 40,3 13,4 32.869,5 18,6 31.119,7 5}
{0 CHEMBL384854,1 32,2 41.3,3 15,4 31.756,5 19,6 31.203,7 5}
{0 CHEMBL385153,1 32,2 40,3 13,4 33.727,5 18,6 31.947,7 5}
{0 CHEMBL385285,1 33,2 40.8,3 15,4 34.438,5 20,6 33.174,7 5}
{0 CHEMBL385552,1 31,2 39.5,3 13,4 30.642,5 17,6 29.863,7 5}
{0 CHEMBL385734,1 33,2 38.8,3 13,4 35.085,5 19,6 33.361,7 5}
{0 CHEMBL385952,1 32,2 42.9,3 16,4 34.739,5 21,6 32.964,7 5}
{0 CHEMBL385963,1 30,2 41.7,3 15,4 32.881,5 20,6 31.137,7 5.1}
{0 CHEMBL386143,1 30,2 40.5,3 13,4 31.108,5 17,6 29.593,7 5}
{0 CHEMBL386186,1 86,2 37.4,3 36,4 98.575,5 58,6 94.859,7 5.081}
{0 CHEMBL386209,1 33,2 40.8,3 15,4 34.438,5 20,6 33.174,7 5}
{0 CHEMBL386212,1 79,2 37.9,3 35,4 89.62,5 53,6 86.322,7 5.155}
{0 CHEMBL386436,1 29,2 41,3 13,4 29.347,5 16,6 28.066,7 5}
{0 CHEMBL386438,1 36,2 41.5,3 17,4 37.779,5 22,6 35.84,7 5}
{0 CHEMBL386581,1 33,2 40,3 14,4 33.017,5 18,6 32.022,7 5}
{0 CHEMBL386590,1 31,2 39.6,3 13,4 33.773,5 19,6 31.819,7 5}
{0 CHEMBL386598,1 34,2 39.6,3 13,4 33.585,5 19,6 32.969,7 5}
{0 CHEMBL386976,1 32,2 42.9,3 16,4 35.233,5 21,6 33.162,7 5}
{0 CHEMBL386985,1 36,2 44.4,3 22,4 37.79,5 24,6 36.566,7 5.5}
{0 CHEMBL387018,1 32,2 42.9,3 16,4 35.233,5 21,6 33.162,7 5}
{0 CHEMBL387194,1 31,2 39.5,3 13,4 32.057,5 17,6 30.505,7 5}
{0 CHEMBL387285,1 31,2 40,3 13,4 32.869,5 18,6 31.119,7 5}
{0 CHEMBL387287,1 32,2 40,3 13,4 33.301,5 18,6 31.7,7 5}
{0 CHEMBL387299,1 31,2 40,3 13,4 33.364,5 18,6 31.317,7 5}
{0 CHEMBL387413,1 31,2 39.5,3 13,4 31.563,5 17,6 30.307,7 5}
{0 CHEMBL387948,1 44,2 40.8,3 17,4 49.478,5 31,6 47.088,7 5}
{0 CHEMBL388068,1 44,2 40.8,3 17,4 49.478,5 31,6 47.088,7 5.4}
{0 CHEMBL388143,1 48,2 42.7,3 23,4 54.239,5 35,6 51.615,7 6.26}
{0 CHEMBL388144,1 47,2 41.8,3 21,4 51.932,5 33,6 49.803,7 6.34}
{0 CHEMBL389019,1 37,2 40,3 17,4 42.193,5 26,6 40.508,7 5.15}
{0 CHEMBL389639,1 43,2 39.5,3 17,4 50.125,5 30,6 47.275,7 6.19}
{0 CHEMBL389711,1 46,2 40.5,3 19,4 51.483,5 32,6 49.11,7 6.26}
{0 CHEMBL389713,1 46,2 39.7,3 18,4 50.728,5 31,6 48.604,7 5.67}
{0 CHEMBL389933,1 46,2 39.7,3 18,4 50.728,5 31,6 48.604,7 5.09}
{0 CHEMBL390275,1 43,2 40.3,3 17,4 46.961,5 29,6 45.056,7 5}
{0 CHEMBL390276,1 45,2 43.8,3 23,4 48.955,5 32,6 47.035,7 5}
{0 CHEMBL390519,1 40,2 40,3 11,4 45.017,5 28,6 42.352,7 5}
{0 CHEMBL391357,1 92,2 34.6,3 31,4 104.341,5 56,6 100.301,7 4.606}
{0 CHEMBL392426,1 80,2 33.3,3 25,4 88.767,5 46,6 86.118,7 5.143}
{0 CHEMBL39263,1 35,2 49,3 23,4 36.023,5 25,6 34.73,7 7.983}
{0 CHEMBL393637,1 87,2 35.1,3 31,4 96.29,5 52,6 93.172,7 4.579}
{0 CHEMBL393638,1 88,2 35.1,3 31,4 98.052,5 53,6 94.699,7 4.574}
{0 CHEMBL396601,1 131,2 34.6,3 44,4 149.444,5 82,6 144.776,7 7.495}
{0 CHEMBL396602,1 92,2 34.6,3 31,4 104.341,5 56,6 100.301,7 4.824}
{0 CHEMBL399055,1 35,2 47.3,3 22,4 38.608,5 26,6 36.809,7 7.6}
{0 CHEMBL399056,1 35,2 47.3,3 22,4 38.608,5 26,6 36.809,7 7.6}
{0 CHEMBL399915,1 35,2 48.1,3 22,4 37.705,5 25,6 36.11,7 7.6}
{0 CHEMBL400670,1 36,2 46.4,3 22,4 39.063,5 26,6 37.524,7 7.6}
{0 CHEMBL404967,1 46,2 39.5,3 18,4 49.421,5 30,6 47.792,7 6.5}
{0 CHEMBL405192,1 86,2 37.9,3 36,4 97.472,5 58,6 94.245,7 5.387}
{0 CHEMBL407057,1 82,2 38.2,3 36,4 92.285,5 55,6 89.257,7 5.495}
{0 CHEMBL407198,1 79,2 37.9,3 35,4 89.62,5 53,6 86.322,7 5}
{0 CHEMBL407340,1 47,2 39.2,3 18,4 51.182,5 31,6 49.319,7 6.93}
{0 CHEMBL408083,1 70,2 36.9,3 28,4 82.154,5 48,6 78.564,7 6.041}
{0 CHEMBL408452,1 34,2 44.4,3 19,4 35.46,5 20,6 33.618,7 5}
{0 CHEMBL408832,1 95,2 38.8,3 36,4 105.756,5 64,6 101.826,7 6.076}
{0 CHEMBL408915,1 43,2 39.5,3 16,4 49.029,5 30,6 46.395,7 6.21}
{0 CHEMBL409479,1 31,2 41.3,3 14,4 34.12,5 19,6 31.822,7 5}
{0 CHEMBL410114,1 44,2 39.2,3 17,4 50.694,5 31,6 48.33,7 5.41}
{0 CHEMBL410138,1 41,2 43.8,3 22,4 43.222,5 28,6 41.761,7 5}
{0 CHEMBL410511,1 59,2 39,3 25,4 67.762,5 41,6 64.523,7 7.435}
{0 CHEMBL410708,1 31,2 41.3,3 14,4 34.12,5 19,6 31.822,7 5}
{0 CHEMBL410905,1 32,2 40.8,3 14,4 35.881,5 20,6 33.349,7 5}
{0 CHEMBL411069,1 31,2 40,3 13,4 32.869,5 18,6 31.119,7 5}
{0 CHEMBL411201,1 79,2 38.6,3 35,4 89.825,5 54,6 86.521,7 5}
{0 CHEMBL412282,1 32,2 38.8,3 13,4 34.483,5 19,6 32.678,7 5}
{0 CHEMBL412331,1 94,2 39.4,3 43,4 104.336,5 63,6 101.094,7 6}
{0 CHEMBL413644,1 86,2 37.9,3 36,4 97.472,5 58,6 94.245,7 5}
{0 CHEMBL414087,1 86,2 37.4,3 36,4 98.575,5 58,6 94.859,7 5}
{0 CHEMBL421575,1 43,2 43.8,3 22,4 43.097,5 28,6 42.528,7 7.3}
{0 CHEMBL425638,1 37,2 38.6,3 13,4 40.159,5 22,6 37.721,7 5}
{0 CHEMBL426524,1 31,2 41.7,3 15,4 34.233,5 20,6 32.162,7 5.7}
{0 CHEMBL428647,1 68,2 41.6,3 26,4 73.404,5 47,6 71.199,7 4.944}
{0 CHEMBL430298,1 74,2 38.9,3 34,4 84.393,5 51,6 81.037,7 5.967}
{0 CHEMBL432256,1 59,2 38,3 19,4 68.489,5 41,6 64.775,7 8.5}
{0 CHEMBL435143,1 46,2 38.5,3 17,4 51.716,5 30,6 48.878,7 6.41}
{0 CHEMBL437736,1 47,2 41,3 20,4 51.176,5 32,6 49.298,7 6.18}
{0 CHEMBL437908,1 31,2 40,3 13,4 32.869,5 18,6 31.119,7 5}
{0 CHEMBL438739,1 95,2 38.8,3 36,4 105.756,5 64,6 101.826,7 6.252}
{0 CHEMBL438843,1 46,2 40.5,3 19,4 51.483,5 32,6 49.11,7 5.6}
{0 CHEMBL438984,1 36,2 42.3,3 17,4 37.227,5 22,6 35.533,7 5}
{0 CHEMBL446324,1 53,2 42.4,3 27,4 57.586,5 36,6 55.012,7 9.921}
{0 CHEMBL446502,1 50,2 42.7,3 26,4 54.824,5 35,6 52.196,7 9.524}
{0 CHEMBL448118,1 50,2 42,3 25,4 54.921,5 34,6 52.077,7 9.237}
{0 CHEMBL448221,1 46,2 46.5,3 27,4 48.739,5 33,6 46.793,7 9.854}
{0 CHEMBL448597,1 47,2 46.5,3 26,4 48.404,5 33,6 47.04,7 5.87}
{0 CHEMBL449681,1 50,2 43.4,3 26,4 55.58,5 36,6 52.702,7 9.712}
{0 CHEMBL449725,1 50,2 42,3 25,4 54.921,5 34,6 52.077,7 9.523}
{0 CHEMBL450105,1 51,2 43.8,3 27,4 53.966,5 35,6 52.078,7 10.398}
{0 CHEMBL450443,1 49,2 43.8,3 26,4 53.819,5 35,6 51.175,7 9.602}
{0 CHEMBL451342,1 54,2 42.4,3 27,4 57.523,5 36,6 55.395,7 10.087}
{0 CHEMBL451644,1 49,2 46.6,3 27,4 50.193,5 34,6 48.508,7 9.854}
{0 CHEMBL453083,1 44,2 45.7,3 25,4 47.836,5 32,6 45.385,7 9.242}
{0 CHEMBL455742,1 46,2 46.5,3 27,4 48.739,5 33,6 46.793,7 8.886}
{0 CHEMBL468372,1 50,2 43.8,3 26,4 53.722,5 35,6 51.583,7 10.236}
{0 CHEMBL473457,1 45,2 47.1,3 26,4 46.705,5 32,6 45.13,7 8.539}
{0 CHEMBL473663,1 45,2 47.1,3 26,4 46.705,5 32,6 45.13,7 8.959}
{0 CHEMBL473664,1 45,2 46.5,3 26,4 48.529,5 33,6 46.274,7 8.721}
{0 CHEMBL473865,1 44,2 46.3,3 25,4 46.012,5 31,6 44.241,7 9.412}
{0 CHEMBL474067,1 45,2 45.7,3 25,4 47.773,5 32,6 45.768,7 9.753}
{0 CHEMBL475226,1 33,2 46.9,3 21,4 36.682,5 23,6 34.046,7 6.76}
{0 CHEMBL475679,1 46,2 47,3 25,4 45.705,5 31,6 44.429,7 9.753}
{0 CHEMBL476095,1 40,2 45.2,3 22,4 43.784,5 28,6 41.492,7 7.602}
{0 CHEMBL476297,1 42,2 47.7,3 26,4 45.069,5 31,6 42.837,7 7.372}
{0 CHEMBL476519,1 46,2 47.1,3 26,4 48.284,5 33,6 46.078,7 6.591}
{0 CHEMBL476520,1 43,2 47.1,3 26,4 46.83,5 32,6 44.364,7 8.3}
{0 CHEMBL476530,1 44,2 47.1,3 26,4 46.767,5 32,6 44.747,7 8.63}
{0 CHEMBL476531,1 44,2 47.1,3 26,4 47.688,5 32,6 45.191,7 8.256}
{0 CHEMBL476725,1 45,2 45.9,3 26,4 50.353,5 34,6 47.417,7 6.757}
{0 CHEMBL476739,1 43,2 46.3,3 25,4 46.074,5 31,6 43.858,7 7.582}
{0 CHEMBL476747,1 43,2 47.1,3 26,4 48.137,5 33,6 45.176,7 7.277}
{0 CHEMBL477784,1 43,2 47.1,3 26,4 46.83,5 32,6 44.364,7 5.27}
{0 CHEMBL477996,1 42,2 44.6,3 23,4 44.319,5 29,6 42.353,7 7.77}
{0 CHEMBL478397,1 45,2 45.9,3 26,4 50.353,5 34,6 47.417,7 7.4}
{0 CHEMBL478398,1 46,2 47.1,3 26,4 48.284,5 33,6 46.078,7 9.191}
{0 CHEMBL478604,1 39,2 45.2,3 22,4 42.926,5 28,6 40.664,7 7.493}
{0 CHEMBL478630,1 43,2 46.3,3 25,4 46.074,5 31,6 43.858,7 8.049}
{0 CHEMBL479030,1 45,2 45.9,3 26,4 50.353,5 34,6 47.417,7 6.407}
{0 CHEMBL479046,1 43,2 47.1,3 26,4 46.83,5 32,6 44.364,7 8.31}
{0 CHEMBL479063,1 39,2 45.2,3 22,4 42.926,5 28,6 40.664,7 6.511}
{0 CHEMBL479256,1 43,2 46.3,3 25,4 46.074,5 31,6 43.858,7 8.923}
{0 CHEMBL498942,1 47,2 46.5,3 27,4 48.676,5 33,6 47.176,7 10.208}
{0 CHEMBL498958,1 54,2 44,3 28,4 56.324,5 37,6 54.901,7 10.428}
{0 CHEMBL502924,1 49,2 44.3,3 26,4 53.267,5 35,6 50.868,7 9.611}
{0 CHEMBL502974,1 52,2 44,3 28,4 56.483,5 37,6 54.11,7 10.248}
{0 CHEMBL503107,1 53,2 43.7,3 28,4 58.245,5 38,6 55.637,7 9.959}
{0 CHEMBL503331,1 49,2 43.8,3 26,4 53.819,5 35,6 51.175,7 9.409}
{0 CHEMBL504024,1 46,2 47.1,3 26,4 46.642,5 32,6 45.513,7 5.501}
{0 CHEMBL504114,1 54,2 43.7,3 28,4 58.182,5 38,6 56.02,7 10.149}
{0 CHEMBL504406,1 53,2 44,3 28,4 56.421,5 37,6 54.493,7 10.359}
{0 CHEMBL504707,1 49,2 44.3,3 26,4 53.267,5 35,6 50.868,7 9.221}
{0 CHEMBL504861,1 48,2 45.9,3 27,4 50.438,5 34,6 48.703,7 10.252}
{0 CHEMBL505225,1 49,2 47.1,3 27,4 48.37,5 33,6 47.364,7 10.278}
{0 CHEMBL505432,1 50,2 43.4,3 26,4 55.58,5 36,6 52.702,7 9.737}
{0 CHEMBL505727,1 47,2 45.9,3 27,4 50.5,5 34,6 48.32,7 9.921}
{0 CHEMBL507051,1 53,2 43,3 28,4 57.489,5 37,6 55.131,7 9.886}
{0 CHEMBL507094,1 54,2 43,3 28,4 57.427,5 37,6 55.514,7 10.072}
{0 CHEMBL508004,1 50,2 43.8,3 26,4 53.722,5 35,6 51.583,7 10.211}
{0 CHEMBL508772,1 53,2 44,3 28,4 56.387,5 37,6 54.518,7 9.854}
{0 CHEMBL509464,1 53,2 43.7,3 28,4 58.245,5 38,6 55.637,7 10.536}
{0 CHEMBL509519,1 50,2 46.6,3 27,4 50.131,5 34,6 48.891,7 10.319}
{0 CHEMBL510690,1 48,2 46.5,3 27,4 48.614,5 33,6 47.56,7 10.216}
{0 CHEMBL514716,1 43,2 46.3,3 25,4 46.074,5 31,6 43.858,7 6.848}
{0 CHEMBL514953,1 46,2 46.4,3 25,4 47.529,5 32,6 45.573,7 9.81}
{0 CHEMBL515160,1 44,2 47.1,3 26,4 46.767,5 32,6 44.747,7 6.979}
{0 CHEMBL515161,1 43,2 46.3,3 25,4 46.074,5 31,6 43.858,7 8.399}
{0 CHEMBL515288,1 33,2 46.9,3 21,4 36.682,5 23,6 34.046,7 8.429}
{0 CHEMBL515616,1 44,2 46.5,3 26,4 48.591,5 33,6 45.89,7 8.409}
{0 CHEMBL515887,1 44,2 46.3,3 25,4 46.012,5 31,6 44.241,7 9.26}
{0 CHEMBL516113,1 43,2 47.1,3 26,4 46.83,5 32,6 44.364,7 7.699}
{0 CHEMBL516355,1 44,2 47.1,3 26,4 46.767,5 32,6 44.747,7 8.461}
{0 CHEMBL541903,1 48,2 40.2,3 20,4 53.489,5 33,6 51.131,7 5.77}
{0 CHEMBL541904,1 46,2 39.7,3 18,4 50.728,5 31,6 48.604,7 5}
{0 CHEMBL559157,1 43,2 39,3 17,4 49.483,5 30,6 47.11,7 5.07}
{0 CHEMBL563949,1 27,2 43.2,3 14,4 25.921,5 16,6 26.017,7 5.092}
{0 CHEMBL565298,1 39,2 43.1,3 20,4 39.068,5 22,6 37.957,7 6.6}
{0 CHEMBL565324,1 40,2 43.1,3 20,4 39.926,5 22,6 38.785,7 6.8}
{0 CHEMBL565325,1 34,2 43.8,3 19,4 36.364,5 21,6 34.317,7 6.4}
{0 CHEMBL565511,1 37,2 42.6,3 19,4 40.25,5 23,6 38,7 7.3}
{0 CHEMBL566177,1 42,2 43.9,3 22,4 42.801,5 25,6 41.651,7 6.7}
{0 CHEMBL566359,1 39,2 43.1,3 20,4 39.494,5 22,6 38.204,7 7.1}
{0 CHEMBL566360,1 36,2 43.1,3 19,4 38.489,5 22,6 36.474,7 7}
{0 CHEMBL566390,1 37,2 43.1,3 20,4 37.778,5 22,6 36.549,7 5.4}
{0 CHEMBL566574,1 41,2 44.4,3 22,4 41.04,5 24,6 40.125,7 6.8}
{0 CHEMBL566604,1 35,2 43.1,3 19,4 38.125,5 22,6 35.844,7 7.2}
{0 CHEMBL569018,1 46,2 45.9,3 26,4 47.017,5 28,6 45.257,7 5}
{0 CHEMBL569391,1 40,2 44.4,3 22,4 40.182,5 24,6 39.297,7 6.4}
{0 CHEMBL569470,1 39,2 43.1,3 20,4 39.989,5 22,6 38.402,7 6.7}
{0 CHEMBL569616,1 34,2 43.8,3 19,4 35.869,5 21,6 34.119,7 6.8}
{0 CHEMBL569848,1 38,2 43.1,3 20,4 38.636,5 22,6 37.376,7 6.5}
{0 CHEMBL569849,1 40,2 42.6,3 20,4 41.256,5 23,6 39.731,7 6.7}
{0 CHEMBL570163,1 35,2 43.1,3 19,4 38.125,5 22,6 35.844,7 7.1}
{0 CHEMBL570297,1 40,2 42.6,3 20,4 41.256,5 23,6 39.731,7 6.3}
{0 CHEMBL570518,1 37,2 43.1,3 20,4 37.778,5 22,6 36.549,7 5.5}
{0 CHEMBL570520,1 39,2 43.1,3 20,4 40.483,5 22,6 38.599,7 6.9}
{0 CHEMBL570521,1 36,2 43.8,3 19,4 37.585,5 21,6 35.774,7 7.1}
{0 CHEMBL570761,1 40,2 42.1,3 20,4 42.159,5 24,6 40.43,7 5.4}
{0 CHEMBL571206,1 37,2 42.3,3 19,4 39.438,5 22,6 37.386,7 7.6}
{0 CHEMBL571457,1 35,2 43.8,3 19,4 36.727,5 21,6 34.947,7 6}
{0 CHEMBL571650,1 40,2 44.4,3 22,4 40.676,5 24,6 39.495,7 6.5}
{0 CHEMBL571832,1 35,2 43.1,3 19,4 37.631,5 22,6 35.646,7 5.4}
{0 CHEMBL572046,1 35,2 43.1,3 19,4 37.631,5 22,6 35.646,7 5.7}
{0 CHEMBL583035,1 39,2 43.1,3 20,4 40.869,5 22,6 38.447,7 6.8}
{0 CHEMBL583343,1 43,2 46.6,3 25,4 45.108,5 27,6 42.828,7 7.5}
{0 CHEMBL583344,1 39,2 43.1,3 20,4 41.295,5 22,6 38.693,7 6.7}
{0 CHEMBL583457,1 37,2 43.1,3 19,4 39.347,5 22,6 37.301,7 7.9}
{0 CHEMBL584063,1 35,2 43.1,3 19,4 38.125,5 22,6 35.844,7 7.1}
{0 CHEMBL584259,1 38,2 43.1,3 20,4 38.636,5 22,6 37.376,7 5.7}
{0 CHEMBL584525,1 40,2 44.4,3 22,4 41.597,5 24,6 39.939,7 7}
{0 CHEMBL585157,1 39,2 43.1,3 20,4 39.563,5 22,6 38.155,7 6.6}
{0 CHEMBL585914,1 39,2 43.1,3 20,4 39.494,5 22,6 38.204,7 6.6}
{0 CHEMBL59865,1 49,2 36.7,3 20,4 56.927,5 33,6 54.636,7 5}
{0 CHEMBL59993,1 37,2 40,3 16,4 46.586,5 28,6 43.104,7 6.721}
{0 CHEMBL9387,1 33,2 46.2,3 21,4 35.784,5 24,6 34.256,7 6.76}
{0 CHEMBL9506,1 35,2 49,3 23,4 36.023,5 25,6 34.73,7 9.556}
{0 CHEMBL95200,1 43,2 39.7,3 16,4 47.205,5 29,6 45.251,7 7.1}
{0 CHEMBL99252,1 47,2 42.7,3 19,4 53.75,5 35,6 50.626,7 5.522}
{0 CHEMBL99499,1 72,2 37,3 30,4 81.637,5 47,6 78.821,7 8.276}
