"molecule_id","SpDiam_EA.bo.","Eig07_EA.bo.","Eig01_EA.bo.","SM11_AEA.ri.","SpMax_EA.bo.","DLS_cons","SM15_EA.bo.","Eig06_AEA.bo.","Eig08_AEA.bo.","SM13_EA.bo.","SM14_EA.bo.","SM11_EA.bo.","SM12_EA.bo.","Eig13_AEA.bo.","Eig08_EA","SM02_AEA.dm.","RBF","GATS5m","nRCONHR","nRCOOR","PW3","S3K","SdsCH","SpMax1_Bh.e.","SpMax1_Bh.i.","SpMax1_Bh.p.","SpMax1_Bh.v.","X2A","X3A","X4A","X5A","SM03_EA.bo.","Eig13_EA.bo.","nCrt","nCt","Chi1_EA.dm.","Eig07_AEA.bo.","SM09_EA.bo.","Eig08_EA.bo.","Eig09_AEA.bo.","GGI10","Eig08_AEA.ri.","SpMax1_Bh.m.","C.003","Eig09_EA.ed.","SM04_AEA.ri.","piPC06","piPC08","piPC09","piPC10","SM10_EA.bo.","Eig14_AEA.ri.","Eig14_EA.ri.","C.034","D.Dtr09","SM03_AEA.bo.","C.016","Eig02_AEA.bo.","NdsCH","P_VSA_LogP_2","PW4","pXC50"
{1 6.616,2 1.6,3 3.616,4 3.616,5 3.616,6 1,7 19.394,8 3.189,9 2.5,10 16.866,11 18.255,12 14.353,13 15.785,14 1.307,15 1.327,16 1.327,17 0.075,18 0.714,19 2,20 1,21 0.301,22 8.589,23 3.844,24 3.942,25 3.975,26 3.872,27 3.864,28 0.319,29 0.214,30 0.14,31 0.096,32 4.248,33 0.064,34 1,35 1,36 20.112,37 2.626,38 11.86,39 1.5,40 2.455,41 0.107,42 2.303,43 3.999,44 1,45 2.275,46 2.275,47 4.816,48 5.014,49 5.106,50 5.167,51 13.355,52 0.685,53 -0.147,56 5.901,57 2,58 3.979,59 2,60 57.498,61 0.145,62 4.509}
{0 CHEMBL1076352,1 6.616,2 1.6,3 3.616,4 3.616,5 3.616,6 1,7 19.394,8 3.189,9 2.5,10 16.866,11 18.255,12 14.353,13 15.785,14 1.307,15 1.327,16 1.327,17 0.075,18 0.714,19 2,20 1,21 0.301,22 8.589,23 3.844,24 3.942,25 3.975,26 3.872,27 3.864,28 0.319,29 0.214,30 0.14,31 0.096,32 4.248,33 0.064,34 1,35 1,36 20.112,37 2.626,38 11.86,39 1.5,40 2.455,41 0.107,42 2.303,43 3.999,44 1,45 2.275,46 2.275,47 4.816,48 5.014,49 5.106,50 5.167,51 13.355,52 0.685,53 -0.147,56 5.901,57 2,58 3.979,59 2,60 57.498,61 0.145,62 4.155}
{0 CHEMBL1079557,1 6.616,2 1.628,3 3.616,4 3.616,5 3.616,6 1,7 19.394,8 3.198,9 2.551,10 16.866,11 18.255,12 14.353,13 15.785,14 1.451,15 1.414,16 1.414,17 0.071,18 0.715,19 2,20 1,21 0.299,22 9.281,23 3.948,24 3.943,25 3.976,26 3.873,27 3.865,28 0.32,29 0.215,30 0.14,31 0.097,32 4.248,33 0.179,34 1,35 1,36 18.642,37 2.648,38 11.86,39 1.527,40 2.5,41 0.12,42 2.388,43 3.999,44 1,45 2.275,46 2.275,47 4.808,48 5.021,49 5.087,50 5.127,51 13.356,52 0.879,53 -0.103,56 5.92,57 2,58 3.979,59 2,60 60.032,61 0.145,62 4.222}
{0 CHEMBL1079558,1 6.616,2 2.33,3 3.616,4 3.616,5 3.616,6 0.98,7 19.891,8 3.383,9 3.072,10 17.347,11 18.769,12 14.807,13 16.287,14 1.902,15 1.62,16 1.62,17 0.082,18 0.711,19 2,20 1,21 0.313,22 8.108,23 3.701,24 3.971,25 4.002,26 3.889,27 3.884,28 0.307,29 0.202,30 0.131,31 0.089,32 4.494,33 0.815,34 1,35 1,36 23.381,37 3.201,38 12.274,39 2.175,40 2.576,41 0.144,42 2.626,43 4.001,44 1,45 3.096,46 3.096,47 5.32,48 5.649,49 5.821,50 5.852,51 13.837,52 1.518,53 0.511,56 6.158,57 2,58 4.022,59 2,60 50.371,61 0.16,62 4.824}
{0 CHEMBL1080091,1 6.616,2 1.569,3 3.616,4 3.616,5 3.616,6 1,7 19.395,8 3.166,9 2.5,10 16.866,11 18.256,12 14.354,13 15.786,14 1.105,15 1.242,16 1.242,17 0.08,18 0.684,19 2,20 1,21 0.303,22 7.944,23 3.681,24 3.941,25 3.974,26 3.872,27 3.864,28 0.318,29 0.213,30 0.139,31 0.096,32 4.248,33 -0.149,34 1,35 1,36 18.445,37 2.604,38 11.86,39 1.5,40 2.396,41 0.107,42 2.22,43 3.999,44 1,45 2.275,46 2.275,47 4.808,48 5.034,49 5.147,50 5.173,51 13.355,52 0.657,53 -0.24,56 5.881,57 2,58 3.979,59 2,60 54.963,61 0.146,62 4.222}
{0 CHEMBL1080649,1 6.616,2 2.322,3 3.616,4 3.616,5 3.616,6 0.98,7 19.891,8 3.383,9 3.095,10 17.346,11 18.768,12 14.807,13 16.287,14 2.17,15 1.681,16 1.681,17 0.078,18 0.736,19 2,20 1,21 0.311,22 8.676,23 3.861,24 3.971,25 4.004,26 3.889,27 3.884,28 0.308,29 0.203,30 0.132,31 0.09,32 4.494,33 1.028,34 1,35 1,36 25.049,37 3.207,38 12.273,39 2.216,40 2.597,41 0.149,42 2.684,43 4.001,44 1,45 3.31,46 3.31,47 5.325,48 5.627,49 5.787,50 5.824,51 13.837,52 1.589,53 0.586,56 6.173,57 2,58 4.022,59 2,60 52.906,61 0.159,62 4.699}
{0 CHEMBL1080987,1 6.616,2 1.628,3 3.616,4 3.616,5 3.616,6 1,7 19.394,8 3.198,9 2.551,10 16.866,11 18.255,12 14.353,13 15.785,14 1.451,15 1.414,16 1.414,17 0.071,18 0.715,19 2,20 1,21 0.299,22 9.281,23 3.948,24 3.943,25 3.976,26 3.873,27 3.865,28 0.32,29 0.215,30 0.14,31 0.097,32 4.248,33 0.179,34 1,35 1,36 18.642,37 2.648,38 11.86,39 1.527,40 2.5,41 0.12,42 2.388,43 3.999,44 1,45 2.275,46 2.275,47 4.808,48 5.021,49 5.087,50 5.127,51 13.356,52 0.879,53 -0.103,56 5.92,57 2,58 3.979,59 2,60 60.032,61 0.145,62 4.523}
{0 CHEMBL1080988,1 6.616,2 1.569,3 3.616,4 3.616,5 3.616,6 1,7 19.395,8 3.166,9 2.5,10 16.866,11 18.256,12 14.354,13 15.786,14 1.105,15 1.242,16 1.242,17 0.08,18 0.684,19 2,20 1,21 0.303,22 7.944,23 3.681,24 3.941,25 3.974,26 3.872,27 3.864,28 0.318,29 0.213,30 0.139,31 0.096,32 4.248,33 -0.149,34 1,35 1,36 18.445,37 2.604,38 11.86,39 1.5,40 2.396,41 0.107,42 2.22,43 3.999,44 1,45 2.275,46 2.275,47 4.808,48 5.034,49 5.147,50 5.173,51 13.355,52 0.657,53 -0.24,56 5.881,57 2,58 3.979,59 2,60 54.963,61 0.146,62 4.824}
{0 CHEMBL1081556,1 6.616,2 2.33,3 3.616,4 3.616,5 3.616,6 0.98,7 19.891,8 3.383,9 3.072,10 17.347,11 18.769,12 14.807,13 16.287,14 1.902,15 1.62,16 1.62,17 0.082,18 0.711,19 2,20 1,21 0.313,22 8.108,23 3.701,24 3.971,25 4.002,26 3.889,27 3.884,28 0.307,29 0.202,30 0.131,31 0.089,32 4.494,33 0.815,34 1,35 1,36 23.381,37 3.201,38 12.274,39 2.175,40 2.576,41 0.144,42 2.626,43 4.001,44 1,45 3.096,46 3.096,47 5.32,48 5.649,49 5.821,50 5.852,51 13.837,52 1.518,53 0.511,56 6.158,57 2,58 4.022,59 2,60 50.371,61 0.16,62 5}
{0 CHEMBL1087150,1 6.616,2 2.322,3 3.616,4 3.616,5 3.616,6 0.98,7 19.891,8 3.383,9 3.095,10 17.346,11 18.768,12 14.807,13 16.287,14 2.17,15 1.681,16 1.681,17 0.078,18 0.736,19 2,20 1,21 0.311,22 8.676,23 3.861,24 3.971,25 4.004,26 3.889,27 3.884,28 0.308,29 0.203,30 0.132,31 0.09,32 4.494,33 1.028,34 1,35 1,36 25.049,37 3.207,38 12.273,39 2.216,40 2.597,41 0.149,42 2.684,43 4.001,44 1,45 3.31,46 3.31,47 5.325,48 5.627,49 5.787,50 5.824,51 13.837,52 1.589,53 0.586,56 6.173,57 2,58 4.022,59 2,60 52.906,61 0.159,62 5.398}
{0 CHEMBL1087530,1 6.616,2 2.33,3 3.616,4 3.616,5 3.616,6 0.98,7 19.891,8 3.383,9 3.072,10 17.347,11 18.769,12 14.807,13 16.287,14 1.902,15 1.62,16 1.62,17 0.082,18 0.711,19 2,20 1,21 0.313,22 8.108,23 3.701,24 3.971,25 4.002,26 3.889,27 3.884,28 0.307,29 0.202,30 0.131,31 0.089,32 4.494,33 0.815,34 1,35 1,36 23.381,37 3.201,38 12.274,39 2.175,40 2.576,41 0.144,42 2.626,43 4.001,44 1,45 3.096,46 3.096,47 5.32,48 5.649,49 5.821,50 5.852,51 13.837,52 1.518,53 0.511,56 6.158,57 2,58 4.022,59 2,60 50.371,61 0.16,62 5.155}
{0 CHEMBL1088172,1 6.616,2 2.322,3 3.616,4 3.616,5 3.616,6 0.98,7 19.891,8 3.383,9 3.095,10 17.346,11 18.768,12 14.807,13 16.287,14 2.17,15 1.681,16 1.681,17 0.078,18 0.736,19 2,20 1,21 0.311,22 8.676,23 3.861,24 3.971,25 4.004,26 3.889,27 3.884,28 0.308,29 0.203,30 0.132,31 0.09,32 4.494,33 1.028,34 1,35 1,36 25.049,37 3.207,38 12.273,39 2.216,40 2.597,41 0.149,42 2.684,43 4.001,44 1,45 3.31,46 3.31,47 5.325,48 5.627,49 5.787,50 5.824,51 13.837,52 1.589,53 0.586,56 6.173,57 2,58 4.022,59 2,60 52.906,61 0.159,62 4.824}
{0 CHEMBL1221983,1 7.589,2 2.493,3 4.589,4 4.589,5 4.589,6 0.84,7 22.957,8 3.382,9 3.155,10 19.948,11 21.468,12 16.953,13 18.487,14 2.5,15 1.764,16 1.764,17 0.091,18 0.975,21 0.351,22 5.017,24 4.1,25 4.109,26 4.121,27 4.068,28 0.276,29 0.179,30 0.114,31 0.073,32 4.934,33 1.5,36 27.927,37 3.207,38 13.972,39 2.348,40 2.959,41 0.259,42 2.704,43 4.39,45 4.112,46 4.112,47 6.49,48 7.241,49 7.395,50 7.62,51 15.548,52 1.976,53 0.974,54 2,55 154.496,56 6.36,58 4.276,60 15.368,61 0.193,62 8.056}
{0 CHEMBL1221984,1 7.619,2 2.749,3 4.619,4 4.619,5 4.619,6 0.63,7 23.407,8 3.603,9 3.23,10 20.389,11 21.911,12 17.377,13 18.915,14 2.514,15 1.916,16 1.916,17 0.078,18 0.926,21 0.344,22 5.101,24 4.144,25 4.189,26 4.044,27 4.047,28 0.272,29 0.173,30 0.111,31 0.072,32 5.165,33 1.518,36 47.206,37 3.369,38 14.372,39 2.427,40 3.118,41 0.193,42 2.864,43 4.116,45 4.488,46 4.488,47 6.951,48 7.936,49 8.357,50 8.74,51 15.949,52 2.027,53 1.009,55 155.076,56 6.518,58 4.495,60 26.069,61 0.198,62 6}
{0 CHEMBL1803109,1 6.317,2 1.879,3 3.838,4 3.838,5 3.838,6 0.78,7 20.525,8 3.129,9 2.62,10 17.877,11 19.204,12 15.237,13 16.566,14 1.579,15 1.595,16 1.595,17 0.027,18 0.954,21 0.38,22 2.993,23 2.592,24 4.126,25 4.165,26 4.057,27 4.046,28 0.26,29 0.163,30 0.101,31 0.063,32 4.635,33 0.561,34 4,35 5,36 26.338,37 2.879,38 12.607,39 1.617,40 2.349,41 0.099,42 2.594,43 4.033,44 5,45 3.182,46 3.182,47 5.303,48 5.835,49 6.05,50 6.148,51 13.946,52 1.08,53 0.104,55 67.733,56 6.098,57 1,58 4.572,59 1,60 29.986,61 0.206,62 5.727}
{0 CHEMBL1822468,1 7.366,2 2.379,3 4.366,4 4.366,5 4.366,6 0.9,7 22.272,8 3.317,9 3.118,10 19.371,11 20.841,12 16.483,13 17.969,14 2.118,15 1.618,16 1.618,17 0.05,18 1.046,21 0.339,22 4.77,24 4.085,25 4.117,26 4.002,27 4.007,28 0.283,29 0.182,30 0.116,31 0.075,32 4.913,33 1,36 29.973,37 3.119,38 13.609,39 2.261,40 2.886,41 0.122,42 2.603,43 4.049,45 3.615,46 3.615,47 6.359,48 7.248,49 7.699,50 7.861,51 15.136,52 1.651,53 0.661,56 6.299,58 4.23,60 39.696,61 0.172,62 8.301}
{0 CHEMBL1823579,1 7.366,2 2.342,3 4.366,4 4.366,5 4.366,6 0.9,7 22.367,8 3.153,9 2.933,10 19.482,11 20.95,12 16.606,13 18.097,14 2.136,15 1.609,16 1.609,17 0.068,18 1.141,21 0.349,22 4.387,24 4.088,25 4.119,26 4.004,27 4.009,28 0.276,29 0.181,30 0.118,31 0.075,32 4.89,33 1,34 1,35 1,36 24.697,37 3.118,38 13.737,39 2.098,40 2.917,41 0.086,42 2.55,43 4.052,44 1,45 3.449,46 3.449,47 6.469,48 7.308,49 7.744,50 7.913,51 15.28,52 1.655,53 0.664,56 6.314,58 4.239,60 30.416,61 0.188,62 6.387}
{0 CHEMBL1823581,1 7.366,2 2.342,3 4.366,4 4.366,5 4.366,6 0.9,7 22.367,8 3.153,9 2.933,10 19.482,11 20.95,12 16.606,13 18.097,14 2.136,15 1.609,16 1.609,17 0.068,18 1.143,21 0.349,22 4.387,24 4.089,25 4.118,26 4.004,27 4.009,28 0.276,29 0.181,30 0.118,31 0.075,32 4.89,33 1,34 1,35 1,36 24.697,37 3.118,38 13.737,39 2.098,40 2.917,41 0.086,42 2.553,43 4.053,44 1,45 3.449,46 3.449,47 6.469,48 7.308,49 7.744,50 7.913,51 15.28,52 1.663,53 0.67,56 6.314,58 4.239,60 30.416,61 0.188,62 5.62}
{0 CHEMBL1823584,1 7.366,2 2.342,3 4.366,4 4.366,5 4.366,6 0.86,7 22.358,8 3.152,9 2.93,10 19.471,11 20.94,12 16.595,13 18.087,14 2.136,15 1.564,16 1.564,17 0.055,18 0.976,21 0.347,22 4.271,24 4.088,25 4.118,26 4.004,27 4.009,28 0.278,29 0.182,30 0.117,31 0.075,32 4.89,33 1,34 1,35 1,36 20.463,37 3.118,38 13.726,39 2.094,40 2.872,41 0.086,42 2.518,43 4.057,44 1,45 3.365,46 3.365,47 6.446,48 7.301,49 7.739,50 7.903,51 15.27,52 1.654,53 0.663,56 6.301,58 4.233,60 30.416,61 0.183,62 6.292}
{0 CHEMBL1823585,1 7.366,2 2.427,3 4.366,4 4.366,5 4.366,6 0.84,7 22.363,8 3.304,9 2.947,10 19.478,11 20.945,12 16.603,13 18.093,14 2.266,15 1.566,16 1.566,17 0.052,18 0.969,21 0.351,22 4.37,24 4.09,25 4.121,26 4.005,27 4.01,28 0.278,29 0.18,30 0.116,31 0.074,32 4.934,33 1.193,34 2,35 2,36 20.463,37 3.118,38 13.737,39 2.129,40 2.889,41 0.103,42 2.518,43 4.059,44 2,45 3.855,46 3.855,47 6.467,48 7.321,49 7.762,50 7.945,51 15.279,52 1.665,53 0.673,56 6.335,58 4.264,60 27.881,61 0.186,62 6.167}
{0 CHEMBL1823586,1 7.366,2 2.391,3 4.366,4 4.366,5 4.366,6 0.84,7 22.361,8 3.235,9 3.003,10 19.476,11 20.944,12 16.602,13 18.092,14 2.248,15 1.618,16 1.618,17 0.052,18 0.969,21 0.351,22 4.37,24 4.089,25 4.12,26 4.004,27 4.01,28 0.278,29 0.18,30 0.117,31 0.074,32 4.934,33 1.179,34 1,35 1,36 24.731,37 3.118,38 13.736,39 2.167,40 2.875,41 0.131,42 2.6,43 4.058,44 1,45 3.737,46 3.737,47 6.463,48 7.324,49 7.757,50 7.93,51 15.278,52 1.654,53 0.663,56 6.335,58 4.251,60 28.31,61 0.187,62 6.046}
{0 CHEMBL1823587,1 7.366,2 2.391,3 4.366,4 4.366,5 4.366,6 0.84,7 22.361,8 3.235,9 3.003,10 19.476,11 20.944,12 16.602,13 18.092,14 2.248,15 1.618,16 1.618,17 0.052,18 0.969,21 0.351,22 4.37,24 4.089,25 4.12,26 4.004,27 4.01,28 0.278,29 0.18,30 0.117,31 0.074,32 4.934,33 1.179,34 1,35 1,36 24.731,37 3.118,38 13.736,39 2.167,40 2.875,41 0.131,42 2.6,43 4.058,44 1,45 3.737,46 3.737,47 6.463,48 7.324,49 7.757,50 7.93,51 15.278,52 1.654,53 0.663,56 6.335,58 4.251,60 28.31,61 0.187,62 5.62}
{0 CHEMBL1823588,1 7.368,2 2.427,3 4.368,4 4.368,5 4.368,6 0.84,7 22.438,8 3.307,9 2.93,10 19.557,11 21.021,12 16.685,13 18.17,14 2.178,15 1.602,16 1.602,17 0.052,18 0.918,21 0.352,22 4.24,24 4.092,25 4.122,26 4.005,27 4.011,28 0.276,29 0.181,30 0.115,31 0.073,32 5.017,33 1.025,36 23.405,37 3.118,38 13.821,39 2.105,40 2.893,41 0.111,42 2.552,43 4.061,45 3.451,46 3.451,47 6.49,48 7.331,49 7.783,50 7.974,51 15.354,52 1.663,53 0.672,56 6.367,58 4.42,60 30.416,61 0.179,62 5.602}
{0 CHEMBL1823589,1 7.368,2 2.427,3 4.368,4 4.368,5 4.368,6 0.9,7 22.438,8 3.307,9 2.93,10 19.557,11 21.021,12 16.685,13 18.17,14 2.178,15 1.602,16 1.602,17 0.054,18 0.937,21 0.352,22 4.227,24 4.089,25 4.118,26 4.004,27 4.009,28 0.276,29 0.181,30 0.115,31 0.073,32 5.017,33 1.025,34 1,35 1,36 25.971,37 3.118,38 13.821,39 2.105,40 2.893,41 0.111,42 2.55,43 4.059,45 3.451,46 3.451,47 6.49,48 7.331,49 7.783,50 7.974,51 15.354,52 1.663,53 0.671,56 6.367,58 4.42,60 30.416,61 0.179,62 5.886}
{0 CHEMBL1823590,1 7.368,2 2.427,3 4.368,4 4.368,5 4.368,6 0.82,7 22.438,8 3.307,9 2.93,10 19.557,11 21.021,12 16.685,13 18.17,14 2.178,15 1.602,16 1.602,17 0.055,18 0.944,21 0.352,22 4.218,24 4.089,25 4.119,26 4.004,27 4.009,28 0.276,29 0.181,30 0.115,31 0.073,32 5.017,33 1.025,34 1,35 1,36 23.451,37 3.118,38 13.821,39 2.105,40 2.893,41 0.111,42 2.549,43 4.06,45 3.451,46 3.451,47 6.49,48 7.331,49 7.783,50 7.974,51 15.354,52 1.662,53 0.671,56 6.367,58 4.42,60 30.416,61 0.179,62 5.886}
{0 CHEMBL1823591,1 7.366,2 2.342,3 4.366,4 4.366,5 4.366,6 0.8,7 22.358,8 3.152,9 2.93,10 19.471,11 20.94,12 16.595,13 18.087,14 2.136,15 1.564,16 1.564,17 0.056,18 0.966,21 0.347,22 4.256,24 4.084,25 4.116,26 4.002,27 4.007,28 0.278,29 0.182,30 0.117,31 0.075,32 4.89,33 1,36 24.937,37 3.118,38 13.726,39 2.094,40 2.872,41 0.086,42 2.514,43 4.055,45 3.365,46 3.365,47 6.446,48 7.301,49 7.739,50 7.903,51 15.27,52 1.649,53 0.66,56 6.301,58 4.233,60 29.558,61 0.183,62 6.854}
{0 CHEMBL1823616,1 7.601,2 2.308,3 4.601,4 4.601,5 4.601,6 0.86,7 23.006,8 3.287,9 2.928,10 20,11 21.514,12 17.01,13 18.533,14 2.134,15 1.549,16 1.549,17 0.054,18 0.986,21 0.356,22 3.966,24 4.135,25 4.178,26 3.999,27 4.019,28 0.274,29 0.178,30 0.113,31 0.073,32 4.987,33 1,34 1,35 1,36 22.963,37 3.085,38 14.037,39 2.085,40 2.861,41 0.125,42 2.507,43 4.11,44 1,45 3.437,46 3.437,47 6.493,48 7.336,49 7.571,50 7.829,51 15.592,52 1.658,53 0.669,54 1,55 139.233,56 6.319,58 4.221,60 30.416,61 0.19,62 6.367}
{0 CHEMBL1823617,1 7.366,2 2.313,3 4.366,4 4.366,5 4.366,6 0.84,7 22.264,8 3.134,9 2.893,10 19.356,11 20.83,12 16.457,13 17.95,14 2.134,15 1.618,16 1.618,17 0.062,18 0.976,21 0.337,22 4.761,24 4.089,25 4.12,26 4.004,27 4.01,28 0.28,29 0.183,30 0.119,31 0.076,32 4.718,33 1,34 2,35 2,36 14.788,37 3.118,38 13.566,39 2.041,40 2.696,41 0.082,42 2.602,43 4.052,44 2,45 3.282,46 3.282,47 6.357,48 7.244,49 7.698,50 7.86,51 15.105,52 1.655,53 0.664,56 6.205,58 4.23,60 30.147,61 0.181,62 6.076}
{0 CHEMBL1823821,1 7.366,2 2.342,3 4.366,4 4.366,5 4.366,6 0.9,7 22.367,8 3.153,9 2.933,10 19.482,11 20.95,12 16.606,13 18.097,14 2.136,15 1.609,16 1.609,17 0.086,18 1.225,21 0.349,22 4.387,24 4.088,25 4.117,26 4.004,27 4.009,28 0.276,29 0.181,30 0.118,31 0.075,32 4.89,33 1,34 1,35 1,36 21.179,37 3.118,38 13.737,39 2.098,40 2.917,41 0.086,42 2.536,43 4.052,44 1,45 3.449,46 3.449,47 6.469,48 7.308,49 7.744,50 7.913,51 15.28,52 1.654,53 0.663,56 6.314,58 4.239,60 12.405,61 0.188,62 6.602}
{0 CHEMBL1823822,1 7.366,2 2.341,3 4.366,4 4.366,5 4.366,6 0.9,7 22.285,8 3.153,9 2.94,10 19.386,11 20.863,12 16.499,13 18.001,14 2.145,15 1.568,16 1.568,17 0.088,18 1.181,21 0.339,22 4.446,24 4.087,25 4.117,26 4.004,27 4.009,28 0.28,29 0.184,30 0.119,31 0.076,32 4.783,33 1.003,34 1,35 1,36 19.215,37 3.118,38 13.621,39 2.105,40 2.886,41 0.087,42 2.53,43 4.051,44 1,45 3.185,46 3.185,47 6.405,48 7.279,49 7.728,50 7.883,51 15.18,52 1.661,53 0.67,56 6.273,58 4.23,60 16.997,61 0.178,62 5.602}
{0 CHEMBL1823825,1 7.366,2 2.427,3 4.366,4 4.366,5 4.366,6 0.9,7 22.326,8 3.327,9 3.118,10 19.437,11 20.907,12 16.559,13 18.053,14 2.136,15 1.618,16 1.618,17 0.068,18 1.132,21 0.344,22 4.525,24 4.088,25 4.119,26 4.004,27 4.009,28 0.278,29 0.182,30 0.118,31 0.075,32 4.89,33 1,34 1,35 1,36 28.989,37 3.13,38 13.692,39 2.326,40 2.891,41 0.118,42 2.603,43 4.052,44 1,45 3.584,46 3.584,47 6.479,48 7.314,49 7.742,50 7.905,51 15.239,52 1.654,53 0.663,56 6.314,58 4.23,60 30.416,61 0.183,62 6.387}
{0 CHEMBL1823827,1 7.366,2 2.374,3 4.366,4 4.366,5 4.366,6 0.9,7 22.403,8 3.207,9 3.025,10 19.52,11 20.986,12 16.647,13 18.134,14 2.158,15 1.618,16 1.618,17 0.065,18 1.231,21 0.359,22 4.345,24 4.089,25 4.12,26 4.004,27 4.01,28 0.273,29 0.18,30 0.116,31 0.074,32 4.934,33 1.016,34 1,35 1,36 25.044,37 3.118,38 13.779,39 2.184,40 2.917,41 0.119,42 2.602,43 4.053,44 1,45 3.533,46 3.533,47 6.488,48 7.319,49 7.751,50 7.92,51 15.318,52 1.673,53 0.68,56 6.348,58 4.36,60 15.529,61 0.193,62 5.509}
{0 CHEMBL1823828,1 7.366,2 2.342,3 4.366,4 4.366,5 4.366,6 0.9,7 22.358,8 3.152,9 2.93,10 19.471,11 20.94,12 16.595,13 18.087,14 2.136,15 1.564,16 1.564,17 0.052,18 1.069,21 0.347,22 4.167,24 4.088,25 4.119,26 4.004,27 4.01,28 0.278,29 0.182,30 0.117,31 0.075,32 4.89,33 1,34 1,35 1,36 21.843,37 3.118,38 13.726,39 2.094,40 2.872,41 0.086,42 2.529,43 4.052,44 1,45 3.365,46 3.365,47 6.446,48 7.301,49 7.739,50 7.903,51 15.27,52 1.654,53 0.663,56 6.301,58 4.233,60 30.416,61 0.183,62 6.357}
{0 CHEMBL1823829,1 7.366,2 2.382,3 4.366,4 4.366,5 4.366,6 0.82,7 22.411,8 3.22,9 3.038,10 19.529,11 20.994,12 16.655,13 18.142,14 2.287,15 1.618,16 1.618,17 0.032,18 1.207,21 0.356,22 3.892,24 4.092,25 4.124,26 4.006,27 4.012,28 0.269,29 0.175,30 0.113,31 0.072,32 4.934,33 1.21,34 1,35 1,36 25.842,37 3.118,38 13.787,39 2.204,40 2.944,41 0.114,42 2.614,43 4.054,44 1,45 3.845,46 3.845,47 6.543,48 7.384,49 7.807,50 7.957,51 15.326,52 1.94,53 0.938,56 6.37,58 4.39,60 22.704,61 0.198,62 5.638}
{0 CHEMBL1823831,1 7.366,2 2.427,3 4.366,4 4.366,5 4.366,6 0.82,7 22.47,8 3.596,9 3.118,10 19.587,11 21.051,12 16.712,13 18.198,14 2.304,15 1.618,16 1.618,17 0.052,18 1.224,21 0.342,22 4.787,24 4.089,25 4.119,26 4.004,27 4.01,28 0.284,29 0.177,30 0.115,31 0.074,32 5.056,33 1.222,34 1,35 1,36 24.408,37 3.148,38 13.844,39 2.34,40 2.93,41 0.152,42 2.604,43 4.053,44 1,45 3.931,46 3.931,47 6.514,48 7.323,49 7.753,50 7.934,51 15.377,52 1.928,53 0.925,56 6.411,58 4.462,60 30.416,61 0.182,62 6.155}
{0 CHEMBL1823832,1 7.366,2 2.351,3 4.366,4 4.366,5 4.366,6 0.84,7 22.39,8 3.185,9 3.118,10 19.505,11 20.972,12 16.63,13 18.12,14 2.3,15 1.618,16 1.618,17 0.063,18 1.16,21 0.347,22 4.623,24 4.09,25 4.121,26 4.005,27 4.011,28 0.28,29 0.179,30 0.117,31 0.075,32 4.934,33 1.217,34 1,35 2,36 23.313,37 3.121,38 13.761,39 2.296,40 2.93,41 0.119,42 2.604,43 4.053,44 2,45 3.656,46 3.656,47 6.492,48 7.315,49 7.748,50 7.924,51 15.303,52 1.928,53 0.925,56 6.348,58 4.295,60 30.416,61 0.186,62 6.319}
{0 CHEMBL1823833,1 7.366,2 2.346,3 4.366,4 4.366,5 4.366,6 0.9,7 22.394,8 3.369,9 3.118,10 19.51,11 20.977,12 16.635,13 18.125,14 2.304,15 1.609,16 1.609,17 0.054,18 1.16,21 0.349,22 4.218,24 4.088,25 4.119,26 4.004,27 4.01,28 0.276,29 0.181,30 0.118,31 0.075,32 4.89,33 1,34 1,35 1,36 22.328,37 3.147,38 13.764,39 2.25,40 2.93,41 0.086,42 2.574,43 4.052,44 1,45 3.449,46 3.449,47 6.514,48 7.323,49 7.753,50 7.934,51 15.308,52 1.655,53 0.664,56 6.37,58 4.283,60 30.416,61 0.188,62 6.721}
{0 CHEMBL1823834,1 7.432,2 2.427,3 4.432,4 4.432,5 4.432,6 0.82,7 22.99,8 3.457,9 3.118,10 20.045,11 21.536,12 17.102,13 18.615,14 2.367,15 1.618,16 1.618,17 0.049,18 1.178,21 0.351,22 4.143,24 4.101,25 4.133,26 4.016,27 4.022,28 0.273,29 0.177,30 0.115,31 0.074,32 5.075,33 1.319,34 1,35 1,36 22.633,37 3.139,38 14.159,39 2.427,40 3.118,41 0.111,42 2.603,43 4.063,44 1,45 3.902,46 3.902,47 6.774,48 7.618,49 8.033,50 8.079,51 15.721,52 1.961,53 0.958,56 6.436,58 4.462,60 30.416,61 0.193,62 5.854}
{0 CHEMBL1823835,1 7.366,2 2.342,3 4.366,4 4.366,5 4.366,6 0.9,7 22.358,8 3.152,9 2.93,10 19.471,11 20.94,12 16.595,13 18.087,14 2.136,15 1.564,16 1.564,17 0.056,18 0.987,21 0.347,22 4.247,24 4.087,25 4.118,26 4.003,27 4.009,28 0.278,29 0.182,30 0.117,31 0.075,32 4.89,33 1,34 1,35 1,36 20.463,37 3.118,38 13.726,39 2.094,40 2.872,41 0.086,42 2.498,43 4.055,44 1,45 3.365,46 3.365,47 6.446,48 7.301,49 7.739,50 7.903,51 15.27,52 1.654,53 0.663,56 6.301,58 4.233,60 30.416,61 0.183,62 5.796}
{0 CHEMBL1823836,1 7.366,2 2.342,3 4.366,4 4.366,5 4.366,6 0.9,7 22.358,8 3.152,9 2.93,10 19.471,11 20.94,12 16.595,13 18.087,14 2.136,15 1.564,16 1.564,17 0.056,18 0.872,21 0.347,22 4.247,24 4.087,25 4.118,26 4.003,27 4.009,28 0.278,29 0.182,30 0.117,31 0.075,32 4.89,33 1,34 1,35 1,36 20.463,37 3.118,38 13.726,39 2.094,40 2.872,41 0.086,42 2.51,43 4.056,44 1,45 3.365,46 3.365,47 6.446,48 7.301,49 7.739,50 7.903,51 15.27,52 1.654,53 0.663,56 6.301,58 4.233,60 30.416,61 0.183,62 5.699}
{0 CHEMBL1823837,1 7.366,2 2.342,3 4.366,4 4.366,5 4.366,6 0.86,7 22.358,8 3.152,9 2.93,10 19.471,11 20.94,12 16.595,13 18.087,14 2.136,15 1.564,16 1.564,17 0.056,18 0.963,21 0.347,22 4.247,24 4.087,25 4.118,26 4.003,27 4.009,28 0.278,29 0.182,30 0.117,31 0.075,32 4.89,33 1,34 1,35 1,36 20.463,37 3.118,38 13.726,39 2.094,40 2.872,41 0.086,42 2.514,43 4.055,44 1,45 3.365,46 3.365,47 6.446,48 7.301,49 7.739,50 7.903,51 15.27,52 1.654,53 0.663,56 6.301,58 4.233,60 30.416,61 0.183,62 5.553}
{0 CHEMBL1823838,1 7.366,2 2.34,3 4.366,4 4.366,5 4.366,6 0.88,7 22.505,8 3.15,9 3.055,10 19.621,11 21.081,12 16.744,13 18.22,14 2.134,15 1.618,16 1.618,17 0.053,18 1.047,21 0.354,22 3.967,24 4.088,25 4.119,26 4.003,27 4.009,28 0.276,29 0.18,30 0.115,31 0.075,32 4.987,33 1,34 1,35 1,36 21.435,37 3.118,38 13.869,39 2.224,40 2.903,41 0.102,42 2.604,43 4.052,44 1,45 4.028,46 4.028,47 6.419,48 7.288,49 7.727,50 7.898,51 15.389,52 1.653,53 0.662,54 1,56 6.319,58 4.381,60 30.416,61 0.186,62 5.523}
{0 CHEMBL1823839,1 7.366,2 2.337,3 4.366,4 4.366,5 4.366,6 0.9,7 22.264,8 3.149,9 2.899,10 19.356,11 20.83,12 16.457,13 17.95,14 2.015,15 1.509,16 1.509,17 0.069,18 1.12,21 0.344,22 3.994,24 4.088,25 4.119,26 4.004,27 4.009,28 0.277,29 0.182,30 0.117,31 0.074,32 4.718,33 0.927,34 2,35 2,36 17.633,37 3.118,38 13.566,39 2.05,40 2.689,41 0.066,42 2.475,43 4.051,44 2,45 3.12,46 3.12,47 6.338,48 7.235,49 7.69,50 7.853,51 15.105,52 1.582,53 0.595,56 6.176,58 4.23,60 40.125,61 0.169,62 6.387}
{0 CHEMBL1823840,1 7.366,2 2.318,3 4.366,4 4.366,5 4.366,6 0.9,7 22.264,8 3.135,9 2.892,10 19.357,11 20.83,12 16.458,13 17.951,14 2.099,15 1.478,16 1.478,17 0.052,18 1.199,21 0.343,22 3.994,24 4.088,25 4.119,26 4.003,27 4.009,28 0.277,29 0.181,30 0.117,31 0.074,32 4.718,33 0.965,34 1,35 1,36 22.633,37 3.118,38 13.567,39 2.041,40 2.665,41 0.076,42 2.457,43 4.051,44 1,45 3.093,46 3.093,47 6.341,48 7.238,49 7.693,50 7.856,51 15.106,52 1.618,53 0.618,56 6.176,58 4.23,60 40.554,61 0.184,62 6.201}
{0 CHEMBL1823841,1 7.366,2 2.315,3 4.366,4 4.366,5 4.366,6 0.9,7 22.264,8 3.134,9 2.893,10 19.357,11 20.83,12 16.458,13 17.95,14 2.118,15 1.533,16 1.533,17 0.049,18 1.123,21 0.34,22 4.37,24 4.088,25 4.119,26 4.004,27 4.009,28 0.279,29 0.182,30 0.118,31 0.075,32 4.718,33 1,34 1,35 1,36 22.633,37 3.118,38 13.566,39 2.041,40 2.674,41 0.073,42 2.506,43 4.051,44 1,45 3.152,46 3.152,47 6.345,48 7.242,49 7.695,50 7.858,51 15.105,52 1.654,53 0.663,56 6.19,58 4.23,60 43.088,61 0.183,62 7.244}
{0 CHEMBL1823842,1 7.366,2 2.315,3 4.366,4 4.366,5 4.366,6 0.9,7 22.264,8 3.134,9 2.893,10 19.357,11 20.83,12 16.458,13 17.95,14 2.118,15 1.533,16 1.533,17 0.067,18 1.208,21 0.34,22 4.37,24 4.088,25 4.118,26 4.003,27 4.009,28 0.279,29 0.182,30 0.118,31 0.075,32 4.718,33 1,34 1,35 1,36 17.891,37 3.118,38 13.566,39 2.041,40 2.674,41 0.073,42 2.495,43 4.051,44 1,45 3.152,46 3.152,47 6.345,48 7.242,49 7.695,50 7.858,51 15.105,52 1.653,53 0.662,56 6.19,58 4.23,60 25.077,61 0.183,62 6.237}
{0 CHEMBL1823853,1 7.366,2 2.337,3 4.366,4 4.366,5 4.366,6 0.9,7 22.264,8 3.167,9 3.035,10 19.357,11 20.831,12 16.459,13 17.951,14 2.118,15 1.618,16 1.618,17 0.048,18 1.077,21 0.341,22 4.58,24 4.088,25 4.119,26 4.004,27 4.009,28 0.28,29 0.183,30 0.117,31 0.075,32 4.771,33 1,34 1,35 1,36 23.796,37 3.118,38 13.57,39 2.091,40 2.88,41 0.093,42 2.603,43 4.051,44 1,45 3.585,46 3.585,47 6.352,48 7.245,49 7.697,50 7.86,51 15.107,52 1.655,53 0.664,56 6.229,58 4.23,60 40.554,61 0.178,62 5.569}
{0 CHEMBL1823854,1 7.366,2 2.315,3 4.366,4 4.366,5 4.366,6 0.9,7 22.264,8 3.134,9 2.893,10 19.357,11 20.83,12 16.458,13 17.95,14 2.118,15 1.533,16 1.533,17 0.051,18 1.107,21 0.34,22 4.355,24 4.087,25 4.118,26 4.003,27 4.009,28 0.279,29 0.182,30 0.118,31 0.075,32 4.718,33 1,34 1,35 1,36 29.531,37 3.118,38 13.566,39 2.041,40 2.674,41 0.073,42 2.463,43 4.051,44 1,45 3.152,46 3.152,47 6.345,48 7.242,49 7.695,50 7.858,51 15.105,52 1.653,53 0.662,56 6.19,58 4.23,60 44.669,61 0.183,62 6.319}
{0 CHEMBL1823855,1 7.366,2 2.315,3 4.366,4 4.366,5 4.366,6 0.9,7 22.264,8 3.134,9 2.893,10 19.357,11 20.83,12 16.458,13 17.95,14 2.118,15 1.533,16 1.533,17 0.05,18 1.116,21 0.34,22 4.355,24 4.088,25 4.119,26 4.003,27 4.009,28 0.279,29 0.182,30 0.118,31 0.075,32 4.718,33 1,34 1,35 1,36 35.133,37 3.118,38 13.566,39 2.041,40 2.674,41 0.073,42 2.479,43 4.051,44 1,45 3.152,46 3.152,47 6.345,48 7.242,49 7.695,50 7.858,51 15.105,52 1.654,53 0.663,56 6.19,58 4.23,60 39.696,61 0.183,62 5.602}
{0 CHEMBL1823856,1 7.366,2 2.337,3 4.366,4 4.366,5 4.366,6 0.9,7 22.264,8 3.167,9 3.035,10 19.357,11 20.831,12 16.459,13 17.951,14 2.118,15 1.618,16 1.618,17 0.048,18 1.033,21 0.341,22 4.58,24 4.088,25 4.119,26 4.004,27 4.009,28 0.28,29 0.183,30 0.117,31 0.075,32 4.771,33 1,34 1,35 1,36 34.918,37 3.118,38 13.57,39 2.091,40 2.88,41 0.093,42 2.603,43 4.051,44 1,45 3.585,46 3.585,47 6.352,48 7.245,49 7.697,50 7.86,51 15.107,52 1.655,53 0.664,56 6.229,58 4.23,60 39.696,61 0.178,62 5.495}
{0 CHEMBL1823857,1 7.366,2 2.41,3 4.366,4 4.366,5 4.366,6 0.88,7 22.268,8 3.364,9 3.118,10 19.364,11 20.836,12 16.472,13 17.96,14 2.133,15 1.618,16 1.618,17 0.046,18 1.093,21 0.343,22 4.923,24 4.088,25 4.12,26 4.004,27 4.009,28 0.281,29 0.182,30 0.118,31 0.074,32 4.868,33 1,34 1,35 1,36 34.92,37 3.129,38 13.594,39 2.298,40 2.891,41 0.11,42 2.603,43 4.052,44 1,45 3.657,46 3.657,47 6.373,48 7.258,49 7.702,50 7.864,51 15.124,52 1.929,53 0.925,56 6.303,58 4.23,60 42.82,61 0.176,62 6.301}
{0 CHEMBL1823858,1 7.366,2 2.362,3 4.366,4 4.366,5 4.366,6 0.9,7 22.266,8 3.253,9 3.108,10 19.36,11 20.833,12 16.465,13 17.955,14 2.118,15 1.618,16 1.618,17 0.05,18 0.963,21 0.341,22 4.654,24 4.088,25 4.119,26 4.004,27 4.009,28 0.28,29 0.183,30 0.117,31 0.075,32 4.82,33 1,34 1,35 1,36 25.97,37 3.118,38 13.581,39 2.222,40 2.885,41 0.093,42 2.603,43 4.331,44 1,45 3.585,46 3.585,47 6.359,48 7.248,49 7.699,50 7.861,51 15.115,52 1.655,53 0.664,56 6.254,58 4.23,60 37.284,61 0.178,62 6.071}
{0 CHEMBL1823859,1 7.474,2 2.396,3 4.474,4 4.474,5 4.474,6 0.85,7 23.069,8 3.348,9 3.118,10 20.113,11 21.6,12 17.163,13 18.659,14 2.118,15 1.618,16 1.618,17 0.049,18 0.961,21 0.339,22 4.82,24 4.1,25 4.123,26 4.072,27 4.012,28 0.283,29 0.182,30 0.116,31 0.075,32 5.215,33 1,34 1,35 1,36 26.619,37 3.123,38 14.219,39 2.282,40 2.887,41 0.122,42 2.603,43 4.734,44 1,45 3.615,46 3.615,47 6.373,48 7.254,49 7.702,50 7.864,51 15.739,52 1.656,53 0.665,56 6.356,58 4.462,60 37.284,61 0.172,62 6.444}
{0 CHEMBL1823861,1 7.601,2 2.293,3 4.601,4 4.601,5 4.601,6 0.9,7 22.958,8 3.278,9 2.862,10 19.934,11 21.454,12 16.921,13 18.448,14 2.079,15 1.527,16 1.527,17 0.048,18 1.143,21 0.349,22 4.044,24 4.136,25 4.178,26 3.999,27 4.019,28 0.275,29 0.178,30 0.114,31 0.073,32 4.832,33 1,34 1,35 1,36 25.133,37 3.075,38 13.923,39 1.966,40 2.638,41 0.112,42 2.499,43 4.108,44 1,45 3.204,46 3.204,47 6.396,48 7.279,49 7.519,50 7.781,51 15.475,52 1.657,53 0.669,54 1,55 133.679,56 6.21,58 4.211,60 43.088,61 0.19,62 7.051}
{0 CHEMBL1823862,1 7.601,2 2.369,3 4.601,4 4.601,5 4.601,6 0.85,7 23.439,8 3.358,9 3.07,10 20.425,11 21.937,12 17.418,13 18.934,14 2.079,15 1.656,16 1.656,17 0.048,18 0.973,21 0.347,22 4.48,24 4.139,25 4.18,26 4.072,27 4.021,28 0.279,29 0.178,30 0.112,31 0.072,32 5.286,33 1,34 1,35 1,36 29.119,37 3.265,38 14.42,39 2.274,40 2.852,41 0.162,42 2.62,43 4.734,44 1,45 3.676,46 3.676,47 6.423,48 7.29,49 7.528,50 7.788,51 15.952,52 1.66,53 0.671,54 1,55 147.583,56 6.373,58 4.66,60 37.284,61 0.179,62 6.456}
{0 CHEMBL1823863,1 7.601,2 2.293,3 4.601,4 4.601,5 4.601,6 0.88,7 22.958,8 3.278,9 2.862,10 19.934,11 21.454,12 16.921,13 18.448,14 2.079,15 1.527,16 1.527,17 0.049,18 1.12,21 0.349,22 4.03,24 4.133,25 4.177,26 3.997,27 4.016,28 0.275,29 0.178,30 0.114,31 0.073,32 4.832,33 1,36 29.607,37 3.075,38 13.923,39 1.966,40 2.638,41 0.112,42 2.497,43 4.107,45 3.204,46 3.204,47 6.396,48 7.279,49 7.519,50 7.781,51 15.475,52 1.651,53 0.664,54 1,55 133.679,56 6.21,58 4.211,60 42.231,61 0.19,62 8.301}
{0 CHEMBL1823865,1 7.366,2 2.315,3 4.366,4 4.366,5 4.366,6 0.9,7 22.264,8 3.134,9 2.893,10 19.357,11 20.83,12 16.458,13 17.95,14 2.118,15 1.533,16 1.533,17 0.05,18 1.1,21 0.34,22 4.355,24 4.085,25 4.116,26 4.002,27 4.007,28 0.279,29 0.182,30 0.118,31 0.075,32 4.718,33 1,36 27.107,37 3.118,38 13.566,39 2.041,40 2.674,41 0.073,42 2.503,43 4.049,45 3.152,46 3.152,47 6.345,48 7.242,49 7.695,50 7.858,51 15.105,52 1.649,53 0.659,56 6.19,58 4.23,60 42.231,61 0.183,62 7.276}
{0 CHEMBL2086402,1 7.609,2 2.373,3 4.609,4 4.609,5 4.609,6 0.95,7 22.985,8 3.504,9 3.13,10 19.959,11 21.477,12 16.946,13 18.467,14 2,15 1.836,16 1.836,17 0.116,18 0.994,21 0.359,22 4.589,24 4.132,25 4.159,26 4.021,27 4.038,28 0.272,29 0.167,30 0.103,31 0.065,32 5.007,33 1,36 47.651,37 3.22,38 13.953,39 2.212,40 2.886,41 0.182,42 2.77,43 4.11,45 4.285,46 4.285,47 6.539,48 7.344,49 7.658,50 7.843,51 15.49,52 1.621,53 0.614,54 2,55 115.457,56 6.316,58 4.289,60 37.161,61 0.21,62 7}
{0 CHEMBL2086774,1 5.782,2 2.14,3 3.782,4 3.782,5 3.782,6 0.88,7 20.382,8 3.215,9 2.653,10 17.771,11 19.076,12 15.169,13 16.471,14 1.22,15 1.653,16 1.653,17 0.062,18 1.052,21 0.36,22 3.829,24 4.126,25 4.163,26 4.05,27 4.04,28 0.274,29 0.16,30 0.099,31 0.06,32 4.796,33 0.22,34 5,35 7,36 5.814,37 3.14,38 12.582,39 1.653,40 2.324,41 0.173,42 2.65,43 4.03,44 6,45 4.008,46 4.008,47 5.165,48 5.602,49 5.733,50 5.799,51 13.884,52 0.981,53 -0.004,55 78.374,56 6.157,58 4.604,60 27.88,61 0.191,62 6.097}
{0 CHEMBL2086775,1 5.782,2 1.751,3 3.782,4 3.782,5 3.782,6 0.88,7 20.382,8 3.141,9 2.65,10 17.77,11 19.076,12 15.168,13 16.47,14 1.224,15 1.65,16 1.65,17 0.074,18 1.052,21 0.365,22 3.829,24 4.125,25 4.163,26 4.05,27 4.04,28 0.27,29 0.161,30 0.099,31 0.061,32 4.745,33 0.224,34 5,35 6,36 5.814,37 2.751,38 12.578,39 1.65,40 2.296,41 0.169,42 2.646,43 4.029,44 5,45 3.306,46 3.306,47 5.153,48 5.595,49 5.733,50 5.793,51 13.882,52 1.141,53 0.152,55 78.594,56 6.131,58 4.604,60 32.949,61 0.197,62 6.398}
{0 CHEMBL2086776,1 5.782,2 1.812,3 3.782,4 3.782,5 3.782,6 0.82,7 20.382,8 3.141,9 2.652,10 17.77,11 19.076,12 15.168,13 16.47,14 1.525,15 1.652,16 1.652,17 0.083,18 1.052,21 0.361,22 4.143,24 4.126,25 4.164,26 4.05,27 4.04,28 0.272,29 0.162,30 0.1,31 0.061,32 4.745,33 0.525,34 5,35 6,36 5.814,37 2.812,38 12.578,39 1.652,40 2.36,41 0.189,42 2.649,43 4.03,44 5,45 3.481,46 3.481,47 5.159,48 5.606,49 5.74,50 5.805,51 13.882,52 1.173,53 0.207,55 83.198,56 6.146,58 4.604,60 35.483,61 0.194,62 6.301}
{0 CHEMBL2086777,1 5.782,2 1.673,3 3.782,4 3.782,5 3.782,6 0.91,7 20.382,8 3.141,9 2.631,10 17.77,11 19.076,12 15.168,13 16.47,14 1.22,15 1.631,16 1.631,17 0.064,18 1.051,21 0.369,22 3.517,24 4.125,25 4.162,26 4.049,27 4.039,28 0.269,29 0.16,30 0.098,31 0.06,32 4.745,33 0.22,34 5,35 6,36 5.814,37 2.673,38 12.578,39 1.631,40 2.265,41 0.161,42 2.628,43 4.029,44 5,45 3.066,46 3.066,47 5.147,48 5.587,49 5.72,50 5.781,51 13.882,52 0.981,53 -0.005,55 74.19,56 6.116,58 4.604,60 30.414,61 0.2,62 5.18}
{0 CHEMBL2086778,1 6.782,2 2.142,3 3.782,4 3.782,5 3.782,6 0.85,7 20.513,8 3.375,9 2.939,10 17.913,11 19.256,12 15.319,13 16.681,14 2.072,15 1.655,16 1.655,17 0.06,18 1.042,21 0.367,22 4.005,24 4.128,25 4.165,26 4.052,27 4.042,28 0.27,29 0.163,30 0.102,31 0.063,32 4.856,33 1.065,34 5,35 6,36 7.285,37 3.141,38 12.733,39 2.106,40 2.653,41 0.181,42 2.652,43 4.032,44 5,45 4.041,46 4.041,47 5.369,48 5.798,49 5.966,50 6.102,51 14.127,52 1.748,53 0.749,55 88.934,56 6.294,58 4.604,60 27.88,61 0.198,62 5.602}
{0 CHEMBL2086779,1 6.782,2 2.142,3 3.782,4 3.782,5 3.782,6 0.98,7 20.513,8 3.375,9 2.939,10 17.913,11 19.256,12 15.319,13 16.681,14 2.072,15 1.655,16 1.655,17 0.061,18 1.036,21 0.367,22 3.985,24 4.127,25 4.165,26 4.051,27 4.041,28 0.27,29 0.163,30 0.102,31 0.063,32 4.856,33 1.065,34 5,35 6,36 7.285,37 3.141,38 12.733,39 2.106,40 2.653,41 0.181,42 2.652,43 4.032,44 5,45 4.041,46 4.041,47 5.369,48 5.798,49 5.966,50 6.102,51 14.127,52 1.748,53 0.749,55 88.934,56 6.294,58 4.604,60 27.88,61 0.198,62 5.921}
{0 CHEMBL2086780,1 6.782,2 2.142,3 3.782,4 3.782,5 3.782,6 0.98,7 20.513,8 3.375,9 2.939,10 17.913,11 19.256,12 15.319,13 16.681,14 2.072,15 1.655,16 1.655,17 0.061,18 1.028,21 0.367,22 3.985,24 4.127,25 4.165,26 4.051,27 4.041,28 0.27,29 0.163,30 0.102,31 0.063,32 4.856,33 1.065,34 5,35 6,36 7.285,37 3.141,38 12.733,39 2.106,40 2.653,41 0.181,42 2.652,43 4.032,44 5,45 4.041,46 4.041,47 5.369,48 5.798,49 5.966,50 6.102,51 14.127,52 1.747,53 0.748,55 88.934,56 6.294,58 4.604,60 27.88,61 0.198,62 5.301}
{0 CHEMBL2086781,1 5.79,2 1.753,3 3.79,4 3.79,5 3.79,6 0.82,7 20.421,8 3.142,9 2.652,10 17.805,11 19.113,12 15.2,13 16.504,14 1.423,15 1.652,16 1.652,17 0.083,18 1.04,21 0.373,22 3.93,24 4.127,25 4.165,26 4.051,27 4.042,28 0.266,29 0.163,30 0.098,31 0.061,32 4.745,33 0.423,34 5,35 6,36 5.814,37 2.753,38 12.608,39 1.652,40 2.311,41 0.177,42 2.648,43 4.032,44 5,45 3.344,46 3.344,47 5.182,48 5.631,49 5.781,50 5.844,51 13.913,52 1.181,53 0.212,55 81.971,56 6.146,58 4.611,60 35.483,61 0.2,62 5.538}
{0 CHEMBL2086782,1 6.953,2 2.145,3 3.953,4 3.953,5 3.953,6 0.85,7 21.002,8 3.36,9 2.773,10 18.312,11 19.684,12 15.631,13 17.018,14 2.109,15 1.748,16 1.748,17 0.079,18 1.035,21 0.368,22 4.221,24 4.136,25 4.172,26 4.063,27 4.054,28 0.265,29 0.161,30 0.099,31 0.061,32 4.856,33 1.109,34 5,35 6,36 12.061,37 3.141,38 12.96,39 1.813,40 2.699,41 0.239,42 2.748,43 4.045,44 5,45 3.968,46 3.968,47 5.622,48 6.132,49 6.351,50 6.493,51 14.374,52 1.927,53 0.924,55 93.431,56 6.319,58 4.64,60 32.949,61 0.204,62 5}
{0 CHEMBL2086783,1 5.782,2 2.14,3 3.782,4 3.782,5 3.782,6 0.88,7 20.382,8 3.215,9 2.653,10 17.771,11 19.076,12 15.169,13 16.471,14 1.22,15 1.653,16 1.653,17 0.062,18 1.052,21 0.36,22 3.829,24 4.126,25 4.163,26 4.05,27 4.04,28 0.274,29 0.16,30 0.099,31 0.06,32 4.796,33 0.22,34 5,35 7,36 5.814,37 3.14,38 12.582,39 1.653,40 2.324,41 0.173,42 2.65,43 4.03,44 6,45 4.008,46 4.008,47 5.165,48 5.602,49 5.733,50 5.799,51 13.884,52 0.981,53 -0.004,55 78.374,56 6.157,58 4.604,60 27.88,61 0.191,62 5}
{0 CHEMBL2086784,1 5.782,2 1.751,3 3.782,4 3.782,5 3.782,6 0.97,7 20.382,8 3.141,9 2.65,10 17.77,11 19.076,12 15.168,13 16.47,14 1.224,15 1.65,16 1.65,17 0.076,18 1.028,21 0.365,22 3.817,24 4.125,25 4.162,26 4.049,27 4.039,28 0.27,29 0.161,30 0.099,31 0.061,32 4.745,33 0.224,34 5,35 6,36 8.14,37 2.751,38 12.578,39 1.65,40 2.296,41 0.169,42 2.642,43 4.029,44 5,45 3.306,46 3.306,47 5.153,48 5.595,49 5.733,50 5.793,51 13.882,52 1.087,53 0.143,55 78.594,56 6.131,58 4.604,60 32.472,61 0.197,62 5.509}
{0 CHEMBL2086785,1 5.782,2 2.14,3 3.782,4 3.782,5 3.782,6 0.88,7 20.382,8 3.215,9 2.653,10 17.771,11 19.076,12 15.169,13 16.471,14 1.22,15 1.653,16 1.653,17 0.062,18 1.052,21 0.36,22 3.829,24 4.126,25 4.163,26 4.05,27 4.04,28 0.274,29 0.16,30 0.099,31 0.06,32 4.796,33 0.22,34 5,35 7,36 5.814,37 3.14,38 12.582,39 1.653,40 2.324,41 0.173,42 2.65,43 4.03,44 6,45 4.008,46 4.008,47 5.165,48 5.602,49 5.733,50 5.799,51 13.884,52 0.981,53 -0.004,55 78.374,56 6.157,58 4.604,60 27.88,61 0.191,62 6.097}
{0 CHEMBL2086786,1 5.782,2 1.751,3 3.782,4 3.782,5 3.782,6 0.88,7 20.382,8 3.141,9 2.65,10 17.77,11 19.076,12 15.168,13 16.47,14 1.224,15 1.65,16 1.65,17 0.074,18 1.052,21 0.365,22 3.829,24 4.125,25 4.163,26 4.05,27 4.04,28 0.27,29 0.161,30 0.099,31 0.061,32 4.745,33 0.224,34 5,35 6,36 5.814,37 2.751,38 12.578,39 1.65,40 2.296,41 0.169,42 2.646,43 4.029,44 5,45 3.306,46 3.306,47 5.153,48 5.595,49 5.733,50 5.793,51 13.882,52 1.141,53 0.152,55 78.594,56 6.131,58 4.604,60 32.949,61 0.197,62 6.523}
{0 CHEMBL2086787,1 5.782,2 2.14,3 3.782,4 3.782,5 3.782,6 0.88,7 20.382,8 3.215,9 2.653,10 17.771,11 19.076,12 15.169,13 16.471,14 1.22,15 1.653,16 1.653,17 0.062,18 1.052,21 0.36,22 3.829,24 4.126,25 4.163,26 4.05,27 4.04,28 0.274,29 0.16,30 0.099,31 0.06,32 4.796,33 0.22,34 5,35 7,36 5.814,37 3.14,38 12.582,39 1.653,40 2.324,41 0.173,42 2.65,43 4.03,44 6,45 4.008,46 4.008,47 5.165,48 5.602,49 5.733,50 5.799,51 13.884,52 0.981,53 -0.004,55 78.374,56 6.157,58 4.604,60 27.88,61 0.191,62 5.959}
{0 CHEMBL2086788,1 5.782,2 2.14,3 3.782,4 3.782,5 3.782,6 0.88,7 20.382,8 3.215,9 2.653,10 17.771,11 19.076,12 15.169,13 16.471,14 1.22,15 1.653,16 1.653,17 0.062,18 1.052,21 0.36,22 3.829,24 4.126,25 4.163,26 4.05,27 4.04,28 0.274,29 0.16,30 0.099,31 0.06,32 4.796,33 0.22,34 5,35 7,36 5.814,37 3.14,38 12.582,39 1.653,40 2.324,41 0.173,42 2.65,43 4.03,44 6,45 4.008,46 4.008,47 5.165,48 5.602,49 5.733,50 5.799,51 13.884,52 0.981,53 -0.004,55 78.374,56 6.157,58 4.604,60 27.88,61 0.191,62 6}
{0 CHEMBL2086798,1 7.484,2 2.503,3 4.484,4 4.484,5 4.484,6 0.88,7 22.633,8 3.532,9 3.127,10 19.682,11 21.171,12 16.746,13 18.246,14 2.5,15 1.773,16 1.773,17 0.121,18 1.237,21 0.355,22 4.684,24 4.089,25 4.099,26 4.067,27 4.035,28 0.273,29 0.172,30 0.107,31 0.067,32 4.966,33 1.474,36 31.885,37 3.249,38 13.828,39 2.299,40 2.907,41 0.218,42 2.735,43 4.311,45 3.623,46 3.623,47 6.554,48 7.341,49 7.694,50 7.945,51 15.361,52 1.984,53 0.972,54 2,55 119.485,56 6.386,58 4.264,60 36.733,61 0.204,62 8.292}
{0 CHEMBL2086799,1 7.484,2 2.503,3 4.484,4 4.484,5 4.484,6 0.88,7 22.633,8 3.532,9 3.127,10 19.682,11 21.171,12 16.746,13 18.246,14 2.5,15 1.773,16 1.773,17 0.121,18 0.957,21 0.355,22 4.55,24 4.103,25 4.111,26 3.99,27 4.009,28 0.273,29 0.172,30 0.107,31 0.067,32 4.966,33 1.474,36 31.885,37 3.249,38 13.828,39 2.299,40 2.907,41 0.218,42 2.749,43 4.084,45 3.623,46 3.623,47 6.554,48 7.341,49 7.694,50 7.945,51 15.361,52 1.998,53 0.993,54 2,55 119.485,56 6.386,58 4.264,60 36.733,61 0.204,62 6}
{0 CHEMBL2086800,1 7.609,2 2.538,3 4.609,4 4.609,5 4.609,6 0.88,7 23.013,8 3.532,9 3.175,10 19.999,11 21.515,12 17.003,13 18.525,14 2.5,15 1.78,16 1.78,17 0.114,18 1.047,21 0.36,22 4.537,24 4.133,25 4.16,26 4.024,27 4.041,28 0.271,29 0.169,30 0.106,31 0.066,32 5.056,33 1.475,36 37.034,37 3.278,38 14.028,39 2.364,40 2.984,41 0.238,42 2.765,43 4.111,45 4.091,46 4.091,47 6.615,48 7.405,49 7.754,50 8.01,51 15.575,52 1.996,53 0.992,54 2,55 122.654,56 6.422,58 4.297,60 36.733,61 0.211,62 8.538}
{0 CHEMBL2086801,1 7.609,2 2.539,3 4.609,4 4.609,5 4.609,6 0.75,7 23.014,8 3.533,9 3.192,10 20,11 21.516,12 17.004,13 18.526,14 2.5,15 1.793,16 1.793,17 0.123,18 1.03,21 0.354,22 4.87,24 4.134,25 4.161,26 4.025,27 4.042,28 0.273,29 0.168,30 0.105,31 0.065,32 5.056,33 1.475,36 38.197,37 3.281,38 14.029,39 2.376,40 2.985,41 0.238,42 2.788,43 4.112,45 4.094,46 4.094,47 6.642,48 7.429,49 7.791,50 8.044,51 15.576,52 2,53 0.998,54 2,55 126.731,56 6.434,58 4.298,60 41.325,61 0.209,62 8.155}
{0 CHEMBL2086802,1 7.609,2 2.519,3 4.609,4 4.609,5 4.609,6 0.78,7 23.013,8 3.513,9 3.175,10 19.999,11 21.515,12 17.003,13 18.525,14 2.5,15 1.782,16 1.782,17 0.11,18 1.014,21 0.357,22 4.87,24 4.133,25 4.16,26 4.024,27 4.041,28 0.273,29 0.17,30 0.106,31 0.067,32 5.056,33 1.5,36 37.034,37 3.278,38 14.028,39 2.364,40 2.984,41 0.27,42 2.766,43 4.111,45 4.091,46 4.091,47 6.618,48 7.406,49 7.755,50 8.012,51 15.575,52 2,53 1,54 2,55 127.063,56 6.434,58 4.297,60 39.267,61 0.209,62 8.018}
{0 CHEMBL2086803,1 7.609,2 2.519,3 4.609,4 4.609,5 4.609,6 0.75,7 23.013,8 3.513,9 3.175,10 19.999,11 21.515,12 17.003,13 18.525,14 2.5,15 1.782,16 1.782,17 0.113,18 1.005,21 0.357,22 4.857,24 4.133,25 4.159,26 4.024,27 4.041,28 0.273,29 0.17,30 0.106,31 0.067,32 5.056,33 1.5,36 38.575,37 3.278,38 14.028,39 2.364,40 2.984,41 0.27,42 2.764,43 4.111,45 4.091,46 4.091,47 6.618,48 7.406,49 7.755,50 8.012,51 15.575,52 2,53 1,54 2,55 127.063,56 6.434,58 4.297,60 40.848,61 0.209,62 7.658}
{0 CHEMBL2086804,1 7.609,2 2.492,3 4.609,4 4.609,5 4.609,6 0.88,7 23.014,8 3.413,9 3.159,10 20,11 21.516,12 17.004,13 18.526,14 2.492,15 1.755,16 1.755,17 0.09,18 1.042,21 0.361,22 4.206,24 4.134,25 4.161,26 4.024,27 4.042,28 0.27,29 0.167,30 0.105,31 0.066,32 5.056,33 1.465,36 46.731,37 3.277,38 14.029,39 2.331,40 2.935,41 0.152,42 2.745,43 4.112,45 4.067,46 4.067,47 6.627,48 7.429,49 7.785,50 8.045,51 15.576,52 1.984,53 0.983,54 2,55 115.033,56 6.411,58 4.3,60 32.521,61 0.214,62 7.678}
{0 CHEMBL2086805,1 7.609,2 2.542,3 4.609,4 4.609,5 4.609,6 0.78,7 23.014,8 3.56,9 3.218,10 20.001,11 21.516,12 17.005,13 18.527,14 2.5,15 1.885,16 1.885,17 0.108,18 1.012,21 0.359,22 4.961,24 4.135,25 4.162,26 4.025,27 4.042,28 0.272,29 0.168,30 0.106,31 0.066,32 5.094,33 1.5,36 47.513,37 3.28,38 14.032,39 2.37,40 3.123,41 0.247,42 2.841,43 4.113,45 4.383,46 4.383,47 6.64,48 7.439,49 7.796,50 8.059,51 15.577,52 2,53 1,54 2,55 131.463,56 6.464,58 4.3,60 34.627,61 0.211,62 8.18}
{0 CHEMBL2087239,1 7.609,2 2.544,3 4.609,4 4.609,5 4.609,6 0.75,7 23.016,8 3.686,9 3.277,10 20.005,11 21.52,12 17.014,13 18.533,14 2.572,15 1.885,16 1.885,17 0.096,18 1.074,21 0.366,22 4.948,24 4.135,25 4.162,26 4.025,27 4.042,28 0.271,29 0.17,30 0.105,31 0.066,32 5.165,33 1.531,36 47.043,37 3.368,38 14.049,39 2.46,40 3.155,41 0.284,42 2.841,43 4.113,45 4.454,46 4.454,47 6.65,48 7.446,49 7.801,50 8.069,51 15.59,52 2,53 1,54 2,55 136.946,56 6.512,58 4.3,60 35.646,61 0.207,62 8.337}
{0 CHEMBL2087240,1 7.609,2 2.401,3 4.609,4 4.609,5 4.609,6 0.81,7 22.994,8 3.558,9 3.158,10 19.973,11 21.493,12 16.968,13 18.495,14 2.491,15 1.867,16 1.867,17 0.107,18 1.053,21 0.355,22 4.969,24 4.135,25 4.163,26 4.026,27 4.042,28 0.272,29 0.168,30 0.106,31 0.067,32 5.017,33 1.468,36 48.308,37 3.221,38 13.985,39 2.234,40 2.936,41 0.214,42 2.795,43 4.111,45 4.32,46 4.32,47 6.589,48 7.392,49 7.739,50 8.008,51 15.538,52 2,53 1,54 2,55 126.972,56 6.412,58 4.285,60 37.161,61 0.21,62 6.824}
{0 CHEMBL2160030,1 7.674,2 2.513,3 4.674,4 4.674,5 4.674,6 0.72,7 23.21,8 3.417,9 3.191,10 20.163,11 21.698,12 17.13,13 18.676,14 2.5,15 1.783,16 1.783,17 0.091,18 0.877,21 0.354,22 5.206,24 4.103,25 4.109,26 4.128,27 4.076,28 0.275,29 0.177,30 0.113,31 0.072,32 5.027,33 1.5,36 29.209,37 3.36,38 14.116,39 2.452,40 3.053,41 0.304,42 2.746,43 4.413,45 4.381,46 4.381,47 6.567,48 7.307,49 7.498,50 7.678,51 15.696,52 1.976,53 0.974,54 2,55 158.706,56 6.397,58 4.279,60 15.368,61 0.195,62 8.119}
{0 CHEMBL2160031,1 7.674,2 2.513,3 4.674,4 4.674,5 4.674,6 0.72,7 23.21,8 3.417,9 3.191,10 20.163,11 21.698,12 17.13,13 18.676,14 2.5,15 1.783,16 1.783,17 0.091,18 0.877,21 0.354,22 5.206,24 4.103,25 4.109,26 4.128,27 4.076,28 0.275,29 0.177,30 0.113,31 0.072,32 5.027,33 1.5,36 29.209,37 3.36,38 14.116,39 2.452,40 3.053,41 0.304,42 2.746,43 4.413,45 4.381,46 4.381,47 6.567,48 7.307,49 7.498,50 7.678,51 15.696,52 1.976,53 0.974,54 2,55 158.706,56 6.397,58 4.279,60 15.368,61 0.195,62 7.66}
{0 CHEMBL2160032,1 7.019,2 2.493,3 4.019,4 4.019,5 4.019,6 0.88,7 21.46,8 3.435,9 3.145,10 18.719,11 20.148,12 15.979,13 17.453,14 2.5,15 1.766,16 1.766,17 0.1,18 0.953,21 0.34,22 5.492,24 4.058,25 4.083,26 3.969,27 3.971,28 0.281,29 0.184,30 0.118,31 0.076,32 4.718,33 1.5,36 26.807,37 3.216,38 13.237,39 2.271,40 2.812,41 0.204,42 2.737,43 4.007,45 3.696,46 3.696,47 6.282,48 7.009,49 7.333,50 7.574,51 14.791,52 1.984,53 0.983,54 2,56 6.35,58 4.268,60 15.368,61 0.184,62 7.269}
{0 CHEMBL2160033,1 7.589,2 2.493,3 4.589,4 4.589,5 4.589,6 0.84,7 22.957,8 3.382,9 3.155,10 19.948,11 21.468,12 16.953,13 18.487,14 2.5,15 1.764,16 1.764,17 0.091,18 0.975,21 0.351,22 5.017,24 4.1,25 4.109,26 4.121,27 4.068,28 0.276,29 0.179,30 0.114,31 0.073,32 4.934,33 1.5,36 27.927,37 3.207,38 13.972,39 2.348,40 2.959,41 0.259,42 2.704,43 4.39,45 4.112,46 4.112,47 6.49,48 7.241,49 7.395,50 7.62,51 15.548,52 1.976,53 0.974,54 2,55 154.496,56 6.36,58 4.276,60 15.368,61 0.193,62 7.209}
{0 CHEMBL2160034,1 7.589,2 2.493,3 4.589,4 4.589,5 4.589,6 0.88,7 22.957,8 3.382,9 3.155,10 19.948,11 21.468,12 16.953,13 18.487,14 2.5,15 1.764,16 1.764,17 0.09,18 0.89,21 0.351,22 4.872,24 4.139,25 4.169,26 4.054,27 4.06,28 0.276,29 0.179,30 0.114,31 0.073,32 4.934,33 1.5,36 27.927,37 3.207,38 13.972,39 2.348,40 2.959,41 0.259,42 2.719,43 4.185,45 4.112,46 4.112,47 6.49,48 7.241,49 7.395,50 7.62,51 15.548,52 1.976,53 0.974,54 2,55 154.496,56 6.36,58 4.276,60 15.368,61 0.193,62 6.929}
{0 CHEMBL2160035,1 7.608,2 2.498,3 4.608,4 4.608,5 4.608,6 0.72,7 23.016,8 3.515,9 3.168,10 20.002,11 21.524,12 17.003,13 18.537,14 2.5,15 1.77,16 1.77,17 0.091,18 0.947,21 0.349,22 5.218,24 4.104,25 4.112,26 4.12,27 4.07,28 0.277,29 0.179,30 0.113,31 0.072,32 5.027,33 1.5,36 28.589,37 3.266,38 14.021,39 2.442,40 3.146,41 0.287,42 2.738,43 4.392,45 4.482,46 4.482,47 6.578,48 7.323,49 7.482,50 7.665,51 15.594,52 1.976,53 0.974,54 2,55 159.173,56 6.397,58 4.277,60 15.368,61 0.19,62 6.755}
{0 CHEMBL2205224,1 7.544,2 2.522,3 4.544,4 4.544,5 4.544,6 0.95,7 22.768,8 3.592,9 3.246,10 19.775,11 21.278,12 16.801,13 18.307,14 2.5,15 1.779,16 1.779,17 0.101,18 1.086,21 0.365,22 5.092,23 1.771,24 4.102,25 4.131,26 3.968,27 3.991,28 0.276,29 0.176,30 0.11,31 0.07,32 5.075,33 1.473,36 44.21,37 3.348,38 13.854,39 2.39,40 3.053,41 0.288,42 2.795,43 4.077,45 4.316,46 4.316,47 6.29,48 6.833,49 7.063,50 7.248,51 15.376,52 1.984,53 0.983,54 2,55 162.761,56 6.405,57 1,58 4.219,59 1,60 35.646,61 0.199,62 7.854}
{0 CHEMBL2205225,1 7.545,2 2.524,3 4.545,4 4.545,5 4.545,6 0.85,7 22.772,8 3.602,9 3.253,10 19.779,11 21.282,12 16.805,13 18.311,14 2.5,15 1.806,16 1.806,17 0.111,18 1.073,21 0.366,22 5.315,23 1.827,24 4.104,25 4.134,26 3.972,27 3.994,28 0.275,29 0.175,30 0.109,31 0.069,32 5.075,33 1.474,36 46.128,37 3.35,38 13.86,39 2.401,40 3.074,41 0.288,42 2.809,43 4.08,45 4.346,46 4.346,47 6.328,48 6.907,49 7.134,50 7.308,51 15.382,52 1.984,53 0.983,54 2,55 167.916,56 6.417,57 1,58 4.229,59 1,60 38.18,61 0.201,62 8.244}
{0 CHEMBL2205226,1 7.545,2 2.524,3 4.545,4 4.545,5 4.545,6 0.85,7 22.772,8 3.602,9 3.253,10 19.779,11 21.282,12 16.805,13 18.311,14 2.5,15 1.806,16 1.806,17 0.108,18 1.129,21 0.366,22 5.33,23 1.907,24 4.116,25 4.149,26 3.998,27 4.016,28 0.275,29 0.175,30 0.109,31 0.069,32 5.075,33 1.474,36 43.32,37 3.35,38 13.86,39 2.401,40 3.074,41 0.288,42 2.813,43 4.087,45 4.346,46 4.346,47 6.328,48 6.907,49 7.134,50 7.308,51 15.382,52 1.984,53 0.983,54 2,55 167.916,56 6.417,57 1,58 4.229,59 1,60 40.715,61 0.201,62 7.022}
{0 CHEMBL2205227,1 7.545,2 2.524,3 4.545,4 4.545,5 4.545,6 0.83,7 22.773,8 3.603,9 3.254,10 19.78,11 21.284,12 16.807,13 18.312,14 2.5,15 1.821,16 1.821,17 0.12,18 1.058,21 0.359,22 5.693,23 1.841,24 4.106,25 4.136,26 3.973,27 3.995,28 0.277,29 0.175,30 0.109,31 0.068,32 5.075,33 1.476,36 47.291,37 3.351,38 13.861,39 2.404,40 3.096,41 0.3,42 2.811,43 4.081,45 4.365,46 4.365,47 6.363,48 6.942,49 7.187,50 7.348,51 15.383,52 1.984,53 0.983,54 2,55 173.111,56 6.428,57 1,58 4.229,59 1,60 42.772,61 0.2,62 8.161}
{0 CHEMBL2205228,1 7.545,2 2.524,3 4.545,4 4.545,5 4.545,6 0.83,7 22.773,8 3.603,9 3.254,10 19.78,11 21.284,12 16.807,13 18.312,14 2.5,15 1.838,16 1.838,17 0.12,18 1.012,21 0.355,22 6.047,23 1.757,24 4.106,25 4.136,26 3.973,27 3.995,28 0.278,29 0.176,30 0.109,31 0.068,32 5.075,33 1.483,36 46.828,37 3.351,38 13.861,39 2.404,40 3.105,41 0.308,42 2.814,43 4.082,45 4.37,46 4.37,47 6.376,48 6.966,49 7.213,50 7.392,51 15.383,52 2,53 1,54 2,55 178.646,56 6.44,57 1,58 4.229,59 1,60 51.242,61 0.195,62 8.31}
{0 CHEMBL2205229,1 7.545,2 2.524,3 4.545,4 4.545,5 4.545,6 0.83,7 22.773,8 3.605,9 3.267,10 19.78,11 21.284,12 16.807,13 18.313,14 2.535,15 2.129,16 2.129,17 0.12,18 0.972,21 0.349,22 6.42,23 1.667,24 4.107,25 4.136,26 3.973,27 3.996,28 0.282,29 0.176,30 0.109,31 0.068,32 5.112,33 1.5,36 48.164,37 3.356,38 13.862,39 2.412,40 3.23,41 0.35,42 3.033,43 4.082,45 4.876,46 4.876,47 6.389,48 6.991,49 7.239,50 7.434,51 15.383,52 2,53 1,54 2,55 184.181,56 6.469,57 1,58 4.229,59 1,60 42.772,61 0.188,62 8.357}
{0 CHEMBL2205230,1 7.545,2 2.836,3 4.545,4 4.545,5 4.545,6 0.83,7 22.777,8 3.703,9 3.35,10 19.787,11 21.289,12 16.82,13 18.321,14 2.535,15 2.158,16 2.158,17 0.12,18 0.938,21 0.342,22 6.791,23 1.575,24 4.107,25 4.136,26 3.973,27 3.996,28 0.287,29 0.176,30 0.108,31 0.067,32 5.215,33 1.5,36 48.329,37 3.6,38 13.886,39 2.524,40 3.253,41 0.399,42 3.139,43 4.083,45 5.194,46 5.194,47 6.402,48 7.014,49 7.264,50 7.474,51 15.4,52 2,53 1,54 2,55 189.716,56 6.525,57 1,58 4.23,59 1,60 42.772,61 0.181,62 8.357}
{0 CHEMBL2205231,1 7.596,2 2.531,3 4.596,4 4.596,5 4.596,6 0.85,7 22.95,8 3.669,9 3.259,10 19.94,11 21.451,12 16.951,13 18.462,14 2.5,15 1.885,16 1.885,17 0.091,18 1.095,21 0.366,22 5.123,24 4.129,25 4.159,26 4.008,27 4.027,28 0.271,29 0.17,30 0.105,31 0.066,32 5.147,33 1.495,36 48.458,37 3.356,38 13.991,39 2.405,40 3.113,41 0.284,42 2.841,43 4.102,45 4.454,46 4.454,47 6.488,48 7.134,49 7.406,50 7.604,51 15.516,52 2,53 1,54 2,55 136.946,56 6.483,58 4.302,60 45.784,61 0.207,62 7.018}
{0 CHEMBL254129,1 6.65,2 2.145,3 4.03,4 4.03,5 4.03,6 0.89,7 21.273,8 3.288,9 3.041,10 18.535,11 19.908,12 15.807,13 17.182,14 1.669,15 1.815,16 1.815,18 0.986,21 0.391,22 2.647,23 2.542,24 4.141,25 4.173,26 4.07,27 4.063,28 0.252,29 0.157,30 0.095,31 0.059,32 4.89,33 0.631,34 6,35 6,36 47.245,37 3.13,38 13.091,39 2.042,40 2.695,41 0.14,42 2.803,43 4.063,44 5,45 4.999,46 4.999,47 5.805,48 6.468,49 6.741,50 6.98,51 14.478,52 1.388,53 0.412,55 226.368,56 6.267,57 1,58 4.672,59 1,60 22.382,61 0.214,62 6.301}
{0 CHEMBL470513,1 6.965,2 1.54,3 3.965,4 3.965,5 3.965,6 0.8,7 21.088,8 2.814,9 2.525,10 18.368,11 19.787,12 15.647,13 17.11,14 0.719,15 1,16 1,17 0.108,18 1.391,21 0.325,22 3.3,24 4,25 4.026,26 3.956,27 3.931,28 0.294,29 0.188,30 0.122,31 0.081,32 4.388,33 -0.987,36 19.342,37 2.533,38 12.919,39 1.5,40 2.5,41 0.066,42 2.019,43 4.232,45 2.136,46 2.136,47 5.815,48 6.502,49 6.88,50 7.187,51 14.461,52 0.093,53 -0.913,56 5.901,58 4.187,61 0.172,62 7}
{0 CHEMBL470514,1 6.962,2 1.5,3 3.962,4 3.962,5 3.962,6 0.8,7 20.895,8 2.542,9 2.5,10 18.181,11 19.608,12 15.468,13 16.945,14 0.5,15 1,16 1,17 0.088,18 1.292,21 0.32,22 2.923,24 3.983,25 4.015,26 3.924,27 3.9,28 0.293,29 0.191,30 0.123,31 0.083,32 4.227,33 -1.5,36 18.971,37 2.5,38 12.749,39 1.5,40 2.17,41 0.049,42 1.957,43 4.231,45 1.659,46 1.659,47 5.68,48 6.423,49 6.756,50 7.059,51 14.315,52 -0.025,53 -1,56 5.788,58 4.025,61 0.17,62 7}
{0 CHEMBL471728,1 6.865,2 2.197,3 3.865,4 3.865,5 3.865,6 1,7 21.091,8 3.147,9 2.917,10 18.397,11 19.819,12 15.696,13 17.169,14 2.332,15 1.523,16 1.523,17 0.1,18 1.125,21 0.339,22 5.274,24 4.035,25 4.083,26 3.928,27 3.932,28 0.288,29 0.176,30 0.116,31 0.075,32 4.59,33 1.291,36 45.089,37 3.039,38 12.984,39 2.084,40 2.816,41 0.198,42 2.476,43 3.967,45 3.163,46 3.163,47 5.805,48 6.355,49 6.628,50 6.969,51 14.542,52 1.972,53 0.97,56 6.206,58 4.275,60 10.957,61 0.193,62 5.301}
{0 CHEMBL472802,1 7.525,2 2.673,3 4.525,4 4.525,5 4.525,6 0.74,7 22.86,8 3.481,9 3.232,10 19.905,11 21.406,12 16.964,13 18.487,14 2.5,15 1.807,16 1.807,17 0.082,18 0.956,21 0.344,22 4.629,24 4.09,25 4.127,26 3.993,27 4.004,28 0.281,29 0.18,30 0.116,31 0.074,32 5.085,33 1.5,36 26.995,37 3.293,38 14.035,39 2.481,40 2.963,41 0.227,42 2.774,43 4.063,45 4.026,46 4.026,47 6.744,48 7.66,49 8.103,50 8.412,51 15.611,52 2,53 1,56 6.438,58 4.362,60 18.011,61 0.189,62 8.444}
{0 CHEMBL472994,1 7.523,2 2.272,3 4.523,4 4.523,5 4.523,6 0.77,7 22.712,8 3.163,9 2.874,10 19.73,11 21.246,12 16.761,13 18.302,14 2.5,15 1.429,16 1.429,17 0.082,18 1.51,21 0.336,22 3.374,24 4.098,25 4.108,26 4.112,27 4.071,28 0.274,29 0.17,30 0.105,31 0.067,32 4.691,33 1.5,37 3.042,38 13.805,39 2.035,40 2.67,42 2.362,43 4.315,45 2.733,46 2.733,47 6.832,48 7.914,49 8.368,50 8.725,51 15.408,52 1.828,53 0.826,54 2,56 6.276,58 4.113,61 0.205,62 5.301}
{0 CHEMBL472996,1 6.392,2 2.107,3 3.811,4 3.811,5 3.811,6 0.92,7 20.568,8 3.439,9 2.881,10 17.957,11 19.268,12 15.356,13 16.669,14 1.753,15 1.836,16 1.836,18 0.966,19 1,21 0.382,22 3.001,24 4.126,25 4.163,26 4.044,27 4.037,28 0.257,29 0.159,30 0.097,31 0.061,32 4.89,33 0.736,34 6,35 6,36 45.59,37 3.107,38 12.768,39 1.879,40 2.696,41 0.205,42 2.832,43 4.039,44 5,45 5,46 5,47 5.649,48 6.205,49 6.477,50 6.661,51 14.091,52 1.487,53 0.495,55 168.161,56 6.275,58 4.597,60 42.927,61 0.21,62 7.699}
{0 CHEMBL472997,1 7.483,2 2.457,3 4.483,4 4.483,5 4.483,6 0.87,7 22.785,8 3.519,9 3.019,10 19.852,11 21.336,12 16.931,13 18.432,14 2.42,15 1.618,16 1.618,17 0.07,18 0.836,21 0.349,22 4.259,24 4.135,25 4.174,26 4.024,27 4.038,28 0.278,29 0.177,30 0.111,31 0.072,32 5.121,33 1.397,36 30.703,37 3.204,38 14.022,39 2.27,40 2.924,41 0.204,42 2.531,43 4.135,45 4.339,46 4.339,47 6.741,48 7.599,49 7.918,50 8.297,51 15.564,52 1.55,53 0.578,54 1,55 129.501,56 6.372,58 4.344,60 27.196,61 0.183,62 9}
{0 CHEMBL473191,1 7.491,2 2.481,3 4.491,4 4.491,5 4.491,6 0.84,7 22.754,8 3.477,9 3.077,10 19.808,11 21.302,12 16.875,13 18.388,14 2.343,15 1.729,16 1.729,17 0.085,18 1.053,21 0.337,22 4.246,24 4.112,25 4.147,26 4.026,27 4.031,28 0.277,29 0.177,30 0.113,31 0.073,32 5.075,33 1.282,34 1,35 1,36 31.853,37 3.232,38 13.954,39 2.221,40 2.962,41 0.191,42 2.704,43 4.072,44 1,45 4.026,46 4.026,47 6.545,48 7.328,49 7.727,50 7.974,51 15.513,52 1.341,53 0.35,56 6.354,58 4.362,60 23.08,61 0.182,62 8.553}
{0 CHEMBL473392,1 6.616,2 2.33,3 3.616,4 3.616,5 3.616,6 0.98,7 19.891,8 3.383,9 3.072,10 17.347,11 18.769,12 14.807,13 16.287,14 1.902,15 1.62,16 1.62,17 0.082,18 0.711,19 2,20 1,21 0.313,22 8.108,23 3.701,24 3.971,25 4.002,26 3.889,27 3.884,28 0.307,29 0.202,30 0.131,31 0.089,32 4.494,33 0.815,34 1,35 1,36 23.381,37 3.201,38 12.274,39 2.175,40 2.576,41 0.144,42 2.626,43 4.001,44 1,45 3.096,46 3.096,47 5.32,48 5.649,49 5.821,50 5.852,51 13.837,52 1.518,53 0.511,56 6.158,57 2,58 4.022,59 2,60 50.371,61 0.16,62 5.398}
{0 CHEMBL473393,1 6.47,2 2.123,3 3.889,4 3.889,5 3.889,6 0.89,7 20.899,8 3.439,9 3.093,10 18.243,11 19.577,12 15.595,13 16.934,14 1.772,15 1.836,16 1.836,18 0.976,21 0.382,22 2.946,23 2.036,24 4.129,25 4.163,26 4.056,27 4.049,28 0.257,29 0.159,30 0.097,31 0.061,32 4.934,33 0.746,34 6,35 6,36 55.005,37 3.111,38 12.958,39 2.102,40 2.696,41 0.205,42 2.846,43 4.046,44 5,45 5,46 5,47 5.762,48 6.353,49 6.646,50 6.845,51 14.313,52 1.489,53 0.497,55 168.161,56 6.304,57 1,58 4.611,59 1,60 24.916,61 0.21,62 6.699}
{0 CHEMBL473417,1 7.673,2 2.157,3 4.673,4 4.673,5 4.673,6 0.77,7 23.303,8 3.288,9 2.956,10 20.276,11 21.798,12 17.264,13 18.792,14 1.175,15 1.505,16 1.505,17 0.093,18 0.938,21 0.337,22 4.546,24 4.09,25 4.072,26 4.1,27 4.011,28 0.296,29 0.183,30 0.119,31 0.077,32 5.19,33 -0.228,36 15.403,37 2.968,38 14.268,39 2.114,40 2.623,41 0.157,42 2.422,43 4.737,45 2.925,46 2.925,47 6.18,48 6.639,49 6.977,50 7.275,51 15.818,52 0.52,53 -0.41,56 6.248,58 4.402,60 18.011,61 0.17,62 7.886}
{0 CHEMBL475419,1 6.93,2 1.628,3 3.93,4 3.93,5 3.93,6 1,7 20.71,8 2.905,9 2.5,10 18.015,11 19.439,12 15.326,13 16.798,14 1.817,15 1.15,16 1.15,17 0.119,18 0.953,21 0.316,22 5.872,23 3.606,24 4.019,25 4.05,26 3.953,27 3.952,28 0.298,29 0.199,30 0.13,31 0.085,32 4.29,33 0.697,36 9.669,37 2.626,38 12.639,39 1.5,40 2.5,41 0.091,42 2.132,43 3.964,45 2.275,46 2.275,47 5.878,48 6.624,49 7.014,50 7.317,51 14.194,52 0.918,53 -0.072,56 5.967,57 2,58 4.023,59 2,60 25.077,61 0.16,62 6.699}
{0 CHEMBL480694,1 6.583,2 2.109,3 3.935,4 3.935,5 3.935,6 0.89,7 21.161,8 3.468,9 3.04,10 18.488,11 19.832,12 15.823,13 17.174,14 2.117,15 1.988,16 1.988,18 0.962,21 0.385,22 2.96,24 4.149,25 4.188,26 4.069,27 4.063,28 0.253,29 0.157,30 0.096,31 0.059,32 4.997,33 1.104,34 7,35 7,36 37.186,37 3.108,38 13.163,39 2.077,40 2.697,41 0.214,42 2.986,43 4.069,44 6,45 5,46 5,47 5.952,48 6.611,49 6.877,50 7.163,51 14.537,52 1.893,53 0.893,54 1,55 255.206,56 6.38,58 4.608,60 24.916,61 0.215,62 7}
{0 CHEMBL480889,1 6.927,2 2.578,3 3.927,4 3.927,5 3.927,6 0.83,7 20.953,8 3.654,9 3.321,10 18.29,11 19.678,12 15.64,13 17.056,14 2.271,15 2.009,16 2.009,17 0.105,18 1.134,21 0.327,22 7.247,24 4.041,25 4.083,26 3.917,27 3.925,28 0.289,29 0.178,30 0.115,31 0.072,32 4.987,33 1.265,36 56.403,37 3.425,38 13.004,39 2.495,40 2.978,41 0.408,42 2.969,43 3.974,45 5.189,46 5.189,47 5.884,48 6.392,49 6.606,50 6.824,51 14.469,52 2.075,53 1.071,55 188.316,56 6.437,58 4.269,60 32.708,61 0.179,62 6.523}
{0 CHEMBL510642,1 7.264,2 2.054,3 4.264,4 4.264,5 4.264,6 0.9,7 21.835,8 3.315,9 2.779,10 18.966,11 20.427,12 16.109,13 17.592,14 0.922,15 1,16 1,17 0.136,18 0.953,21 0.317,22 4.048,24 4.054,25 4.08,26 3.997,27 3.991,28 0.284,29 0.178,30 0.112,31 0.07,32 4.663,33 -0.511,34 1,35 1,36 12.505,37 2.935,38 13.266,39 1.5,40 2.5,41 0.078,42 2,43 4.092,44 1,45 1.999,46 1.999,47 6.199,48 6.881,49 7.118,50 7.254,51 14.795,52 0.366,53 -0.495,56 6.051,58 4.043,60 5.969,61 0.169,62 7}
{0 CHEMBL511978,1 7.626,2 2.427,3 4.626,4 4.626,5 4.626,6 0.74,7 23.345,8 3.221,9 3.025,10 20.333,11 21.851,12 17.328,13 18.859,14 2.145,15 1.533,16 1.533,17 0.063,18 1.024,21 0.353,22 3.116,24 4.148,25 4.191,26 4.058,27 4.056,28 0.272,29 0.172,30 0.111,31 0.072,32 5.085,33 0.956,36 12.162,37 3.118,38 14.328,39 2.24,40 2.879,41 0.119,42 2.511,43 4.258,45 3.363,46 3.363,47 6.802,48 7.643,49 7.913,50 8.103,51 15.897,52 1.367,53 0.416,54 1,55 111.903,56 6.319,58 4.438,60 18.011,61 0.202,62 7}
{0 CHEMBL511979,1 6.988,2 1.54,3 3.988,4 3.988,5 3.988,6 0.77,7 21.257,8 2.854,9 2.5,10 18.515,11 19.936,12 15.77,13 17.232,14 0.741,15 1,16 1,17 0.114,18 1.171,21 0.333,22 3.336,24 3.985,25 4.011,26 3.93,27 3.904,28 0.288,29 0.187,30 0.121,31 0.079,32 4.407,33 -0.906,36 21.471,37 2.527,38 13.018,39 1.5,40 2.17,41 0.054,42 1.954,43 4.234,45 1.658,46 1.658,47 5.833,48 6.522,49 6.865,50 7.131,51 14.555,52 0.019,53 -0.847,56 5.873,58 4.225,61 0.183,62 7}
{0 CHEMBL514344,1 7.454,2 2.56,3 4.454,4 4.454,5 4.454,6 0.85,7 22.809,8 3.383,9 3.032,10 19.884,11 21.364,12 16.965,13 18.463,14 2.113,15 1.532,16 1.532,17 0.143,18 0.975,21 0.34,22 5.448,24 4.127,25 4.166,26 4.017,27 4.03,28 0.281,29 0.176,30 0.112,31 0.073,32 5.085,33 1.084,36 26.15,37 3.267,38 14.051,39 2.298,40 2.891,41 0.238,42 2.495,43 4.128,45 3.783,46 3.783,47 6.684,48 7.466,49 7.721,50 8.132,51 15.592,52 1.926,53 0.916,54 1,55 149.875,56 6.353,58 4.46,60 31.788,61 0.201,62 7.266}
{0 CHEMBL514622,1 7.626,2 2.014,3 4.626,4 4.626,5 4.626,6 0.87,7 23.041,8 3.189,9 2.827,10 20.009,11 21.536,12 16.992,13 18.529,14 1.353,15 1.354,16 1.354,17 0.109,18 1.227,21 0.34,22 3.3,24 4.143,25 4.188,26 4.014,27 4.024,28 0.278,29 0.175,30 0.113,31 0.074,32 4.808,33 0.131,36 24.785,37 2.861,38 13.988,39 1.971,40 2.5,41 0.107,42 2.333,43 4.257,45 2.275,46 2.275,47 6.473,48 7.358,49 7.582,50 7.964,51 15.561,52 0.591,53 -0.339,54 1,55 102.056,56 6.111,58 4.137,60 4.592,61 0.198,62 7.523}
{0 CHEMBL515093,1 7.525,2 2.783,3 4.525,4 4.525,5 4.525,6 0.76,7 22.848,8 3.594,9 3.293,10 19.893,11 21.395,12 16.955,13 18.477,14 2.583,15 1.953,16 1.953,17 0.072,18 0.995,21 0.344,22 4.912,24 4.106,25 4.138,26 4.025,27 4.032,28 0.277,29 0.178,30 0.114,31 0.073,32 5.121,33 1.593,36 43.659,37 3.441,38 14.032,39 2.672,40 3.167,41 0.223,42 2.917,43 4.072,45 4.843,46 4.843,47 6.832,48 7.74,49 8.161,50 8.459,51 15.607,52 2,53 1,56 6.509,58 4.358,60 25.186,61 0.192,62 8.237}
{0 CHEMBL515916,1 7.321,2 2.105,3 4.321,4 4.321,5 4.321,6 0.9,7 22.014,8 3.183,9 2.836,10 19.115,11 20.591,12 16.225,13 17.726,14 2,15 1.421,16 1.421,17 0.086,18 0.966,21 0.335,22 4.473,23 1.976,24 4.057,25 4.106,26 3.925,27 3.939,28 0.286,29 0.186,30 0.121,31 0.08,32 4.543,33 1,36 33.258,37 2.963,38 13.344,39 1.949,40 2.632,41 0.136,42 2.416,43 4.019,45 2.804,46 2.804,47 5.934,48 6.611,49 6.875,50 7.054,51 14.904,52 1.15,53 0.166,54 1,56 6.119,58 3.946,59 1,60 10.529,61 0.182,62 7.699}
{0 CHEMBL516246,1 7.483,2 2.604,3 4.483,4 4.483,5 4.483,6 0.85,7 22.761,8 3.482,9 3.199,10 19.825,11 21.311,12 16.902,13 18.405,14 1.861,15 1.831,16 1.831,17 0.103,18 0.764,21 0.348,22 4.816,24 4.135,25 4.174,26 4.023,27 4.037,28 0.282,29 0.18,30 0.111,31 0.073,32 5.121,33 0.572,36 31.584,37 3.355,38 13.991,39 2.451,40 3.018,41 0.196,42 2.727,43 4.135,45 4.339,46 4.339,47 6.701,48 7.543,49 7.862,50 8.278,51 15.536,52 1.324,53 0.369,54 1,55 134.753,56 6.35,58 4.315,60 18.011,61 0.181,62 7.398}
{0 CHEMBL565554,1 7.454,2 2.298,3 4.454,4 4.454,5 4.454,6 0.71,7 22.611,8 3.264,9 2.891,10 19.678,11 21.166,12 16.756,13 18.264,14 1.466,15 1.414,16 1.414,17 0.071,18 0.796,21 0.341,22 3.575,24 4.125,25 4.164,26 4.016,27 4.029,28 0.283,29 0.182,30 0.115,31 0.074,32 4.902,33 0.204,36 11.974,37 3.032,38 13.842,39 2.072,40 2.764,41 0.155,42 2.4,43 4.129,45 3.158,46 3.158,47 6.494,48 7.339,49 7.614,50 8.027,51 15.4,52 0.619,53 -0.154,54 1,55 104.269,56 6.191,58 4.25,60 18.011,61 0.18,62 6.65}
{0 CHEMBL567378,1 7.454,2 2.336,3 4.454,4 4.454,5 4.454,6 0.71,7 22.677,8 3.288,9 3.032,10 19.754,11 21.235,12 16.843,13 18.342,14 1.847,15 1.532,16 1.532,17 0.067,18 0.977,21 0.34,22 4.08,24 4.126,25 4.165,26 4.017,27 4.029,28 0.288,29 0.178,30 0.113,31 0.074,32 5.066,33 0.521,36 15.487,37 3.15,38 13.94,39 2.298,40 2.891,41 0.246,42 2.495,43 4.128,45 3.187,46 3.187,47 6.55,48 7.377,49 7.639,50 8.066,51 15.484,52 1.032,53 0.111,54 1,55 119.948,56 6.312,58 4.469,60 18.011,61 0.174,62 6.924}
{0 CHEMBL568011,1 7.454,2 2.56,3 4.454,4 4.454,5 4.454,6 0.8,7 22.806,8 3.355,9 3.032,10 19.881,11 21.362,12 16.963,13 18.461,14 1.847,15 1.532,16 1.532,17 0.111,18 1.017,21 0.361,22 4.289,24 4.126,25 4.165,26 4.017,27 4.03,28 0.275,29 0.177,30 0.113,31 0.074,32 5.085,33 0.521,36 22.662,37 3.267,38 14.049,39 2.298,40 2.891,41 0.222,42 2.495,43 4.128,45 3.614,46 3.614,47 6.639,48 7.411,49 7.679,50 8.107,51 15.59,52 1.27,53 0.328,54 1,55 132.154,56 6.316,58 4.456,60 18.011,61 0.202,62 7.098}
{0 CHEMBL568022,1 7.454,2 2.298,3 4.454,4 4.454,5 4.454,6 0.77,7 22.624,8 3.277,9 3.032,10 19.695,11 21.181,12 16.777,13 18.283,14 1.847,15 1.414,16 1.414,17 0.07,18 1.026,21 0.346,22 3.507,24 4.125,25 4.164,26 4.017,27 4.029,28 0.28,29 0.183,30 0.116,31 0.074,32 4.902,33 0.521,36 13.677,37 3.102,38 13.866,39 2.072,40 2.891,41 0.164,42 2.4,43 4.127,45 3.162,46 3.162,47 6.568,48 7.352,49 7.644,50 8.057,51 15.422,52 1.03,53 0.108,54 1,55 110.537,56 6.268,58 4.257,60 18.011,61 0.182,62 6.733}
{0 CHEMBL568884,1 7.089,2 2.154,3 4.089,4 4.089,5 4.089,6 0.77,7 21.793,8 3.228,9 2.882,10 19.003,11 20.438,12 16.216,13 17.682,14 1.158,15 1.505,16 1.505,17 0.073,18 0.958,21 0.337,22 4.305,24 4.007,25 4.037,26 3.916,27 3.922,28 0.296,29 0.183,30 0.119,31 0.077,32 4.879,33 -0.226,36 19.153,37 2.961,38 13.428,39 2.012,40 2.592,41 0.157,42 2.452,43 4.055,45 2.925,46 2.925,47 6.108,48 6.622,49 6.938,50 7.232,51 14.954,52 0.519,53 -0.44,56 6.184,58 4.395,60 18.011,61 0.17,62 5.097}
{0 CHEMBL568885,1 7.078,2 1.9,3 4.078,4 4.078,5 4.078,6 0.77,7 21.386,8 2.962,9 2.541,10 18.617,11 20.06,12 15.85,13 17.337,14 0.934,15 1.031,16 1.031,17 0.081,18 0.926,21 0.332,22 3.771,24 4.009,25 4.034,26 3.941,27 3.941,28 0.293,29 0.189,30 0.122,31 0.081,32 4.543,33 -0.556,36 11.974,37 2.807,38 13.082,39 1.505,40 2.5,41 0.062,42 2.036,43 4.065,45 2.45,46 2.45,47 5.889,48 6.536,49 6.838,50 7.122,51 14.648,52 0.209,53 -0.627,56 5.991,58 4.207,60 18.011,61 0.178,62 5.824}
{0 CHEMBL568926,1 7.089,2 2.154,3 4.089,4 4.089,5 4.089,6 0.77,7 21.793,8 3.228,9 2.882,10 19.003,11 20.438,12 16.216,13 17.682,14 1.158,15 1.505,16 1.505,17 0.071,18 1.131,21 0.337,22 4.332,24 4.019,25 4.045,26 3.951,27 3.951,28 0.296,29 0.183,30 0.119,31 0.077,32 4.879,33 -0.226,36 19.153,37 2.961,38 13.428,39 2.012,40 2.592,41 0.157,42 2.451,43 4.061,45 2.925,46 2.925,47 6.108,48 6.622,49 6.938,50 7.232,51 14.954,52 0.528,53 -0.442,56 6.184,58 4.395,60 18.011,61 0.17,62 5.62}
{0 CHEMBL569209,1 7.077,2 1.506,3 4.077,4 4.077,5 4.077,6 0.77,7 21.285,8 2.961,9 2.5,10 18.514,11 19.964,12 15.744,13 17.242,14 0.752,15 1,16 1,17 0.083,18 0.994,21 0.332,22 3.39,24 4.005,25 4.032,26 3.935,27 3.935,28 0.292,29 0.19,30 0.124,31 0.082,32 4.388,33 -0.954,36 11.333,37 2.554,38 12.972,39 1.5,40 2.5,41 0.029,42 1.992,43 4.056,45 2.136,46 2.136,47 5.825,48 6.514,49 6.799,50 7.059,51 14.557,52 0.177,53 -0.765,56 5.934,58 4.151,60 18.011,61 0.179,62 6.155}
{0 CHEMBL569717,1 7.077,2 1.776,3 4.077,4 4.077,5 4.077,6 0.77,7 21.36,8 2.962,9 2.5,10 18.594,11 20.037,12 15.831,13 17.318,14 0.935,15 1,16 1,17 0.081,18 0.793,21 0.332,22 3.771,24 4.009,25 4.034,26 3.941,27 3.941,28 0.293,29 0.191,30 0.122,31 0.08,32 4.543,33 -0.612,36 11.974,37 2.764,38 13.068,39 1.5,40 2.5,41 0.091,42 2,43 4.064,45 2.275,46 2.275,47 5.924,48 6.543,49 6.832,50 7.11,51 14.634,52 0.177,53 -0.632,56 5.991,58 4.185,60 18.011,61 0.173,62 5.824}
{0 CHEMBL569817,1 7.454,2 2.396,3 4.454,4 4.454,5 4.454,6 0.77,7 22.755,8 3.327,9 3.032,10 19.836,11 21.314,12 16.927,13 18.422,14 1.847,15 1.532,16 1.532,17 0.064,18 1.031,21 0.345,22 4.152,24 4.132,25 4.177,26 4.008,27 4.023,28 0.287,29 0.177,30 0.114,31 0.072,32 5.147,33 0.521,36 19.153,37 3.2,38 14.024,39 2.298,40 2.891,41 0.258,42 2.508,43 4.131,45 4.11,46 4.11,47 6.602,48 7.375,49 7.664,50 8.078,51 15.561,52 1.065,53 0.138,54 1,55 127.663,56 6.351,58 4.502,60 18.011,61 0.177,62 6.77}
{0 CHEMBL569818,1 7.454,2 2.396,3 4.454,4 4.454,5 4.454,6 0.77,7 22.755,8 3.327,9 3.032,10 19.836,11 21.314,12 16.927,13 18.422,14 1.847,15 1.532,16 1.532,17 0.064,18 1.055,21 0.345,22 4.152,24 4.126,25 4.166,26 4.017,27 4.029,28 0.287,29 0.177,30 0.114,31 0.072,32 5.147,33 0.521,36 25.213,37 3.2,38 14.024,39 2.298,40 2.891,41 0.258,42 2.514,43 4.131,45 4.11,46 4.11,47 6.602,48 7.375,49 7.664,50 8.078,51 15.561,52 1.064,53 0.138,55 127.663,56 6.351,58 4.502,60 18.011,61 0.177,62 7.097}
{0 CHEMBL570021,1 7.077,2 1.506,3 4.077,4 4.077,5 4.077,6 0.77,7 21.285,8 2.961,9 2.5,10 18.514,11 19.964,12 15.744,13 17.242,14 0.752,15 1,16 1,17 0.083,18 0.994,21 0.332,22 3.39,24 4.005,25 4.032,26 3.934,27 3.935,28 0.292,29 0.19,30 0.124,31 0.082,32 4.388,33 -0.954,36 11.333,37 2.554,38 12.972,39 1.5,40 2.5,41 0.029,42 1.992,43 4.056,45 2.136,46 2.136,47 5.825,48 6.514,49 6.799,50 7.059,51 14.557,52 0.177,53 -0.75,56 5.934,58 4.151,60 18.011,61 0.179,62 6.222}
{0 CHEMBL570044,1 7.081,2 2.151,3 4.081,4 4.081,5 4.081,6 0.8,7 21.638,8 3.067,9 2.657,10 18.85,11 20.29,12 16.062,13 17.54,14 0.935,15 1.161,16 1.161,17 0.071,18 1.035,21 0.339,22 3.699,24 4.013,25 4.041,26 3.939,27 3.94,28 0.291,29 0.186,30 0.123,31 0.078,32 4.677,33 -0.61,36 16.469,37 2.961,38 13.271,39 1.678,40 2.5,41 0.107,42 2.154,43 4.058,45 2.477,46 2.477,47 5.988,48 6.594,49 6.878,50 7.164,51 14.818,52 0.443,53 -0.493,56 6.044,58 4.337,60 18.011,61 0.182,62 6.886}
{0 CHEMBL570273,1 7.454,2 2.396,3 4.454,4 4.454,5 4.454,6 0.77,7 22.755,8 3.327,9 3.032,10 19.836,11 21.314,12 16.927,13 18.422,14 1.847,15 1.532,16 1.532,17 0.064,18 1.045,21 0.345,22 4.152,24 4.126,25 4.165,26 4.016,27 4.029,28 0.287,29 0.177,30 0.114,31 0.072,32 5.147,33 0.521,36 19.153,37 3.2,38 14.024,39 2.298,40 2.891,41 0.258,42 2.495,43 4.128,45 4.11,46 4.11,47 6.602,48 7.375,49 7.664,50 8.078,51 15.561,52 1.065,53 0.138,54 1,55 127.663,56 6.351,58 4.502,60 18.011,61 0.177,62 7.921}
{0 CHEMBL570711,1 7.667,2 2.155,3 4.667,4 4.667,5 4.667,6 0.77,7 23.256,8 3.249,9 2.686,10 20.223,11 21.748,12 17.205,13 18.737,14 1,15 1.168,16 1.168,17 0.093,18 0.855,21 0.332,22 4.374,24 4.089,25 4.074,26 4.097,27 4.006,28 0.298,29 0.185,30 0.119,31 0.078,32 5.112,33 -0.534,36 13.817,37 2.962,38 14.202,39 1.723,40 2.54,41 0.214,42 2.157,43 4.735,45 2.481,46 2.481,47 6.099,48 6.684,49 6.916,50 7.256,51 15.759,52 0.333,53 -0.613,56 6.204,58 4.397,60 18.011,61 0.167,62 6.921}
{0 CHEMBL570712,1 7.661,2 2.155,3 4.661,4 4.661,5 4.661,6 0.77,7 23.24,8 3.268,9 2.678,10 20.21,11 21.734,12 17.195,13 18.726,14 1,15 1.148,16 1.148,17 0.093,18 0.824,21 0.332,22 4.374,24 4.087,25 4.073,26 4.096,27 4.004,28 0.298,29 0.186,30 0.121,31 0.077,32 5.112,33 -0.481,36 13.817,37 2.962,38 14.196,39 1.657,40 2.5,41 0.14,42 2.148,43 4.735,45 2.477,46 2.477,47 6.128,48 6.591,49 6.936,50 7.227,51 15.751,52 0.461,53 -0.53,56 6.204,58 4.398,60 18.011,61 0.164,62 7.398}
{0 CHEMBL570936,1 7.377,2 2.427,3 4.377,4 4.377,5 4.377,6 0.77,7 22.6,8 3.385,9 3.118,10 19.716,11 21.183,12 16.837,13 18.327,14 2.155,15 1.618,16 1.618,17 0.063,18 1.05,21 0.344,22 4.412,24 4.079,25 4.111,26 3.99,27 3.999,28 0.289,29 0.179,30 0.116,31 0.074,32 5.147,33 0.985,36 19.153,37 3.211,38 13.961,39 2.4,40 2.913,41 0.235,42 2.572,43 4.093,45 4.11,46 4.11,47 6.621,48 7.424,49 7.863,50 8.12,51 15.501,52 1.076,53 0.148,56 6.373,58 4.486,60 18.011,61 0.175,62 7.284}
{0 CHEMBL571154,1 7.079,2 2.015,3 4.079,4 4.079,5 4.079,6 0.77,7 21.531,8 2.961,9 2.544,10 18.749,11 20.192,12 15.966,13 17.45,14 0.935,15 1.032,16 1.032,17 0.081,18 1.055,21 0.34,22 3.593,24 4.009,25 4.034,26 3.942,27 3.942,28 0.29,29 0.187,30 0.123,31 0.08,32 4.543,33 -0.61,36 12.452,37 2.861,38 13.177,39 1.505,40 2.5,41 0.045,42 2.038,43 4.07,45 2.472,46 2.472,47 5.881,48 6.566,49 6.846,50 7.116,51 14.737,52 0.177,53 -0.631,56 5.991,58 4.305,60 18.011,61 0.184,62 6.959}
{0 CHEMBL571352,1 7.068,2 2.383,3 4.068,4 4.068,5 4.068,6 0.77,7 21.707,8 3.334,9 2.882,10 18.94,11 20.366,12 16.178,13 17.634,14 1.465,15 1.505,16 1.505,17 0.085,18 0.984,21 0.335,22 5.323,24 4.005,25 4.032,26 3.914,27 3.919,28 0.299,29 0.186,30 0.123,31 0.078,32 4.966,33 0.218,36 30.323,37 3.198,38 13.418,39 2.031,40 2.875,41 0.227,42 2.452,43 4.049,45 3.174,46 3.174,47 6.013,48 6.371,49 6.713,50 7.035,51 14.932,52 0.813,53 -0.15,56 6.274,58 4.374,60 36.022,61 0.167,62 6.854}
{0 CHEMBL571353,1 7.089,2 2.154,3 4.089,4 4.089,5 4.089,6 0.77,7 21.793,8 3.228,9 2.882,10 19.003,11 20.438,12 16.216,13 17.682,14 1.158,15 1.505,16 1.505,17 0.071,18 1.046,21 0.337,22 4.332,24 4.015,25 4.043,26 3.939,27 3.941,28 0.296,29 0.183,30 0.119,31 0.077,32 4.879,33 -0.226,36 19.153,37 2.961,38 13.428,39 2.012,40 2.592,41 0.157,42 2.452,43 4.059,45 2.925,46 2.925,47 6.108,48 6.622,49 6.938,50 7.232,51 14.954,52 0.527,53 -0.442,56 6.184,58 4.395,60 18.011,61 0.17,62 7.377}
{0 CHEMBL572005,1 7.454,2 2.396,3 4.454,4 4.454,5 4.454,6 0.77,7 22.755,8 3.327,9 3.032,10 19.836,11 21.314,12 16.927,13 18.422,14 1.847,15 1.532,16 1.532,17 0.065,18 1.012,21 0.345,22 4.297,24 4.086,25 4.1,26 4.08,27 4.037,28 0.287,29 0.177,30 0.114,31 0.072,32 5.147,33 0.521,36 19.153,37 3.2,38 14.024,39 2.298,40 2.891,41 0.258,42 2.463,43 4.34,45 4.11,46 4.11,47 6.602,48 7.375,49 7.664,50 8.078,51 15.561,52 1.062,53 0.138,54 1,55 127.663,56 6.351,58 4.502,60 18.011,61 0.177,62 7.155}
{0 CHEMBL572016,1 7.121,2 2.283,3 4.121,4 4.121,5 4.121,6 0.87,7 21.902,8 3.246,9 2.882,10 19.109,11 20.533,12 16.322,13 17.767,14 1.157,15 1.505,16 1.505,17 0.07,18 1.011,21 0.34,22 4.252,24 4.035,25 4.074,26 3.931,27 3.939,28 0.296,29 0.181,30 0.117,31 0.075,32 4.977,33 -0.237,36 20.623,37 3.088,38 13.537,39 2.012,40 2.592,41 0.209,42 2.452,43 4.074,45 2.939,46 2.939,47 6.126,48 6.577,49 6.905,50 7.193,51 15.028,52 0.454,53 -0.469,56 6.203,58 4.421,60 18.011,61 0.169,62 6.592}
{0 CHEMBL572018,1 7.089,2 2.154,3 4.089,4 4.089,5 4.089,6 0.77,7 21.793,8 3.228,9 2.882,10 19.003,11 20.438,12 16.216,13 17.682,14 1.158,15 1.505,16 1.505,17 0.073,18 1.048,21 0.337,22 4.305,24 4.009,25 4.039,26 3.924,27 3.928,28 0.296,29 0.183,30 0.119,31 0.077,32 4.879,33 -0.226,36 19.153,37 2.961,38 13.428,39 2.012,40 2.592,41 0.157,42 2.452,43 4.057,45 2.925,46 2.925,47 6.108,48 6.622,49 6.938,50 7.232,51 14.954,52 0.516,53 -0.439,56 6.184,58 4.395,60 18.011,61 0.17,62 5.77}
{0 CHEMBL572230,1 7.077,2 1.506,3 4.077,4 4.077,5 4.077,6 0.8,7 21.285,8 2.961,9 2.5,10 18.514,11 19.964,12 15.744,13 17.242,14 0.752,15 1,16 1,17 0.081,18 1.001,21 0.332,22 3.417,24 4.008,25 4.034,26 3.939,27 3.94,28 0.292,29 0.19,30 0.124,31 0.082,32 4.388,33 -0.954,36 11.333,37 2.554,38 12.972,39 1.5,40 2.5,41 0.029,42 2,43 4.057,45 2.136,46 2.136,47 5.825,48 6.514,49 6.799,50 7.059,51 14.557,52 0.177,53 -0.777,56 5.934,58 4.151,60 18.011,61 0.179,62 6.097}
{0 CHEMBL572251,1 7.454,2 2.396,3 4.454,4 4.454,5 4.454,6 0.77,7 22.755,8 3.327,9 3.032,10 19.836,11 21.314,12 16.927,13 18.422,14 1.847,15 1.532,16 1.532,17 0.063,18 1.096,21 0.345,22 4.176,24 4.151,25 4.188,26 4.053,27 4.062,28 0.287,29 0.177,30 0.114,31 0.072,32 5.147,33 0.521,36 19.153,37 3.2,38 14.024,39 2.298,40 2.891,41 0.258,42 2.494,43 4.142,45 4.11,46 4.11,47 6.602,48 7.375,49 7.664,50 8.078,51 15.561,52 1.066,53 0.138,54 1,55 127.663,56 6.351,58 4.502,60 18.011,61 0.177,62 5.377}
{0 CHEMBL572255,1 7.61,2 2.454,3 4.61,4 4.61,5 4.61,6 0.84,7 23.146,8 3.421,9 3.137,10 20.154,11 21.662,12 17.177,13 18.695,14 2.12,15 1.695,16 1.695,17 0.06,18 0.973,21 0.353,22 4.106,24 4.141,25 4.18,26 4.029,27 4.044,28 0.285,29 0.175,30 0.111,31 0.071,32 5.223,33 0.964,36 21.653,37 3.231,38 14.215,39 2.388,40 2.894,41 0.267,42 2.627,43 4.142,45 4.11,46 4.11,47 6.666,48 7.448,49 7.733,50 8.118,51 15.765,52 1.072,53 0.144,54 1,55 131.927,56 6.389,58 4.503,60 18.011,61 0.183,62 8.046}
{0 CHEMBL572256,1 7.089,2 2.154,3 4.089,4 4.089,5 4.089,6 0.77,7 21.793,8 3.228,9 2.882,10 19.003,11 20.438,12 16.216,13 17.682,14 1.158,15 1.505,16 1.505,17 0.071,18 1.14,21 0.337,22 4.332,24 4.018,25 4.045,26 3.949,27 3.949,28 0.296,29 0.183,30 0.119,31 0.077,32 4.879,33 -0.226,36 19.153,37 2.961,38 13.428,39 2.012,40 2.592,41 0.157,42 2.452,43 4.061,45 2.925,46 2.925,47 6.108,48 6.622,49 6.938,50 7.232,51 14.954,52 0.524,53 -0.441,56 6.184,58 4.395,60 18.011,61 0.17,62 5}
{0 CHEMBL576466,1 7.077,2 1.506,3 4.077,4 4.077,5 4.077,6 0.77,7 21.285,8 2.961,9 2.5,10 18.514,11 19.964,12 15.744,13 17.242,14 0.752,15 1,16 1,17 0.083,18 1.03,21 0.332,22 3.39,24 4.004,25 4.032,26 3.933,27 3.934,28 0.292,29 0.19,30 0.124,31 0.082,32 4.388,33 -0.954,36 11.333,37 2.554,38 12.972,39 1.5,40 2.5,41 0.029,42 1.992,43 4.056,45 2.136,46 2.136,47 5.825,48 6.514,49 6.799,50 7.059,51 14.557,52 0.177,53 -0.756,56 5.934,58 4.151,60 18.011,61 0.179,62 5.523}
{0 CHEMBL577049,1 7.454,2 2.298,3 4.454,4 4.454,5 4.454,6 0.8,7 22.614,8 3.266,9 2.891,10 19.683,11 21.169,12 16.762,13 18.269,14 1.649,15 1.414,16 1.414,17 0.087,18 0.927,21 0.346,22 3.677,24 4.125,25 4.164,26 4.016,27 4.029,28 0.28,29 0.183,30 0.116,31 0.074,32 4.902,33 0.521,36 15.984,37 3.032,38 13.849,39 2.072,40 2.792,41 0.164,42 2.4,43 4.127,45 3.162,46 3.162,47 6.519,48 7.343,49 7.624,50 8.037,51 15.405,52 1.027,53 0.108,54 1,55 110.537,56 6.205,58 4.252,60 18.011,61 0.182,62 6.932}
{0 CHEMBL578143,1 7.454,2 2.298,3 4.454,4 4.454,5 4.454,6 0.8,7 22.671,8 3.22,9 2.917,10 19.743,11 21.227,12 16.822,13 18.327,14 1.648,15 1.491,16 1.491,17 0.087,18 1.001,21 0.351,22 3.543,24 4.125,25 4.164,26 4.016,27 4.029,28 0.278,29 0.179,30 0.115,31 0.075,32 4.902,33 0.521,36 16.628,37 3.032,38 13.903,39 2.085,40 2.891,41 0.147,42 2.461,43 4.127,45 3.165,46 3.165,47 6.488,48 7.358,49 7.638,50 8.044,51 15.458,52 1.027,53 0.108,54 1,55 107.537,56 6.205,58 4.344,60 18.011,61 0.196,62 6.057}
{0 CHEMBL578618,1 7.121,2 2.283,3 4.121,4 4.121,5 4.121,6 0.87,7 21.902,8 3.246,9 2.882,10 19.109,11 20.533,12 16.322,13 17.767,14 1.157,15 1.505,16 1.505,17 0.07,18 1.002,21 0.34,22 4.252,24 4.034,25 4.072,26 3.937,27 3.943,28 0.296,29 0.181,30 0.117,31 0.075,32 4.977,33 -0.237,36 21.653,37 3.088,38 13.537,39 2.012,40 2.592,41 0.209,42 2.452,43 4.072,45 2.939,46 2.939,47 6.126,48 6.577,49 6.905,50 7.193,51 15.028,52 0.451,53 -0.468,56 6.203,58 4.421,60 18.011,61 0.169,62 6.26}
{0 CHEMBL579397,1 7.454,2 2.298,3 4.454,4 4.454,5 4.454,6 0.74,7 22.59,8 3.172,9 2.891,10 19.652,11 21.143,12 16.723,13 18.236,14 1.463,15 1.414,16 1.414,17 0.071,18 0.992,21 0.341,22 3.236,24 4.125,25 4.164,26 4.016,27 4.029,28 0.281,29 0.181,30 0.116,31 0.075,32 4.796,33 0.182,36 11.333,37 3.032,38 13.799,39 2.072,40 2.554,41 0.094,42 2.4,43 4.127,45 2.647,46 2.647,47 6.439,48 7.325,49 7.599,50 8.007,51 15.365,52 0.474,53 -0.41,54 1,55 98.149,56 6.145,58 4.244,60 18.011,61 0.186,62 6.788}
{0 CHEMBL583032,1 7.454,2 2.396,3 4.454,4 4.454,5 4.454,6 0.77,7 22.755,8 3.327,9 3.032,10 19.836,11 21.314,12 16.927,13 18.422,14 1.847,15 1.532,16 1.532,17 0.063,18 1.108,21 0.345,22 4.176,24 4.145,25 4.176,26 4.067,27 4.072,28 0.287,29 0.177,30 0.114,31 0.072,32 5.147,33 0.521,36 19.153,37 3.2,38 14.024,39 2.298,40 2.891,41 0.258,42 2.513,43 4.137,45 4.11,46 4.11,47 6.602,48 7.375,49 7.664,50 8.078,51 15.561,52 1.066,53 0.138,54 2,55 127.663,56 6.351,58 4.502,60 18.011,61 0.177,62 6.301}
{0 CHEMBL583230,1 7.454,2 2.298,3 4.454,4 4.454,5 4.454,6 0.71,7 22.611,8 3.264,9 2.891,10 19.678,11 21.166,12 16.756,13 18.264,14 1.466,15 1.414,16 1.414,17 0.071,18 0.966,21 0.341,22 3.447,24 4.125,25 4.164,26 4.016,27 4.029,28 0.283,29 0.182,30 0.115,31 0.074,32 4.902,33 0.204,36 11.995,37 3.032,38 13.842,39 2.072,40 2.764,41 0.155,42 2.4,43 4.127,45 3.158,46 3.158,47 6.494,48 7.339,49 7.614,50 8.027,51 15.4,52 0.682,53 -0.195,54 1,55 104.269,56 6.191,58 4.25,60 18.011,61 0.18,62 6.6}
{0 CHEMBL583231,1 7.439,2 2.298,3 4.439,4 4.439,5 4.439,6 0.88,7 22.72,8 3.383,9 3.019,10 19.796,11 21.278,12 16.879,13 18.38,14 2.113,15 1.532,16 1.532,17 0.143,18 1.073,21 0.336,22 5.252,24 4.126,25 4.166,26 4.013,27 4.027,28 0.282,29 0.176,30 0.114,31 0.074,32 4.997,33 1.084,36 25.509,37 3.032,38 13.966,39 2.253,40 2.845,41 0.176,42 2.495,43 4.091,45 3.58,46 3.58,47 6.63,48 7.414,49 7.66,50 8.046,51 15.514,52 1.926,53 0.916,54 1,55 146.264,56 6.314,58 4.46,60 31.788,61 0.201,62 5.878}
{0 CHEMBL583270,1 7.476,2 2.391,3 4.476,4 4.476,5 4.476,6 0.77,7 22.812,8 3.322,9 2.914,10 19.884,11 21.363,12 16.966,13 18.46,14 1.5,15 1.505,16 1.505,17 0.068,18 0.937,21 0.348,22 4.004,24 4.126,25 4.161,26 4.039,27 4.02,28 0.286,29 0.176,30 0.113,31 0.071,32 5.147,33 0.212,36 19.153,37 3.195,38 14.057,39 2.121,40 2.882,41 0.242,42 2.452,43 4.349,45 4.11,46 4.11,47 6.555,48 7.154,49 7.589,50 7.96,51 15.587,52 0.868,56 6.329,58 4.502,60 18.011,61 0.177,62 6.699}
{0 CHEMBL583451,1 7.095,2 2.012,3 4.095,4 4.095,5 4.095,6 0.77,7 21.813,8 3.225,9 2.849,10 19.024,11 20.447,12 16.239,13 17.686,14 1.157,15 1.414,16 1.414,17 0.075,18 1.061,21 0.341,22 4.021,24 4.024,25 4.06,26 3.932,27 3.937,28 0.295,29 0.182,30 0.118,31 0.075,32 4.879,33 -0.244,36 19.153,37 2.882,38 13.456,39 1.995,40 2.592,41 0.159,42 2.371,43 4.066,45 2.922,46 2.922,47 6.073,48 6.492,49 6.796,50 7.086,51 14.951,52 0.407,53 -0.482,56 6.158,58 4.4,60 18.011,61 0.171,62 5.046}
{0 CHEMBL583479,1 7.36,2 2.394,3 4.36,4 4.36,5 4.36,6 0.86,7 22.494,8 3.332,9 2.998,10 19.617,11 21.072,12 16.75,13 18.217,14 1.828,15 1.695,16 1.695,17 0.056,18 0.925,21 0.353,22 4.291,24 4.089,25 4.132,26 3.973,27 3.984,28 0.285,29 0.175,30 0.111,31 0.071,32 5.147,33 0.771,36 22.539,37 3.21,38 13.889,39 2.146,40 2.882,41 0.267,42 2.627,43 4.103,45 4.11,46 4.11,47 6.376,48 6.966,49 7.28,50 7.613,51 15.391,52 1.072,53 0.144,54 1,55 131.927,56 6.337,58 4.503,60 28.149,61 0.183,62 6.824}
{0 CHEMBL584688,1 7.454,2 2.298,3 4.454,4 4.454,5 4.454,6 0.8,7 22.623,8 3.27,9 2.899,10 19.693,11 21.179,12 16.775,13 18.281,14 1.847,15 1.498,16 1.498,17 0.08,18 0.902,21 0.344,22 3.915,24 4.126,25 4.165,26 4.017,27 4.029,28 0.284,29 0.181,30 0.115,31 0.073,32 4.945,33 0.521,36 21.118,37 3.032,38 13.866,39 2.073,40 2.887,41 0.172,42 2.48,43 4.127,45 3.169,46 3.169,47 6.544,48 7.347,49 7.634,50 8.047,51 15.419,52 1.038,53 0.116,54 1,55 116.805,56 6.243,58 4.259,60 18.011,61 0.177,62 6.721}
{0 CHEMBL585532,1 7.095,2 2.012,3 4.095,4 4.095,5 4.095,6 0.77,7 21.813,8 3.225,9 2.849,10 19.024,11 20.447,12 16.239,13 17.686,14 1.157,15 1.414,16 1.414,17 0.075,18 1.076,21 0.341,22 4.021,24 4.031,25 4.073,26 3.915,27 3.926,28 0.295,29 0.182,30 0.118,31 0.075,32 4.879,33 -0.244,36 25.213,37 2.882,38 13.456,39 1.995,40 2.592,41 0.159,42 2.371,43 4.075,45 2.922,46 2.922,47 6.073,48 6.492,49 6.796,50 7.086,51 14.951,52 0.4,53 -0.481,56 6.158,58 4.4,60 18.011,61 0.171,62 6.347}
