"molecule_id","FCFP4_1024b187","FCFP4_1024b216","FCFP4_1024b323","FCFP4_1024b325","FCFP4_1024b351","FCFP4_1024b360","FCFP4_1024b378","FCFP4_1024b412","FCFP4_1024b491","FCFP4_1024b540","FCFP4_1024b572","FCFP4_1024b635","FCFP4_1024b680","FCFP4_1024b684","FCFP4_1024b698","FCFP4_1024b730","FCFP4_1024b797","FCFP4_1024b8","FCFP4_1024b852","FCFP4_1024b863","FCFP4_1024b884","FCFP4_1024b888","FCFP4_1024b891","FCFP4_1024b113","FCFP4_1024b280","FCFP4_1024b1","FCFP4_1024b10","FCFP4_1024b100","FCFP4_1024b1000","FCFP4_1024b1001","FCFP4_1024b1002","FCFP4_1024b1003","FCFP4_1024b1004","FCFP4_1024b1005","FCFP4_1024b1006","FCFP4_1024b1007","FCFP4_1024b1008","FCFP4_1024b1009","FCFP4_1024b101","FCFP4_1024b1010","FCFP4_1024b1011","FCFP4_1024b1012","FCFP4_1024b1013","FCFP4_1024b1014","FCFP4_1024b1015","FCFP4_1024b1016","FCFP4_1024b1017","FCFP4_1024b1018","FCFP4_1024b1019","FCFP4_1024b102","FCFP4_1024b1020","pXC50"
{1 1,2 1,3 1,4 1,5 1,6 1,7 1,8 1,9 1,10 1,11 1,12 1,13 1,14 1,15 1,16 1,17 1,18 1,19 1,20 1,21 1,22 1,23 1,25 1,26 1,52 4.622}
{0 CHEMBL446027,24 1,26 1,27 1,52 4.092}
{0 CHEMBL446294,24 1,26 1,35 1,52 4.77}
{0 CHEMBL446382,24 1,26 1,27 1,52 4.319}
{0 CHEMBL446509,24 1,26 1,52 4.252}
{0 CHEMBL447403,24 1,26 1,52 4.076}
{0 CHEMBL447641,24 1,26 1,52 4.538}
{0 CHEMBL448828,24 1,26 1,52 5.222}
{0 CHEMBL449059,24 1,26 1,52 4.081}
{0 CHEMBL449070,1 1,2 1,3 1,4 1,5 1,6 1,7 1,8 1,9 1,10 1,11 1,12 1,13 1,14 1,15 1,16 1,17 1,18 1,19 1,20 1,21 1,22 1,23 1,25 1,26 1,52 4.91}
{0 CHEMBL449283,24 1,26 1,52 5.097}
{0 CHEMBL449680,1 1,2 1,3 1,4 1,5 1,6 1,7 1,8 1,9 1,10 1,11 1,12 1,13 1,14 1,15 1,16 1,17 1,18 1,19 1,20 1,21 1,22 1,23 1,25 1,26 1,52 5.066}
{0 CHEMBL449835,24 1,26 1,27 1,52 4.357}
{0 CHEMBL450488,24 1,26 1,52 4.77}
{0 CHEMBL450821,24 1,26 1,52 4.469}
{0 CHEMBL451426,1 1,2 1,3 1,4 1,5 1,6 1,7 1,8 1,9 1,10 1,11 1,12 1,13 1,14 1,15 1,16 1,17 1,18 1,19 1,20 1,21 1,22 1,23 1,25 1,26 1,52 4.907}
{0 CHEMBL453188,24 1,26 1,52 4.076}
{0 CHEMBL453469,24 1,25 1,26 1,52 4.724}
{0 CHEMBL453773,24 1,26 1,52 4.638}
{0 CHEMBL454258,1 1,2 1,3 1,4 1,5 1,6 1,7 1,8 1,9 1,10 1,11 1,12 1,13 1,14 1,15 1,16 1,17 1,18 1,19 1,20 1,21 1,22 1,23 1,25 1,26 1,52 4.595}
{0 CHEMBL454525,24 1,26 1,52 4.796}
{0 CHEMBL454532,26 1,27 1,51 1,52 4.387}
{0 CHEMBL455033,24 1,26 1,27 1,52 4.328}
{0 CHEMBL455247,24 1,26 1,52 4.854}
{0 CHEMBL462247,24 1,26 1,52 5.051}
{0 CHEMBL499590,1 1,2 1,3 1,4 1,5 1,6 1,7 1,8 1,9 1,10 1,11 1,12 1,13 1,14 1,15 1,16 1,17 1,18 1,19 1,20 1,21 1,22 1,23 1,25 1,26 1,49 1,52 5.301}
{0 CHEMBL499931,1 1,2 1,3 1,4 1,5 1,6 1,7 1,8 1,9 1,10 1,11 1,12 1,13 1,14 1,15 1,16 1,17 1,18 1,19 1,20 1,21 1,22 1,23 1,25 1,26 1,52 5.051}
{0 CHEMBL500998,1 1,2 1,3 1,4 1,5 1,6 1,7 1,8 1,9 1,10 1,11 1,12 1,13 1,14 1,15 1,16 1,17 1,18 1,19 1,20 1,21 1,22 1,23 1,25 1,26 1,52 5.143}
{0 CHEMBL501435,1 1,2 1,3 1,4 1,5 1,6 1,7 1,8 1,9 1,10 1,11 1,12 1,13 1,14 1,15 1,16 1,17 1,18 1,19 1,20 1,21 1,22 1,23 1,25 1,26 1,52 5.022}
{0 CHEMBL501622,1 1,2 1,3 1,4 1,5 1,6 1,7 1,8 1,9 1,10 1,11 1,12 1,13 1,14 1,15 1,16 1,17 1,18 1,19 1,20 1,21 1,22 1,23 1,25 1,26 1,52 5.276}
{0 CHEMBL501747,1 1,2 1,3 1,4 1,5 1,6 1,7 1,8 1,9 1,10 1,11 1,12 1,13 1,14 1,15 1,16 1,17 1,18 1,19 1,20 1,21 1,22 1,23 1,25 1,26 1,52 4.745}
{0 CHEMBL502131,24 1,26 1,52 4.59}
{0 CHEMBL503497,24 1,26 1,52 4.051}
{0 CHEMBL504171,24 1,26 1,52 4.481}
{0 CHEMBL504632,24 1,26 1,52 4.721}
{0 CHEMBL504756,24 1,26 1,27 1,52 4.575}
{0 CHEMBL505136,1 1,2 1,3 1,4 1,5 1,6 1,7 1,8 1,9 1,10 1,11 1,12 1,13 1,14 1,15 1,16 1,17 1,18 1,19 1,20 1,21 1,22 1,23 1,25 1,26 1,52 5.066}
{0 CHEMBL505170,24 1,26 1,52 4.854}
{0 CHEMBL505392,1 1,2 1,3 1,4 1,5 1,6 1,7 1,8 1,9 1,10 1,11 1,12 1,13 1,14 1,15 1,16 1,17 1,18 1,19 1,20 1,21 1,22 1,23 1,25 1,26 1,52 5.963}
{0 CHEMBL505486,24 1,26 1,52 4.699}
{0 CHEMBL505574,1 1,2 1,3 1,4 1,5 1,6 1,7 1,8 1,9 1,10 1,11 1,12 1,13 1,14 1,15 1,16 1,17 1,18 1,19 1,20 1,21 1,22 1,23 1,25 1,26 1,52 6.456}
{0 CHEMBL505984,24 1,26 1,52 5}
{0 CHEMBL507076,24 1,26 1,52 4.041}
{0 CHEMBL508118,1 1,2 1,3 1,4 1,5 1,6 1,7 1,8 1,9 1,10 1,11 1,12 1,13 1,14 1,15 1,16 1,17 1,18 1,19 1,20 1,21 1,22 1,23 1,25 1,26 1,52 6.114}
{0 CHEMBL508609,1 1,2 1,3 1,4 1,5 1,6 1,7 1,8 1,9 1,10 1,11 1,12 1,13 1,14 1,15 1,16 1,17 1,18 1,19 1,20 1,21 1,22 1,23 1,25 1,26 1,52 5.119}
{0 CHEMBL509116,24 1,26 1,52 4.398}
{0 CHEMBL509613,1 1,2 1,3 1,4 1,5 1,6 1,7 1,8 1,9 1,10 1,11 1,12 1,13 1,14 1,15 1,16 1,17 1,18 1,19 1,20 1,21 1,22 1,23 1,25 1,26 1,35 1,52 4.848}
{0 CHEMBL509824,1 1,2 1,3 1,4 1,5 1,6 1,7 1,8 1,9 1,10 1,11 1,12 1,13 1,14 1,15 1,16 1,17 1,18 1,19 1,20 1,21 1,22 1,23 1,25 1,26 1,52 5.046}
{0 CHEMBL526904,1 1,2 1,3 1,4 1,5 1,6 1,7 1,8 1,9 1,10 1,11 1,12 1,13 1,14 1,15 1,16 1,17 1,18 1,19 1,20 1,21 1,22 1,23 1,25 1,26 1,52 5.328}
{0 CHEMBL527088,1 1,2 1,3 1,4 1,5 1,6 1,7 1,8 1,9 1,10 1,11 1,12 1,13 1,14 1,15 1,16 1,17 1,18 1,19 1,20 1,21 1,22 1,23 1,25 1,26 1,52 6.301}
