{
  "data_set_description": {
    "collection_date": "November 2013",
    "creator": "Dr Jeremy Besnard, Dr Ivan Olier, Dr Noureddin Sadawi, Dr Larisa Soldatova, Dr Crina Grosan, Prof Ross King, Dr Richard Bickerton, Prof Andrew Hopkins and Dr Willem van Hoorn",
    "default_target_attribute": "pXC50",
    "description": "This dataset contains QSAR data (from ChEMBL version 17) showing activity values (unit is pseudo-pCI50) of several compounds on drug target ChEMBL_ID: CHEMBL2468 (TID: 10051), and it has 1007 rows and 43 features (not including molecule IDs and class feature: molecule_id and pXC50). The features represent Basic Molecular Descriptors which were generated from SMILES strings.  Missing value imputation was applied to this dataset (By choosing the Median).",
    "description_version": "1",
    "file_id": "3242952",
    "format": "ARFF",
    "id": "24277",
    "licence": "Public",
    "md5_checksum": "8a1e2a25ad2433116719f88d825009e0",
    "minio_url": "https://data.openml.org/datasets/0002/24277/dataset_24277.pq",
    "name": "QSAR-DATASET-FOR-DRUG-TARGET-CHEMBL2468",
    "original_data_url": "https://www.ebi.ac.uk/chembl/target/inspect/CHEMBL2468",
    "parquet_url": "https://data.openml.org/datasets/0002/24277/dataset_24277.pq",
    "processing_date": "2018-10-03 22:49:03",
    "row_id_attribute": "molecule_id",
    "status": "deactivated",
    "tag": [
      "MetaQSAR",
      "study_13"
    ],
    "upload_date": "2016-07-14T14:18:00",
    "url": "https://api.openml.org/data/v1/download/3242952/QSAR-DATASET-FOR-DRUG-TARGET-CHEMBL2468.arff",
    "version": "7",
    "visibility": "public"
  }
}