"molecule_id","FCFP4_1024b1","FCFP4_1024b10","FCFP4_1024b100","FCFP4_1024b1000","FCFP4_1024b1001","FCFP4_1024b1002","FCFP4_1024b1003","FCFP4_1024b1004","FCFP4_1024b1005","FCFP4_1024b1006","FCFP4_1024b1007","FCFP4_1024b1008","FCFP4_1024b1009","FCFP4_1024b101","FCFP4_1024b1010","FCFP4_1024b1011","FCFP4_1024b1012","FCFP4_1024b1013","FCFP4_1024b1014","FCFP4_1024b1015","FCFP4_1024b1016","FCFP4_1024b1017","FCFP4_1024b1018","FCFP4_1024b1019","FCFP4_1024b102","FCFP4_1024b1020","FCFP4_1024b1021","FCFP4_1024b1022","FCFP4_1024b1023","FCFP4_1024b1024","FCFP4_1024b103","FCFP4_1024b104","FCFP4_1024b105","FCFP4_1024b106","FCFP4_1024b107","FCFP4_1024b108","FCFP4_1024b109","FCFP4_1024b11","FCFP4_1024b110","FCFP4_1024b111","FCFP4_1024b112","FCFP4_1024b113","FCFP4_1024b114","FCFP4_1024b115","FCFP4_1024b116","FCFP4_1024b117","FCFP4_1024b118","FCFP4_1024b119","FCFP4_1024b12","FCFP4_1024b120","FCFP4_1024b121","pXC50"
{1 1,15 1,35 1,52 4.692}
{0 CHEMBL1232381,1 1,52 5.861}
{0 CHEMBL1300912,1 1,35 1,38 1,52 4.744}
{0 CHEMBL1302552,1 1,7 1,52 6.026}
{0 CHEMBL1303031,1 1,5 1,24 1,35 1,52 5.13}
{0 CHEMBL1303255,1 1,2 1,31 1,52 5.492}
{0 CHEMBL1304585,1 1,35 1,52 5.665}
{0 CHEMBL1304667,1 1,21 1,26 1,52 5.18}
{0 CHEMBL1306166,1 1,35 1,49 1,52 5.955}
{0 CHEMBL1306480,1 1,52 5.606}
{0 CHEMBL1306565,1 1,24 1,25 1,52 5.989}
{0 CHEMBL1306635,1 1,2 1,8 1,35 1,52 5.556}
{0 CHEMBL1307313,1 1,12 1,17 1,21 1,22 1,52 5.711}
{0 CHEMBL1307433,1 1,7 1,52 5.304}
{0 CHEMBL1308652,1 1,38 1,50 1,52 4.608}
{0 CHEMBL1312189,1 1,52 5.883}
{0 CHEMBL1313195,1 1,7 1,30 1,52 4.4}
{0 CHEMBL1314687,1 1,35 1,52 4.953}
{0 CHEMBL1318849,1 1,2 1,50 1,52 4.971}
{0 CHEMBL1319204,1 1,35 1,52 5.887}
{0 CHEMBL1320035,1 1,35 1,49 1,52 4.4}
{0 CHEMBL1324779,1 1,21 1,26 1,27 1,52 6.626}
{0 CHEMBL1326814,1 1,52 6.707}
{0 CHEMBL1327081,1 1,35 1,50 1,52 4.399}
{0 CHEMBL1327274,1 1,52 5.277}
{0 CHEMBL1329575,1 1,24 1,52 4.4}
{0 CHEMBL1329797,1 1,7 1,36 1,52 5.331}
{0 CHEMBL1329826,1 1,52 4.4}
{0 CHEMBL1330042,1 1,15 1,52 5.406}
{0 CHEMBL1330383,1 1,52 5.857}
{0 CHEMBL1334062,1 1,7 1,52 5.354}
{0 CHEMBL1336910,1 1,35 1,52 5.377}
{0 CHEMBL1337717,1 1,4 1,35 1,52 4.4}
{0 CHEMBL1339297,1 1,35 1,52 4.4}
{0 CHEMBL1341012,1 1,52 5.6}
{0 CHEMBL1341089,1 1,52 5.099}
{0 CHEMBL1341806,1 1,35 1,52 4.4}
{0 CHEMBL1342389,1 1,35 1,52 5.278}
{0 CHEMBL1343308,1 1,7 1,52 5.133}
{0 CHEMBL1343936,1 1,21 1,35 1,52 5.648}
{0 CHEMBL1344739,1 1,2 1,35 1,52 5.421}
{0 CHEMBL1344787,1 1,21 1,52 5.221}
{0 CHEMBL1345305,1 1,38 1,52 5.203}
{0 CHEMBL1346015,1 1,20 1,52 5.387}
{0 CHEMBL1347130,1 1,52 4.815}
{0 CHEMBL1347701,1 1,52 5.432}
{0 CHEMBL1348596,1 1,23 1,35 1,52 4.485}
{0 CHEMBL1349484,1 1,35 1,52 4.4}
{0 CHEMBL1352306,1 1,2 1,6 1,52 5.305}
{0 CHEMBL1353643,1 1,52 5.534}
{0 CHEMBL1354460,1 1,2 1,35 1,52 5.453}
{0 CHEMBL1357156,1 1,35 1,52 5.059}
{0 CHEMBL1358081,1 1,35 1,52 5.822}
{0 CHEMBL1358911,1 1,35 1,50 1,52 5.537}
{0 CHEMBL1359865,1 1,49 1,52 5.002}
{0 CHEMBL1363571,1 1,52 4.4}
{0 CHEMBL1364102,1 1,7 1,52 5.233}
{0 CHEMBL1366522,1 1,52 5.046}
{0 CHEMBL1367087,1 1,52 5.379}
{0 CHEMBL1367791,1 1,52 4.4}
{0 CHEMBL1368667,1 1,8 1,35 1,38 1,52 5.835}
{0 CHEMBL1369512,1 1,35 1,52 4.4}
{0 CHEMBL1369869,1 1,2 1,18 1,35 1,50 1,52 5.385}
{0 CHEMBL1370199,1 1,7 1,35 1,52 5.112}
{0 CHEMBL1370669,1 1,52 5.356}
{0 CHEMBL1373811,1 1,15 1,52 5.963}
{0 CHEMBL1375116,1 1,37 1,52 5.807}
{0 CHEMBL1376894,1 1,21 1,52 4.889}
{0 CHEMBL1379684,1 1,35 1,52 5.794}
{0 CHEMBL1380313,1 1,17 1,35 1,52 5.31}
{0 CHEMBL1380975,1 1,52 5.303}
{0 CHEMBL1381980,1 1,2 1,6 1,52 5.621}
{0 CHEMBL1382928,1 1,35 1,49 1,52 4.4}
{0 CHEMBL1384281,1 1,21 1,26 1,27 1,52 6.68}
{0 CHEMBL1385074,1 1,52 5.564}
{0 CHEMBL1385747,1 1,2 1,18 1,31 1,35 1,52 5.685}
{0 CHEMBL1386595,1 1,2 1,26 1,52 5.487}
{0 CHEMBL1388002,1 1,35 1,52 4.4}
{0 CHEMBL1391254,1 1,52 5.096}
{0 CHEMBL1391310,1 1,23 1,52 6.239}
{0 CHEMBL1391385,1 1,33 1,52 5.522}
{0 CHEMBL1391748,1 1,2 1,6 1,52 5.311}
{0 CHEMBL1392806,1 1,35 1,52 5.66}
{0 CHEMBL1393131,1 1,15 1,52 5.859}
{0 CHEMBL1394096,1 1,50 1,52 4.776}
{0 CHEMBL1397291,1 1,35 1,52 4.868}
{0 CHEMBL1398736,1 1,2 1,24 1,52 4.4}
{0 CHEMBL1401891,1 1,52 5.646}
{0 CHEMBL1402172,1 1,35 1,52 4.774}
{0 CHEMBL1402650,1 1,52 5.331}
{0 CHEMBL1402874,1 1,2 1,52 5.384}
{0 CHEMBL1405306,1 1,35 1,38 1,52 5.93}
{0 CHEMBL1406915,1 1,2 1,35 1,50 1,52 5.307}
{0 CHEMBL1407014,1 1,52 5.311}
{0 CHEMBL1407788,1 1,15 1,52 6.03}
{0 CHEMBL1407986,1 1,10 1,52 5.843}
{0 CHEMBL1409901,1 1,35 1,52 5.654}
{0 CHEMBL1410870,1 1,24 1,35 1,38 1,52 5.764}
{0 CHEMBL1413474,1 1,10 1,52 5.634}
{0 CHEMBL1414306,1 1,52 4.954}
{0 CHEMBL1415156,1 1,2 1,35 1,52 5.294}
{0 CHEMBL1417231,1 1,8 1,35 1,52 5.91}
{0 CHEMBL1418370,1 1,52 5.029}
{0 CHEMBL1423531,1 1,52 5.153}
{0 CHEMBL1425600,1 1,52 5.433}
{0 CHEMBL1425823,1 1,52 4.4}
{0 CHEMBL1427088,1 1,2 1,6 1,52 4.798}
{0 CHEMBL1430235,1 1,2 1,9 1,52 4.823}
{0 CHEMBL1431253,1 1,8 1,35 1,52 5.066}
{0 CHEMBL1431571,1 1,35 1,52 5.474}
{0 CHEMBL1431688,1 1,35 1,52 4.962}
{0 CHEMBL1431953,1 1,6 1,52 4.838}
{0 CHEMBL1432707,1 1,52 4.4}
{0 CHEMBL1433074,1 1,2 1,35 1,52 6.109}
{0 CHEMBL1442635,1 1,35 1,38 1,52 5.431}
{0 CHEMBL1446248,1 1,24 1,35 1,52 4.486}
{0 CHEMBL1447283,1 1,4 1,35 1,52 4.4}
{0 CHEMBL1452125,1 1,2 1,6 1,52 5.173}
{0 CHEMBL1453623,1 1,7 1,35 1,44 1,52 5.751}
{0 CHEMBL1454198,1 1,23 1,52 5.716}
{0 CHEMBL1454614,1 1,52 4.4}
{0 CHEMBL1455509,1 1,2 1,6 1,52 5.228}
{0 CHEMBL1456706,1 1,35 1,52 5.144}
{0 CHEMBL1456984,1 1,35 1,52 4.852}
{0 CHEMBL1457096,1 1,35 1,52 4.563}
{0 CHEMBL1457535,1 1,2 1,52 5.289}
{0 CHEMBL1459124,1 1,35 1,52 5.255}
{0 CHEMBL1461732,1 1,35 1,52 4.4}
{0 CHEMBL1462380,1 1,50 1,52 5.135}
{0 CHEMBL1462503,1 1,35 1,52 5.117}
{0 CHEMBL1462838,1 1,13 1,52 5.235}
{0 CHEMBL1462884,1 1,9 1,35 1,52 5.539}
{0 CHEMBL1463659,1 1,7 1,28 1,52 5.329}
{0 CHEMBL1464502,1 1,35 1,38 1,52 5.699}
{0 CHEMBL1464805,1 1,35 1,52 5.296}
{0 CHEMBL1464821,1 1,52 5.453}
{0 CHEMBL1465171,1 1,2 1,6 1,52 5.004}
{0 CHEMBL1467089,1 1,35 1,52 5.183}
{0 CHEMBL1468336,1 1,24 1,39 1,52 4.4}
{0 CHEMBL1470378,1 1,52 5.761}
{0 CHEMBL1471296,1 1,35 1,38 1,52 5.745}
{0 CHEMBL1471788,1 1,35 1,49 1,52 4.399}
{0 CHEMBL1475400,1 1,52 4.779}
{0 CHEMBL1476478,1 1,35 1,52 5.172}
{0 CHEMBL1477452,1 1,2 1,52 5.203}
{0 CHEMBL1479469,1 1,35 1,52 5.452}
{0 CHEMBL1480178,1 1,35 1,52 5.307}
{0 CHEMBL1482670,1 1,35 1,38 1,52 6.133}
{0 CHEMBL1482795,1 1,35 1,38 1,52 5.406}
{0 CHEMBL1485768,1 1,35 1,52 5.847}
{0 CHEMBL1486010,1 1,52 5.554}
{0 CHEMBL1488092,1 1,15 1,52 5.754}
{0 CHEMBL1488651,1 1,7 1,39 1,52 5.576}
{0 CHEMBL1488696,1 1,52 5.42}
{0 CHEMBL1494994,1 1,7 1,17 1,52 4.4}
{0 CHEMBL1497617,1 1,31 1,35 1,52 5.382}
{0 CHEMBL1499411,1 1,9 1,15 1,52 6.219}
{0 CHEMBL1499421,1 1,35 1,52 4.4}
{0 CHEMBL1501734,1 1,35 1,52 5.184}
{0 CHEMBL1503060,1 1,2 1,52 5.297}
{0 CHEMBL1505221,1 1,49 1,52 5.328}
{0 CHEMBL1505334,1 1,35 1,52 5.397}
{0 CHEMBL1508525,1 1,52 5.022}
{0 CHEMBL1508847,1 1,3 1,27 1,52 4.4}
{0 CHEMBL1511291,1 1,2 1,9 1,52 5.614}
{0 CHEMBL1513384,1 1,52 5.105}
{0 CHEMBL1513785,1 1,2 1,35 1,52 5.357}
{0 CHEMBL1514625,1 1,2 1,52 4.532}
{0 CHEMBL1517409,1 1,52 5.201}
{0 CHEMBL1519514,1 1,2 1,18 1,35 1,52 5.671}
{0 CHEMBL1520797,1 1,2 1,52 5.273}
{0 CHEMBL1521729,1 1,35 1,52 5.812}
{0 CHEMBL1523808,1 1,35 1,52 5.328}
{0 CHEMBL1529161,1 1,2 1,28 1,35 1,52 5.079}
{0 CHEMBL1531523,1 1,16 1,35 1,38 1,52 5.256}
{0 CHEMBL1534931,1 1,2 1,52 4.4}
{0 CHEMBL1535636,1 1,52 5.706}
{0 CHEMBL1536665,1 1,35 1,52 5.119}
{0 CHEMBL1536779,1 1,24 1,35 1,52 5.694}
{0 CHEMBL1539438,1 1,35 1,52 5.531}
{0 CHEMBL1539768,1 1,35 1,52 5.369}
{0 CHEMBL1539954,1 1,35 1,43 1,52 5.126}
{0 CHEMBL1541024,1 1,35 1,43 1,52 5.228}
{0 CHEMBL1541029,1 1,2 1,52 5.479}
{0 CHEMBL1542646,1 1,2 1,35 1,52 5.355}
{0 CHEMBL1542847,1 1,24 1,52 5.399}
{0 CHEMBL1543331,1 1,9 1,52 5.627}
{0 CHEMBL1543662,1 1,16 1,35 1,38 1,52 5.185}
{0 CHEMBL1544051,1 1,23 1,35 1,52 4.4}
{0 CHEMBL1544403,1 1,52 7.256}
{0 CHEMBL1549101,1 1,35 1,52 5.002}
{0 CHEMBL1550435,1 1,11 1,35 1,52 5.624}
{0 CHEMBL1560169,1 1,45 1,52 5.32}
{0 CHEMBL1562444,1 1,35 1,36 1,47 1,52 5.543}
{0 CHEMBL1563863,1 1,52 5.736}
{0 CHEMBL1564075,1 1,2 1,35 1,52 4.4}
{0 CHEMBL1565040,1 1,4 1,35 1,50 1,52 6.448}
{0 CHEMBL1565261,1 1,2 1,6 1,52 5.53}
{0 CHEMBL1566010,1 1,2 1,52 5.764}
{0 CHEMBL1569119,1 1,16 1,52 5.4}
{0 CHEMBL1571111,1 1,7 1,52 4.4}
{0 CHEMBL1573867,1 1,2 1,6 1,52 5.647}
{0 CHEMBL1575283,1 1,35 1,52 5.456}
{0 CHEMBL1575389,1 1,21 1,26 1,27 1,52 6.625}
{0 CHEMBL1576064,1 1,15 1,52 5.801}
{0 CHEMBL1576907,1 1,2 1,25 1,52 5.354}
{0 CHEMBL1577894,1 1,2 1,24 1,26 1,35 1,52 5.519}
{0 CHEMBL1579576,1 1,2 1,6 1,52 5.627}
{0 CHEMBL1579942,1 1,35 1,52 4.929}
{0 CHEMBL1580310,1 1,52 4.4}
{0 CHEMBL1580962,1 1,21 1,35 1,52 5.639}
{0 CHEMBL1581437,1 1,52 5.207}
{0 CHEMBL1582191,1 1,43 1,52 5.057}
{0 CHEMBL1584932,1 1,24 1,52 5.385}
{0 CHEMBL1589959,1 1,35 1,50 1,52 5.021}
{0 CHEMBL1592326,1 1,52 5.609}
{0 CHEMBL1598762,1 1,52 4.4}
{0 CHEMBL1600566,1 1,52 5.633}
{0 CHEMBL1600749,1 1,52 5.567}
{0 CHEMBL1601179,1 1,52 4.751}
{0 CHEMBL1601194,1 1,10 1,52 6.101}
{0 CHEMBL1601448,1 1,52 4.863}
{0 CHEMBL1601538,1 1,35 1,52 5.553}
{0 CHEMBL1602811,1 1,35 1,52 6.818}
{0 CHEMBL1605363,1 1,35 1,38 1,52 4.4}
{0 CHEMBL1607639,1 1,35 1,52 5.777}
{0 CHEMBL1608748,1 1,2 1,6 1,52 4.864}
{0 CHEMBL1609827,1 1,35 1,52 5.178}
{0 CHEMBL1610242,1 1,33 1,35 1,52 5.371}
{0 CHEMBL1610464,1 1,52 4.4}
{0 CHEMBL1613080,1 1,21 1,49 1,52 4.4}
{0 CHEMBL233149,1 1,27 1,52 4.4}
{0 CHEMBL312032,1 1,35 1,52 6.298}
{0 CHEMBL388590,1 1,9 1,52 5.318}
{0 CHEMBL450135,1 1,15 1,52 6.404}
{0 CHEMBL51931,1 1,52 5.735}
{0 CHEMBL578512,1 1,7 1,52 4.4}
{0 CHEMBL600336,1 1,31 1,35 1,52 4.979}
{0 CHEMBL601757,1 1,7 1,52 4.4}
