{
  "data_set_description": {
    "collection_date": "November 2013",
    "creator": "Dr Jeremy Besnard, Dr Ivan Olier, Dr Noureddin Sadawi, Dr Larisa Soldatova, Dr Crina Grosan, Prof Ross King, Dr Richard Bickerton, Prof Andrew Hopkins and Dr Willem van Hoorn",
    "default_target_attribute": "pXC50",
    "description": "This dataset contains QSAR data (from ChEMBL version 17) showing activity values (unit is pseudo-pCI50) of several compounds on drug target ChEMBL_ID: CHEMBL6098 (TID: 102406), and it has 23 rows and 1178 features (not including molecule IDs and class feature: molecule_id and pXC50). The features represent Molecular Descriptors which were generated from SMILES strings. Missing value imputation was applied to this dataset (By choosing the Median).",
    "description_version": "1",
    "file_id": "3240149",
    "format": "ARFF",
    "id": "24132",
    "licence": "Public",
    "md5_checksum": "50419c7b857380ef6f444aa25433f728",
    "minio_url": "https://data.openml.org/datasets/0002/24132/dataset_24132.pq",
    "name": "QSAR-DATASET-FOR-DRUG-TARGET-CHEMBL6098",
    "original_data_url": "https://www.ebi.ac.uk/chembl/target/inspect/CHEMBL6098",
    "parquet_url": "https://data.openml.org/datasets/0002/24132/dataset_24132.pq",
    "processing_date": "2018-10-03 22:43:33",
    "row_id_attribute": "molecule_id",
    "status": "deactivated",
    "tag": [
      "MetaQSAR",
      "study_13"
    ],
    "upload_date": "2016-07-14T13:58:51",
    "url": "https://api.openml.org/data/v1/download/3240149/QSAR-DATASET-FOR-DRUG-TARGET-CHEMBL6098.arff",
    "version": "7",
    "visibility": "public"
  }
}