{
  "data_features": {
    "feature": [
      {
        "data_type": "nominal",
        "index": "0",
        "is_ignore": "false",
        "is_row_identifier": "true",
        "is_target": "false",
        "name": "molecule_id",
        "nominal_value": [
          "CHEMBL1165197",
          "CHEMBL1169627",
          "CHEMBL117537",
          "CHEMBL1181770",
          "CHEMBL1198307",
          "CHEMBL1200531",
          "CHEMBL1208858",
          "CHEMBL1210154",
          "CHEMBL125417",
          "CHEMBL1256692",
          "CHEMBL1256750",
          "CHEMBL1258223",
          "CHEMBL1258452",
          "CHEMBL1258671",
          "CHEMBL126021",
          "CHEMBL126138",
          "CHEMBL126666",
          "CHEMBL126667",
          "CHEMBL126737",
          "CHEMBL126823",
          "CHEMBL126897",
          "CHEMBL126898",
          "CHEMBL126994",
          "CHEMBL1275709",
          "CHEMBL1278088",
          "CHEMBL128099",
          "CHEMBL128184",
          "CHEMBL128185",
          "CHEMBL128848",
          "CHEMBL128914",
          "CHEMBL128993",
          "CHEMBL129177",
          "CHEMBL129208",
          "CHEMBL129476",
          "CHEMBL129774",
          "CHEMBL1303361",
          "CHEMBL1304909",
          "CHEMBL130585",
          "CHEMBL1306479",
          "CHEMBL1307021",
          "CHEMBL1307063",
          "CHEMBL1308389",
          "CHEMBL1315401",
          "CHEMBL1315948",
          "CHEMBL1325297",
          "CHEMBL1325945",
          "CHEMBL1327306",
          "CHEMBL1331866",
          "CHEMBL1332208",
          "CHEMBL1332532",
          "CHEMBL133455",
          "CHEMBL1334918",
          "CHEMBL1336",
          "CHEMBL133868",
          "CHEMBL1340264",
          "CHEMBL1344909",
          "CHEMBL1345157",
          "CHEMBL1345947",
          "CHEMBL1348719",
          "CHEMBL1352185",
          "CHEMBL1353993",
          "CHEMBL1355165",
          "CHEMBL1356740",
          "CHEMBL1361813",
          "CHEMBL1363204",
          "CHEMBL1364960",
          "CHEMBL1365254",
          "CHEMBL1365563",
          "CHEMBL1366308",
          "CHEMBL1370471",
          "CHEMBL137781",
          "CHEMBL1378322",
          "CHEMBL1378959",
          "CHEMBL1379878",
          "CHEMBL1380599",
          "CHEMBL13816",
          "CHEMBL1382321",
          "CHEMBL1385823",
          "CHEMBL1387006",
          "CHEMBL1387977",
          "CHEMBL1388222",
          "CHEMBL138989",
          "CHEMBL1390846",
          "CHEMBL1392786",
          "CHEMBL1393837",
          "CHEMBL1398707",
          "CHEMBL1398870",
          "CHEMBL1399743",
          "CHEMBL1403842",
          "CHEMBL1407554",
          "CHEMBL1412340",
          "CHEMBL1416425",
          "CHEMBL1419241",
          "CHEMBL1419563",
          "CHEMBL1422217",
          "CHEMBL1423609",
          "CHEMBL1423927",
          "CHEMBL1425453",
          "CHEMBL1426979",
          "CHEMBL1427690",
          "CHEMBL1429212",
          "CHEMBL1430335",
          "CHEMBL1437660",
          "CHEMBL1437810",
          "CHEMBL1437975",
          "CHEMBL1439686",
          "CHEMBL1440235",
          "CHEMBL1440652",
          "CHEMBL1443243",
          "CHEMBL1444121",
          "CHEMBL1445858",
          "CHEMBL1447060",
          "CHEMBL1447552",
          "CHEMBL1448229",
          "CHEMBL1450071",
          "CHEMBL1454070",
          "CHEMBL1457803",
          "CHEMBL1458051",
          "CHEMBL1458515",
          "CHEMBL1458770",
          "CHEMBL1458967",
          "CHEMBL1460676",
          "CHEMBL1463367",
          "CHEMBL1463894",
          "CHEMBL1464640",
          "CHEMBL1468190",
          "CHEMBL1472987",
          "CHEMBL1473706",
          "CHEMBL1482070",
          "CHEMBL1482107",
          "CHEMBL1486861",
          "CHEMBL1487650",
          "CHEMBL1488501",
          "CHEMBL1490069",
          "CHEMBL1493736",
          "CHEMBL1494093",
          "CHEMBL1500489",
          "CHEMBL1506767",
          "CHEMBL1507251",
          "CHEMBL1509052",
          "CHEMBL1512925",
          "CHEMBL1513567",
          "CHEMBL1515502",
          "CHEMBL1521521",
          "CHEMBL1522542",
          "CHEMBL1524932",
          "CHEMBL1531172",
          "CHEMBL1531675",
          "CHEMBL1533638",
          "CHEMBL1540756",
          "CHEMBL1544567",
          "CHEMBL1545927",
          "CHEMBL1548",
          "CHEMBL1548019",
          "CHEMBL1548542",
          "CHEMBL1548948",
          "CHEMBL1548987",
          "CHEMBL1550356",
          "CHEMBL1550403",
          "CHEMBL1558215",
          "CHEMBL1561591",
          "CHEMBL1561871",
          "CHEMBL1563176",
          "CHEMBL1563669",
          "CHEMBL1564646",
          "CHEMBL1566118",
          "CHEMBL1566963",
          "CHEMBL1567143",
          "CHEMBL1569933",
          "CHEMBL1572068",
          "CHEMBL1577639",
          "CHEMBL1579434",
          "CHEMBL1581275",
          "CHEMBL1581674",
          "CHEMBL1582232",
          "CHEMBL1583291",
          "CHEMBL1584594",
          "CHEMBL1586285",
          "CHEMBL1587149",
          "CHEMBL1587574",
          "CHEMBL1587604",
          "CHEMBL1587837",
          "CHEMBL1588202",
          "CHEMBL1595735",
          "CHEMBL1596869",
          "CHEMBL1597912",
          "CHEMBL1599024",
          "CHEMBL1600293",
          "CHEMBL1600506",
          "CHEMBL1603547",
          "CHEMBL1603928",
          "CHEMBL1604493",
          "CHEMBL1606743",
          "CHEMBL1607240",
          "CHEMBL1609119",
          "CHEMBL1610756",
          "CHEMBL1612697",
          "CHEMBL1613445",
          "CHEMBL161507",
          "CHEMBL161811",
          "CHEMBL1628596",
          "CHEMBL1632158",
          "CHEMBL1632174",
          "CHEMBL1672288",
          "CHEMBL1698841",
          "CHEMBL1699738",
          "CHEMBL1699902",
          "CHEMBL1700227",
          "CHEMBL1700847",
          "CHEMBL1700880",
          "CHEMBL1703982",
          "CHEMBL1704769",
          "CHEMBL1705302",
          "CHEMBL1706148",
          "CHEMBL1707116",
          "CHEMBL1708052",
          "CHEMBL1708311",
          "CHEMBL1708714",
          "CHEMBL1709988",
          "CHEMBL1710136",
          "CHEMBL1713166",
          "CHEMBL1713682",
          "CHEMBL1714015",
          "CHEMBL1715611",
          "CHEMBL1717557",
          "CHEMBL1719184",
          "CHEMBL1720091",
          "CHEMBL1720300",
          "CHEMBL1720903",
          "CHEMBL1721095",
          "CHEMBL1722114",
          "CHEMBL1722228",
          "CHEMBL1722360",
          "CHEMBL1722570",
          "CHEMBL1722730",
          "CHEMBL1724267",
          "CHEMBL1727052",
          "CHEMBL1727246",
          "CHEMBL1727653",
          "CHEMBL1728158",
          "CHEMBL1728200",
          "CHEMBL1728422",
          "CHEMBL1730502",
          "CHEMBL1730890",
          "CHEMBL1731939",
          "CHEMBL1732043",
          "CHEMBL1732484",
          "CHEMBL1734003",
          "CHEMBL1734772",
          "CHEMBL1735778",
          "CHEMBL1736138",
          "CHEMBL1736686",
          "CHEMBL1794855",
          "CHEMBL18041",
          "CHEMBL1829958",
          "CHEMBL1829959",
          "CHEMBL1829961",
          "CHEMBL185676",
          "CHEMBL185996",
          "CHEMBL186261",
          "CHEMBL1864323",
          "CHEMBL186450",
          "CHEMBL186849",
          "CHEMBL187029",
          "CHEMBL1872339",
          "CHEMBL187415",
          "CHEMBL187621",
          "CHEMBL187928",
          "CHEMBL188050",
          "CHEMBL18840",
          "CHEMBL188440",
          "CHEMBL188486",
          "CHEMBL189262",
          "CHEMBL1892729",
          "CHEMBL1893806",
          "CHEMBL189689",
          "CHEMBL1898602",
          "CHEMBL1898753",
          "CHEMBL1898779",
          "CHEMBL1902708",
          "CHEMBL190382",
          "CHEMBL191460",
          "CHEMBL191583",
          "CHEMBL1967837",
          "CHEMBL1968356",
          "CHEMBL198463",
          "CHEMBL1985575",
          "CHEMBL1986259",
          "CHEMBL199824",
          "CHEMBL2001739",
          "CHEMBL2003819",
          "CHEMBL2005743",
          "CHEMBL203013",
          "CHEMBL2031737",
          "CHEMBL209821",
          "CHEMBL2111848",
          "CHEMBL2181166",
          "CHEMBL2181168",
          "CHEMBL2181169",
          "CHEMBL2181170",
          "CHEMBL2181171",
          "CHEMBL2181187",
          "CHEMBL2181188",
          "CHEMBL2181189",
          "CHEMBL2204360",
          "CHEMBL2205811",
          "CHEMBL2205816",
          "CHEMBL2205836",
          "CHEMBL229429",
          "CHEMBL24462",
          "CHEMBL250699",
          "CHEMBL252258",
          "CHEMBL255898",
          "CHEMBL256047",
          "CHEMBL256048",
          "CHEMBL256049",
          "CHEMBL256693",
          "CHEMBL256694",
          "CHEMBL257302",
          "CHEMBL257450",
          "CHEMBL257744",
          "CHEMBL258073",
          "CHEMBL258075",
          "CHEMBL263881",
          "CHEMBL266591",
          "CHEMBL267014",
          "CHEMBL267615",
          "CHEMBL267930",
          "CHEMBL269236",
          "CHEMBL269538",
          "CHEMBL269964",
          "CHEMBL270131",
          "CHEMBL270176",
          "CHEMBL270177",
          "CHEMBL270409",
          "CHEMBL270658",
          "CHEMBL270840",
          "CHEMBL270841",
          "CHEMBL271253",
          "CHEMBL271298",
          "CHEMBL272355",
          "CHEMBL272517",
          "CHEMBL272752",
          "CHEMBL272781",
          "CHEMBL273170",
          "CHEMBL273921",
          "CHEMBL274384",
          "CHEMBL27441",
          "CHEMBL277120",
          "CHEMBL278193",
          "CHEMBL278509",
          "CHEMBL278751",
          "CHEMBL282199",
          "CHEMBL282424",
          "CHEMBL282829",
          "CHEMBL283036",
          "CHEMBL28607",
          "CHEMBL28651",
          "CHEMBL287671",
          "CHEMBL28833",
          "CHEMBL28997",
          "CHEMBL295234",
          "CHEMBL29808",
          "CHEMBL313631",
          "CHEMBL313714",
          "CHEMBL317971",
          "CHEMBL326263",
          "CHEMBL338095",
          "CHEMBL338115",
          "CHEMBL338696",
          "CHEMBL340646",
          "CHEMBL340807",
          "CHEMBL340861",
          "CHEMBL343755",
          "CHEMBL349843",
          "CHEMBL361256",
          "CHEMBL363678",
          "CHEMBL365084",
          "CHEMBL365422",
          "CHEMBL370110",
          "CHEMBL371300",
          "CHEMBL39",
          "CHEMBL401541",
          "CHEMBL401745",
          "CHEMBL402143",
          "CHEMBL402179",
          "CHEMBL402400",
          "CHEMBL402874",
          "CHEMBL403102",
          "CHEMBL403103",
          "CHEMBL404248",
          "CHEMBL404365",
          "CHEMBL404372",
          "CHEMBL404511",
          "CHEMBL408152",
          "CHEMBL42",
          "CHEMBL421283",
          "CHEMBL425190",
          "CHEMBL426317",
          "CHEMBL429136",
          "CHEMBL429925",
          "CHEMBL433352",
          "CHEMBL435814",
          "CHEMBL435949",
          "CHEMBL439240",
          "CHEMBL440524",
          "CHEMBL441896",
          "CHEMBL442",
          "CHEMBL446356",
          "CHEMBL446459",
          "CHEMBL467094",
          "CHEMBL470432",
          "CHEMBL476838",
          "CHEMBL476839",
          "CHEMBL482496",
          "CHEMBL489408",
          "CHEMBL490632",
          "CHEMBL490633",
          "CHEMBL490634",
          "CHEMBL497963",
          "CHEMBL50498",
          "CHEMBL51",
          "CHEMBL511609",
          "CHEMBL515472",
          "CHEMBL516088",
          "CHEMBL517986",
          "CHEMBL522708",
          "CHEMBL535371",
          "CHEMBL536335",
          "CHEMBL536539",
          "CHEMBL536557",
          "CHEMBL536561",
          "CHEMBL536562",
          "CHEMBL536789",
          "CHEMBL536790",
          "CHEMBL536791",
          "CHEMBL537022",
          "CHEMBL537248",
          "CHEMBL538029",
          "CHEMBL538340",
          "CHEMBL539103",
          "CHEMBL541394",
          "CHEMBL541396",
          "CHEMBL541993",
          "CHEMBL542581",
          "CHEMBL552782",
          "CHEMBL555146",
          "CHEMBL556983",
          "CHEMBL557381",
          "CHEMBL557746",
          "CHEMBL558579",
          "CHEMBL56",
          "CHEMBL570399",
          "CHEMBL595449",
          "CHEMBL6310",
          "CHEMBL6409",
          "CHEMBL6616",
          "CHEMBL7143",
          "CHEMBL7318",
          "CHEMBL85392",
          "CHEMBL93240",
          "CHEMBL95104",
          "CHEMBL96504",
          "CHEMBL96729",
          "CHEMBL97518",
          "CHEMBL99071"
        ],
        "number_of_missing_values": "0"
      },
      {
        "data_type": "numeric",
        "index": "1",
        "is_ignore": "false",
        "is_row_identifier": "false",
        "is_target": "false",
        "name": "MW",
        "number_of_missing_values": "0"
      },
      {
        "data_type": "numeric",
        "index": "2",
        "is_ignore": "false",
        "is_row_identifier": "false",
        "is_target": "false",
        "name": "SCBO",
        "number_of_missing_values": "0"
      },
      {
        "data_type": "numeric",
        "index": "3",
        "is_ignore": "false",
        "is_row_identifier": "false",
        "is_target": "false",
        "name": "nSK",
        "number_of_missing_values": "0"
      },
      {
        "data_type": "numeric",
        "index": "4",
        "is_ignore": "false",
        "is_row_identifier": "false",
        "is_target": "false",
        "name": "nBO",
        "number_of_missing_values": "0"
      },
      {
        "data_type": "numeric",
        "index": "5",
        "is_ignore": "false",
        "is_row_identifier": "false",
        "is_target": "false",
        "name": "nAB",
        "number_of_missing_values": "0"
      },
      {
        "data_type": "numeric",
        "index": "6",
        "is_ignore": "false",
        "is_row_identifier": "false",
        "is_target": "false",
        "name": "Sp",
        "number_of_missing_values": "0"
      },
      {
        "data_type": "numeric",
        "index": "7",
        "is_ignore": "false",
        "is_row_identifier": "false",
        "is_target": "false",
        "name": "nBM",
        "number_of_missing_values": "0"
      },
      {
        "data_type": "numeric",
        "index": "8",
        "is_ignore": "false",
        "is_row_identifier": "false",
        "is_target": "false",
        "name": "Se",
        "number_of_missing_values": "0"
      },
      {
        "data_type": "numeric",
        "index": "9",
        "is_ignore": "false",
        "is_row_identifier": "false",
        "is_target": "false",
        "name": "nAT",
        "number_of_missing_values": "0"
      },
      {
        "data_type": "numeric",
        "index": "10",
        "is_ignore": "false",
        "is_row_identifier": "false",
        "is_target": "false",
        "name": "nCsp2",
        "number_of_missing_values": "0"
      },
      {
        "data_type": "numeric",
        "index": "11",
        "is_ignore": "false",
        "is_row_identifier": "false",
        "is_target": "false",
        "name": "Si",
        "number_of_missing_values": "0"
      },
      {
        "data_type": "numeric",
        "index": "12",
        "is_ignore": "false",
        "is_row_identifier": "false",
        "is_target": "false",
        "name": "nHet",
        "number_of_missing_values": "0"
      },
      {
        "data_type": "numeric",
        "index": "13",
        "is_ignore": "false",
        "is_row_identifier": "false",
        "is_target": "false",
        "name": "nO",
        "number_of_missing_values": "0"
      },
      {
        "data_type": "numeric",
        "index": "14",
        "is_ignore": "false",
        "is_row_identifier": "false",
        "is_target": "false",
        "name": "nC",
        "number_of_missing_values": "0"
      },
      {
        "data_type": "numeric",
        "index": "15",
        "is_ignore": "false",
        "is_row_identifier": "false",
        "is_target": "false",
        "name": "nBT",
        "number_of_missing_values": "0"
      },
      {
        "data_type": "numeric",
        "index": "16",
        "is_ignore": "false",
        "is_row_identifier": "false",
        "is_target": "false",
        "name": "nS",
        "number_of_missing_values": "0"
      },
      {
        "data_type": "numeric",
        "index": "17",
        "is_ignore": "false",
        "is_row_identifier": "false",
        "is_target": "false",
        "name": "O.",
        "number_of_missing_values": "0"
      },
      {
        "data_type": "numeric",
        "index": "18",
        "is_ignore": "false",
        "is_row_identifier": "false",
        "is_target": "false",
        "name": "Mi",
        "number_of_missing_values": "0"
      },
      {
        "data_type": "numeric",
        "index": "19",
        "is_ignore": "false",
        "is_row_identifier": "false",
        "is_target": "false",
        "name": "RBF",
        "number_of_missing_values": "0"
      },
      {
        "data_type": "numeric",
        "index": "20",
        "is_ignore": "false",
        "is_row_identifier": "false",
        "is_target": "false",
        "name": "RBN",
        "number_of_missing_values": "0"
      },
      {
        "data_type": "numeric",
        "index": "21",
        "is_ignore": "false",
        "is_row_identifier": "false",
        "is_target": "false",
        "name": "N.",
        "number_of_missing_values": "0"
      },
      {
        "data_type": "numeric",
        "index": "22",
        "is_ignore": "false",
        "is_row_identifier": "false",
        "is_target": "false",
        "name": "Sv",
        "number_of_missing_values": "0"
      },
      {
        "data_type": "numeric",
        "index": "23",
        "is_ignore": "false",
        "is_row_identifier": "false",
        "is_target": "false",
        "name": "nDB",
        "number_of_missing_values": "0"
      },
      {
        "data_type": "numeric",
        "index": "24",
        "is_ignore": "false",
        "is_row_identifier": "false",
        "is_target": "false",
        "name": "nH",
        "number_of_missing_values": "0"
      },
      {
        "data_type": "numeric",
        "index": "25",
        "is_ignore": "false",
        "is_row_identifier": "false",
        "is_target": "false",
        "name": "AMW",
        "number_of_missing_values": "0"
      },
      {
        "data_type": "numeric",
        "index": "26",
        "is_ignore": "false",
        "is_row_identifier": "false",
        "is_target": "false",
        "name": "C.",
        "number_of_missing_values": "0"
      },
      {
        "data_type": "numeric",
        "index": "27",
        "is_ignore": "false",
        "is_row_identifier": "false",
        "is_target": "true",
        "name": "pXC50",
        "number_of_missing_values": "0"
      }
    ]
  }
}