{
  "data_features": {
    "feature": [
      {
        "data_type": "nominal",
        "index": "0",
        "is_ignore": "false",
        "is_row_identifier": "true",
        "is_target": "false",
        "name": "molecule_id",
        "nominal_value": [
          "CHEMBL1909655",
          "CHEMBL1910988",
          "CHEMBL1910989",
          "CHEMBL1910990",
          "CHEMBL1910991",
          "CHEMBL1910992",
          "CHEMBL1910993",
          "CHEMBL1910994",
          "CHEMBL1910995",
          "CHEMBL1910996",
          "CHEMBL1910997",
          "CHEMBL1910998",
          "CHEMBL1910999",
          "CHEMBL1911000",
          "CHEMBL1911001",
          "CHEMBL1911002",
          "CHEMBL1911003",
          "CHEMBL1911004",
          "CHEMBL1911005",
          "CHEMBL1911006",
          "CHEMBL1911007",
          "CHEMBL1911008",
          "CHEMBL1911009",
          "CHEMBL1911010",
          "CHEMBL1911011",
          "CHEMBL1911012",
          "CHEMBL1911013",
          "CHEMBL1911014",
          "CHEMBL1911015",
          "CHEMBL1911114",
          "CHEMBL1911115",
          "CHEMBL1911116",
          "CHEMBL1911117",
          "CHEMBL1911118",
          "CHEMBL1911119",
          "CHEMBL1911120",
          "CHEMBL1911121",
          "CHEMBL1911122",
          "CHEMBL1911123",
          "CHEMBL1911124",
          "CHEMBL1911125",
          "CHEMBL1938415",
          "CHEMBL1940244",
          "CHEMBL1940245",
          "CHEMBL1940246",
          "CHEMBL1940247",
          "CHEMBL1940248",
          "CHEMBL1940249",
          "CHEMBL1940250",
          "CHEMBL1940251",
          "CHEMBL1940252",
          "CHEMBL1940253",
          "CHEMBL2018263",
          "CHEMBL2018265",
          "CHEMBL2018266",
          "CHEMBL2018271",
          "CHEMBL2018409",
          "CHEMBL2018413",
          "CHEMBL2057725",
          "CHEMBL2057726",
          "CHEMBL2057727",
          "CHEMBL2057728",
          "CHEMBL2057729",
          "CHEMBL2057730",
          "CHEMBL2057731",
          "CHEMBL2057732",
          "CHEMBL2057733",
          "CHEMBL2057734",
          "CHEMBL2057735",
          "CHEMBL2057736",
          "CHEMBL2331657",
          "CHEMBL2331658",
          "CHEMBL2331659",
          "CHEMBL2331660",
          "CHEMBL2331661",
          "CHEMBL2331662",
          "CHEMBL2331663",
          "CHEMBL2331664",
          "CHEMBL2331665",
          "CHEMBL2331666",
          "CHEMBL2331667",
          "CHEMBL2331668",
          "CHEMBL2331669",
          "CHEMBL437770",
          "CHEMBL565432",
          "CHEMBL566046",
          "CHEMBL567914",
          "CHEMBL568574",
          "CHEMBL577499",
          "CHEMBL579219",
          "CHEMBL586702",
          "CHEMBL98350"
        ],
        "number_of_missing_values": "0"
      },
      {
        "data_type": "numeric",
        "index": "1",
        "is_ignore": "false",
        "is_row_identifier": "false",
        "is_target": "false",
        "name": "Mp",
        "number_of_missing_values": "0"
      },
      {
        "data_type": "numeric",
        "index": "2",
        "is_ignore": "false",
        "is_row_identifier": "false",
        "is_target": "false",
        "name": "Mv",
        "number_of_missing_values": "0"
      },
      {
        "data_type": "numeric",
        "index": "3",
        "is_ignore": "false",
        "is_row_identifier": "false",
        "is_target": "false",
        "name": "nCsp3",
        "number_of_missing_values": "0"
      },
      {
        "data_type": "numeric",
        "index": "4",
        "is_ignore": "false",
        "is_row_identifier": "false",
        "is_target": "false",
        "name": "N.",
        "number_of_missing_values": "0"
      },
      {
        "data_type": "numeric",
        "index": "5",
        "is_ignore": "false",
        "is_row_identifier": "false",
        "is_target": "false",
        "name": "nN",
        "number_of_missing_values": "0"
      },
      {
        "data_type": "numeric",
        "index": "6",
        "is_ignore": "false",
        "is_row_identifier": "false",
        "is_target": "false",
        "name": "Mi",
        "number_of_missing_values": "0"
      },
      {
        "data_type": "numeric",
        "index": "7",
        "is_ignore": "false",
        "is_row_identifier": "false",
        "is_target": "true",
        "name": "pXC50",
        "number_of_missing_values": "0"
      }
    ]
  }
}