"molecule_id","nCsp3","nH","pXC50"
{1 6,2 13,3 4.046}
{0 CHEMBL1160160,1 1,2 4,3 4.097}
{0 CHEMBL152232,1 9,2 19,3 4.367}
{0 CHEMBL165192,1 14,2 27,3 5.076}
{0 CHEMBL1911831,1 19,2 48,3 6.155}
{0 CHEMBL1922581,1 13,2 29,3 6.523}
{0 CHEMBL205982,1 14,2 37,3 6.523}
{0 CHEMBL2114148,1 7,2 17,3 4.921}
{0 CHEMBL2114149,1 9,2 22,3 4.537}
{0 CHEMBL34712,2 9,3 4.046}
{0 CHEMBL358442,1 5,2 11,3 4.398}
{0 CHEMBL429694,2 24,3 4}
{0 CHEMBL461161,1 14,2 37,3 6.155}
{0 CHEMBL48760,1 3,2 17,3 4.26}
{0 CHEMBL49869,2 7,3 4.824}
{0 CHEMBL505422,1 19,2 48,3 5.108}
{0 CHEMBL83278,1 6,2 13,3 4.602}
{0 CHEMBL93319,1 8,2 13,3 4.143}
