{
  "data_features": {
    "feature": [
      {
        "data_type": "nominal",
        "index": "0",
        "is_ignore": "false",
        "is_row_identifier": "true",
        "is_target": "false",
        "name": "molecule_id",
        "nominal_value": [
          "CHEMBL1221517",
          "CHEMBL1299837",
          "CHEMBL1301906",
          "CHEMBL1303367",
          "CHEMBL1303417",
          "CHEMBL1305221",
          "CHEMBL1305391",
          "CHEMBL1307528",
          "CHEMBL1312594",
          "CHEMBL1313070",
          "CHEMBL1320239",
          "CHEMBL1322274",
          "CHEMBL1323907",
          "CHEMBL1323944",
          "CHEMBL1324399",
          "CHEMBL1325233",
          "CHEMBL1328182",
          "CHEMBL1328241",
          "CHEMBL1329230",
          "CHEMBL1329271",
          "CHEMBL1329285",
          "CHEMBL1329589",
          "CHEMBL1330042",
          "CHEMBL1330946",
          "CHEMBL1331729",
          "CHEMBL1332168",
          "CHEMBL1334037",
          "CHEMBL1334633",
          "CHEMBL1334684",
          "CHEMBL1335534",
          "CHEMBL1336564",
          "CHEMBL1337575",
          "CHEMBL1338518",
          "CHEMBL1342063",
          "CHEMBL1342384",
          "CHEMBL1342851",
          "CHEMBL1344535",
          "CHEMBL1345363",
          "CHEMBL1346172",
          "CHEMBL1347312",
          "CHEMBL1349382",
          "CHEMBL1350226",
          "CHEMBL1352351",
          "CHEMBL1353146",
          "CHEMBL1353227",
          "CHEMBL1353907",
          "CHEMBL1360564",
          "CHEMBL1360879",
          "CHEMBL1361703",
          "CHEMBL1363824",
          "CHEMBL1365170",
          "CHEMBL1365434",
          "CHEMBL1367408",
          "CHEMBL1368385",
          "CHEMBL1370919",
          "CHEMBL1372161",
          "CHEMBL1372855",
          "CHEMBL1373377",
          "CHEMBL1374241",
          "CHEMBL1374488",
          "CHEMBL1375161",
          "CHEMBL1375487",
          "CHEMBL1375737",
          "CHEMBL1377070",
          "CHEMBL1377510",
          "CHEMBL1377708",
          "CHEMBL1379707",
          "CHEMBL1380619",
          "CHEMBL1381306",
          "CHEMBL1381627",
          "CHEMBL1382866",
          "CHEMBL1384044",
          "CHEMBL1386015",
          "CHEMBL1386397",
          "CHEMBL1386870",
          "CHEMBL1387843",
          "CHEMBL1389035",
          "CHEMBL1389163",
          "CHEMBL1389629",
          "CHEMBL1389986",
          "CHEMBL1390251",
          "CHEMBL1390708",
          "CHEMBL1390767",
          "CHEMBL1390795",
          "CHEMBL1391256",
          "CHEMBL1391342",
          "CHEMBL1392159",
          "CHEMBL1392628",
          "CHEMBL1392756",
          "CHEMBL1406033",
          "CHEMBL1407977",
          "CHEMBL1408073",
          "CHEMBL1408395",
          "CHEMBL1409120",
          "CHEMBL1411127",
          "CHEMBL1412087",
          "CHEMBL1412123",
          "CHEMBL1412226",
          "CHEMBL1412556",
          "CHEMBL1413020",
          "CHEMBL1413101",
          "CHEMBL1416591",
          "CHEMBL1416882",
          "CHEMBL1417890",
          "CHEMBL1419252",
          "CHEMBL1421862",
          "CHEMBL1421864",
          "CHEMBL1424125",
          "CHEMBL1426027",
          "CHEMBL1426947",
          "CHEMBL1428111",
          "CHEMBL1429363",
          "CHEMBL1430364",
          "CHEMBL1431490",
          "CHEMBL1431591",
          "CHEMBL1432715",
          "CHEMBL1432963",
          "CHEMBL1433062",
          "CHEMBL1438490",
          "CHEMBL1439324",
          "CHEMBL1440196",
          "CHEMBL1441145",
          "CHEMBL1441215",
          "CHEMBL1442697",
          "CHEMBL1443537",
          "CHEMBL1444769",
          "CHEMBL1446626",
          "CHEMBL1447034",
          "CHEMBL1447046",
          "CHEMBL1447311",
          "CHEMBL1448416",
          "CHEMBL1448466",
          "CHEMBL1448598",
          "CHEMBL1448854",
          "CHEMBL1448942",
          "CHEMBL1449293",
          "CHEMBL1449334",
          "CHEMBL1449836",
          "CHEMBL1449982",
          "CHEMBL1450165",
          "CHEMBL1450203",
          "CHEMBL1452430",
          "CHEMBL1452830",
          "CHEMBL1455030",
          "CHEMBL1457220",
          "CHEMBL1459296",
          "CHEMBL1459463",
          "CHEMBL1459742",
          "CHEMBL1461069",
          "CHEMBL1461254",
          "CHEMBL1461683",
          "CHEMBL1462120",
          "CHEMBL1464539",
          "CHEMBL1465739",
          "CHEMBL1466602",
          "CHEMBL1467271",
          "CHEMBL1468488",
          "CHEMBL1469246",
          "CHEMBL1469796",
          "CHEMBL1469900",
          "CHEMBL1470855",
          "CHEMBL1471055",
          "CHEMBL1471875",
          "CHEMBL1479248",
          "CHEMBL1484570",
          "CHEMBL1484800",
          "CHEMBL1485842",
          "CHEMBL1486827",
          "CHEMBL1489356",
          "CHEMBL1489361",
          "CHEMBL1489636",
          "CHEMBL1489669",
          "CHEMBL1494360",
          "CHEMBL1494552",
          "CHEMBL1495378",
          "CHEMBL1496796",
          "CHEMBL1496995",
          "CHEMBL1500099",
          "CHEMBL1500600",
          "CHEMBL1500691",
          "CHEMBL1501342",
          "CHEMBL1504516",
          "CHEMBL1504655",
          "CHEMBL1506123",
          "CHEMBL1508765",
          "CHEMBL1509057",
          "CHEMBL1509453",
          "CHEMBL1510817",
          "CHEMBL1510830",
          "CHEMBL1510877",
          "CHEMBL1511666",
          "CHEMBL1511693",
          "CHEMBL1518374",
          "CHEMBL1518838",
          "CHEMBL1521410",
          "CHEMBL1522034",
          "CHEMBL1524625",
          "CHEMBL1524927",
          "CHEMBL1525853",
          "CHEMBL1526624",
          "CHEMBL1527023",
          "CHEMBL1528906",
          "CHEMBL1530368",
          "CHEMBL1530925",
          "CHEMBL1531421",
          "CHEMBL1531628",
          "CHEMBL1535180",
          "CHEMBL1539235",
          "CHEMBL1539325",
          "CHEMBL1541229",
          "CHEMBL1541779",
          "CHEMBL1545787",
          "CHEMBL1546374",
          "CHEMBL1546750",
          "CHEMBL1546921",
          "CHEMBL1547238",
          "CHEMBL1548516",
          "CHEMBL1549333",
          "CHEMBL1549371",
          "CHEMBL1550490",
          "CHEMBL1555833",
          "CHEMBL1556434",
          "CHEMBL1558019",
          "CHEMBL1559172",
          "CHEMBL1559311",
          "CHEMBL1559677",
          "CHEMBL1560288",
          "CHEMBL1561871",
          "CHEMBL1564105",
          "CHEMBL1564253",
          "CHEMBL1564651",
          "CHEMBL1565196",
          "CHEMBL1565941",
          "CHEMBL1566165",
          "CHEMBL1566266",
          "CHEMBL1567613",
          "CHEMBL1570005",
          "CHEMBL1575787",
          "CHEMBL1576895",
          "CHEMBL1577661",
          "CHEMBL1577870",
          "CHEMBL1578543",
          "CHEMBL1578546",
          "CHEMBL1579787",
          "CHEMBL1579795",
          "CHEMBL1580036",
          "CHEMBL1581192",
          "CHEMBL1582761",
          "CHEMBL1585785",
          "CHEMBL1586461",
          "CHEMBL1587620",
          "CHEMBL1588288",
          "CHEMBL1589313",
          "CHEMBL1597519",
          "CHEMBL1599789",
          "CHEMBL1612543",
          "CHEMBL1613004",
          "CHEMBL1704267",
          "CHEMBL192519",
          "CHEMBL1970117",
          "CHEMBL1971613",
          "CHEMBL1976046",
          "CHEMBL1979849",
          "CHEMBL1981243",
          "CHEMBL1981657",
          "CHEMBL198666",
          "CHEMBL1990622",
          "CHEMBL1991885",
          "CHEMBL1995948",
          "CHEMBL213432",
          "CHEMBL213849",
          "CHEMBL240331",
          "CHEMBL259355",
          "CHEMBL358546",
          "CHEMBL387115",
          "CHEMBL408994",
          "CHEMBL479979",
          "CHEMBL547833",
          "CHEMBL579212",
          "CHEMBL585473",
          "CHEMBL606116"
        ],
        "number_of_missing_values": "0"
      },
      {
        "data_type": "numeric",
        "index": "1",
        "is_ignore": "false",
        "is_row_identifier": "false",
        "is_target": "false",
        "name": "AMW",
        "number_of_missing_values": "0"
      },
      {
        "data_type": "numeric",
        "index": "2",
        "is_ignore": "false",
        "is_row_identifier": "false",
        "is_target": "false",
        "name": "C.",
        "number_of_missing_values": "0"
      },
      {
        "data_type": "numeric",
        "index": "3",
        "is_ignore": "false",
        "is_row_identifier": "false",
        "is_target": "false",
        "name": "H.",
        "number_of_missing_values": "0"
      },
      {
        "data_type": "numeric",
        "index": "4",
        "is_ignore": "false",
        "is_row_identifier": "false",
        "is_target": "false",
        "name": "Me",
        "number_of_missing_values": "0"
      },
      {
        "data_type": "numeric",
        "index": "5",
        "is_ignore": "false",
        "is_row_identifier": "false",
        "is_target": "false",
        "name": "Mi",
        "number_of_missing_values": "0"
      },
      {
        "data_type": "numeric",
        "index": "6",
        "is_ignore": "false",
        "is_row_identifier": "false",
        "is_target": "false",
        "name": "Mp",
        "number_of_missing_values": "0"
      },
      {
        "data_type": "numeric",
        "index": "7",
        "is_ignore": "false",
        "is_row_identifier": "false",
        "is_target": "false",
        "name": "Mv",
        "number_of_missing_values": "0"
      },
      {
        "data_type": "numeric",
        "index": "8",
        "is_ignore": "false",
        "is_row_identifier": "false",
        "is_target": "false",
        "name": "MW",
        "number_of_missing_values": "0"
      },
      {
        "data_type": "numeric",
        "index": "9",
        "is_ignore": "false",
        "is_row_identifier": "false",
        "is_target": "false",
        "name": "N.",
        "number_of_missing_values": "0"
      },
      {
        "data_type": "numeric",
        "index": "10",
        "is_ignore": "false",
        "is_row_identifier": "false",
        "is_target": "false",
        "name": "nAB",
        "number_of_missing_values": "0"
      },
      {
        "data_type": "numeric",
        "index": "11",
        "is_ignore": "false",
        "is_row_identifier": "false",
        "is_target": "false",
        "name": "nAT",
        "number_of_missing_values": "0"
      },
      {
        "data_type": "numeric",
        "index": "12",
        "is_ignore": "false",
        "is_row_identifier": "false",
        "is_target": "false",
        "name": "nB",
        "number_of_missing_values": "0"
      },
      {
        "data_type": "numeric",
        "index": "13",
        "is_ignore": "false",
        "is_row_identifier": "false",
        "is_target": "false",
        "name": "nBM",
        "number_of_missing_values": "0"
      },
      {
        "data_type": "numeric",
        "index": "14",
        "is_ignore": "false",
        "is_row_identifier": "false",
        "is_target": "false",
        "name": "nBO",
        "number_of_missing_values": "0"
      },
      {
        "data_type": "numeric",
        "index": "15",
        "is_ignore": "false",
        "is_row_identifier": "false",
        "is_target": "false",
        "name": "nBR",
        "number_of_missing_values": "0"
      },
      {
        "data_type": "numeric",
        "index": "16",
        "is_ignore": "false",
        "is_row_identifier": "false",
        "is_target": "false",
        "name": "nBT",
        "number_of_missing_values": "0"
      },
      {
        "data_type": "numeric",
        "index": "17",
        "is_ignore": "false",
        "is_row_identifier": "false",
        "is_target": "false",
        "name": "nC",
        "number_of_missing_values": "0"
      },
      {
        "data_type": "numeric",
        "index": "18",
        "is_ignore": "false",
        "is_row_identifier": "false",
        "is_target": "false",
        "name": "nCL",
        "number_of_missing_values": "0"
      },
      {
        "data_type": "numeric",
        "index": "19",
        "is_ignore": "false",
        "is_row_identifier": "false",
        "is_target": "false",
        "name": "nCsp",
        "number_of_missing_values": "0"
      },
      {
        "data_type": "numeric",
        "index": "20",
        "is_ignore": "false",
        "is_row_identifier": "false",
        "is_target": "false",
        "name": "nCsp2",
        "number_of_missing_values": "0"
      },
      {
        "data_type": "numeric",
        "index": "21",
        "is_ignore": "false",
        "is_row_identifier": "false",
        "is_target": "false",
        "name": "nCsp3",
        "number_of_missing_values": "0"
      },
      {
        "data_type": "numeric",
        "index": "22",
        "is_ignore": "false",
        "is_row_identifier": "false",
        "is_target": "false",
        "name": "nDB",
        "number_of_missing_values": "0"
      },
      {
        "data_type": "numeric",
        "index": "23",
        "is_ignore": "false",
        "is_row_identifier": "false",
        "is_target": "false",
        "name": "nF",
        "number_of_missing_values": "0"
      },
      {
        "data_type": "numeric",
        "index": "24",
        "is_ignore": "false",
        "is_row_identifier": "false",
        "is_target": "false",
        "name": "nH",
        "number_of_missing_values": "0"
      },
      {
        "data_type": "numeric",
        "index": "25",
        "is_ignore": "false",
        "is_row_identifier": "false",
        "is_target": "false",
        "name": "nHet",
        "number_of_missing_values": "0"
      },
      {
        "data_type": "numeric",
        "index": "26",
        "is_ignore": "false",
        "is_row_identifier": "false",
        "is_target": "false",
        "name": "nHM",
        "number_of_missing_values": "0"
      },
      {
        "data_type": "numeric",
        "index": "27",
        "is_ignore": "false",
        "is_row_identifier": "false",
        "is_target": "false",
        "name": "nI",
        "number_of_missing_values": "0"
      },
      {
        "data_type": "numeric",
        "index": "28",
        "is_ignore": "false",
        "is_row_identifier": "false",
        "is_target": "false",
        "name": "nN",
        "number_of_missing_values": "0"
      },
      {
        "data_type": "numeric",
        "index": "29",
        "is_ignore": "false",
        "is_row_identifier": "false",
        "is_target": "false",
        "name": "nO",
        "number_of_missing_values": "0"
      },
      {
        "data_type": "numeric",
        "index": "30",
        "is_ignore": "false",
        "is_row_identifier": "false",
        "is_target": "false",
        "name": "nP",
        "number_of_missing_values": "0"
      },
      {
        "data_type": "numeric",
        "index": "31",
        "is_ignore": "false",
        "is_row_identifier": "false",
        "is_target": "false",
        "name": "nS",
        "number_of_missing_values": "0"
      },
      {
        "data_type": "numeric",
        "index": "32",
        "is_ignore": "false",
        "is_row_identifier": "false",
        "is_target": "false",
        "name": "nSK",
        "number_of_missing_values": "0"
      },
      {
        "data_type": "numeric",
        "index": "33",
        "is_ignore": "false",
        "is_row_identifier": "false",
        "is_target": "false",
        "name": "nTB",
        "number_of_missing_values": "0"
      },
      {
        "data_type": "numeric",
        "index": "34",
        "is_ignore": "false",
        "is_row_identifier": "false",
        "is_target": "false",
        "name": "nX",
        "number_of_missing_values": "0"
      },
      {
        "data_type": "numeric",
        "index": "35",
        "is_ignore": "false",
        "is_row_identifier": "false",
        "is_target": "false",
        "name": "O.",
        "number_of_missing_values": "0"
      },
      {
        "data_type": "numeric",
        "index": "36",
        "is_ignore": "false",
        "is_row_identifier": "false",
        "is_target": "false",
        "name": "RBF",
        "number_of_missing_values": "0"
      },
      {
        "data_type": "numeric",
        "index": "37",
        "is_ignore": "false",
        "is_row_identifier": "false",
        "is_target": "false",
        "name": "RBN",
        "number_of_missing_values": "0"
      },
      {
        "data_type": "numeric",
        "index": "38",
        "is_ignore": "false",
        "is_row_identifier": "false",
        "is_target": "false",
        "name": "SCBO",
        "number_of_missing_values": "0"
      },
      {
        "data_type": "numeric",
        "index": "39",
        "is_ignore": "false",
        "is_row_identifier": "false",
        "is_target": "false",
        "name": "Se",
        "number_of_missing_values": "0"
      },
      {
        "data_type": "numeric",
        "index": "40",
        "is_ignore": "false",
        "is_row_identifier": "false",
        "is_target": "false",
        "name": "Si",
        "number_of_missing_values": "0"
      },
      {
        "data_type": "numeric",
        "index": "41",
        "is_ignore": "false",
        "is_row_identifier": "false",
        "is_target": "false",
        "name": "Sp",
        "number_of_missing_values": "0"
      },
      {
        "data_type": "numeric",
        "index": "42",
        "is_ignore": "false",
        "is_row_identifier": "false",
        "is_target": "false",
        "name": "Sv",
        "number_of_missing_values": "0"
      },
      {
        "data_type": "numeric",
        "index": "43",
        "is_ignore": "false",
        "is_row_identifier": "false",
        "is_target": "false",
        "name": "X.",
        "number_of_missing_values": "0"
      },
      {
        "data_type": "numeric",
        "index": "44",
        "is_ignore": "false",
        "is_row_identifier": "false",
        "is_target": "true",
        "name": "pXC50",
        "number_of_missing_values": "0"
      }
    ]
  }
}