{
  "data_set_description": {
    "collection_date": "November 2013",
    "creator": "Dr Jeremy Besnard, Dr Ivan Olier, Dr Noureddin Sadawi, Dr Larisa Soldatova, Dr Crina Grosan, Prof Ross King, Dr Richard Bickerton, Prof Andrew Hopkins and Dr Willem van Hoorn",
    "default_target_attribute": "pXC50",
    "description": "This dataset contains QSAR data (from ChEMBL version 17) showing activity values (unit is pseudo-pCI50) of several compounds on drug target ChEMBL_ID: CHEMBL1949 (TID: 180), and it has 130 rows and 1286 features (not including molecule IDs and class feature: molecule_id and pXC50). The features represent Molecular Descriptors which were generated from SMILES strings. Missing value imputation was applied to this dataset (By choosing the Median).",
    "description_version": "1",
    "file_id": "3237391",
    "format": "ARFF",
    "id": "24004",
    "licence": "Public",
    "md5_checksum": "52745cc1d1740f015760f2fa7ecb868c",
    "minio_url": "https://data.openml.org/datasets/0002/24004/dataset_24004.pq",
    "name": "QSAR-DATASET-FOR-DRUG-TARGET-CHEMBL1949",
    "original_data_url": "https://www.ebi.ac.uk/chembl/target/inspect/CHEMBL1949",
    "parquet_url": "https://data.openml.org/datasets/0002/24004/dataset_24004.pq",
    "processing_date": "2018-10-03 22:48:06",
    "row_id_attribute": "molecule_id",
    "status": "deactivated",
    "tag": [
      "MetaQSAR",
      "study_13"
    ],
    "upload_date": "2016-07-14T13:41:59",
    "url": "https://api.openml.org/data/v1/download/3237391/QSAR-DATASET-FOR-DRUG-TARGET-CHEMBL1949.arff",
    "version": "7",
    "visibility": "public"
  }
}