"molecule_id","SCBO","nCsp2","MW","nBM","pXC50"
{1 48.5,2 21,3 463.56,4 23,5 6.821}
{0 CHEMBL1223618,1 44.5,2 21,3 364.47,4 24,5 5.704}
{0 CHEMBL1223619,1 49.5,2 21,3 448.47,4 24,5 4.548}
{0 CHEMBL1223620,1 45.5,2 21,3 382.46,4 24,5 5.908}
{0 CHEMBL1223621,1 47.5,2 21,3 408.53,4 24,5 5.953}
{0 CHEMBL1223684,1 45.5,2 21,3 378.5,4 24,5 5.873}
{0 CHEMBL1223685,1 48.5,2 21,3 430.48,4 24,5 6.987}
{0 CHEMBL1223686,1 48.5,2 21,3 455.51,4 25,5 7.441}
{0 CHEMBL1223687,1 47.5,2 22,3 435.45,4 24,5 7.492}
{0 CHEMBL1224653,1 37.5,2 15,3 355.49,4 19,5 7.158}
{0 CHEMBL1224717,1 46.5,2 22,3 413.5,4 24,5 7.506}
{0 CHEMBL1224718,1 41.5,2 21,3 375.87,4 23,5 6.329}
{0 CHEMBL1224719,1 41.5,2 21,3 375.87,4 23,5 6.991}
{0 CHEMBL1224720,1 44.5,2 21,3 409.43,4 23,5 6.662}
{0 CHEMBL1224721,1 46.5,2 21,3 394.5,4 24,5 6.383}
{0 CHEMBL158286,1 40.5,2 14,3 379.34,4 20,5 5.194}
{0 CHEMBL161115,1 41.5,2 21,3 360.81,4 24,5 6.721}
{0 CHEMBL161465,1 41.5,2 20,3 327.36,4 25,5 5.699}
{0 CHEMBL161602,1 42.5,2 15,3 377.44,4 20,5 5}
{0 CHEMBL161714,1 37.5,2 14,3 388.77,4 19,5 5.367}
{0 CHEMBL161740,1 44.5,2 21,3 351.38,4 25,5 6.244}
{0 CHEMBL162188,1 40,2 18,3 317.32,4 24,5 5}
{0 CHEMBL18701,1 25,2 7,3 278.39,4 7,5 5.4}
{0 CHEMBL1916475,1 44,2 11,3 454.59,4 14,5 5.699}
{0 CHEMBL19449,1 24,2 8,3 230.34,4 11,5 6.622}
{0 CHEMBL196969,1 57,2 26,3 510.72,4 31,5 9.155}
{0 CHEMBL197386,1 52.5,2 24,3 471.61,4 27,5 8.42}
{0 CHEMBL197392,1 59.5,2 28,3 518.72,4 32,5 9.398}
{0 CHEMBL197494,1 52,2 24,3 432.56,4 29,5 8.244}
{0 CHEMBL198432,1 39.5,2 20,3 326.42,4 23,5 8.481}
{0 CHEMBL198464,1 54.5,2 26,3 479.05,4 30,5 7.167}
{0 CHEMBL198527,1 61.5,2 24,3 590.82,4 29,5 7.854}
{0 CHEMBL198564,1 45.5,2 20,3 410.6,4 23,5 6.975}
{0 CHEMBL198674,1 62.5,2 29,3 561.79,4 32,5 9.301}
{0 CHEMBL198722,1 66,2 26,3 632.88,4 33,5 7.959}
{0 CHEMBL198732,1 64,2 25,3 587.77,4 33,5 7.854}
{0 CHEMBL198853,1 59.5,2 24,3 537.73,4 28,5 7.943}
{0 CHEMBL199015,1 50.5,2 14,3 570.5,4 18,5 9}
{0 CHEMBL200906,1 34.5,2 12,3 314.35,4 17,5 4.796}
{0 CHEMBL204449,1 35.5,2 16,3 342.42,4 18,5 5.861}
{0 CHEMBL204522,1 58.5,2 22,3 564.78,4 28,5 7.387}
{0 CHEMBL206592,1 67.5,2 27,3 627.84,4 34,5 7.854}
{0 CHEMBL206968,1 64,2 25,3 564.71,4 32,5 9.046}
{0 CHEMBL207424,1 61.5,2 22,3 628.27,4 28,5 7.155}
{0 CHEMBL207559,1 61.5,2 22,3 607.86,4 28,5 7.602}
{0 CHEMBL207775,1 49.5,2 22,3 444.59,4 26,5 7.013}
{0 CHEMBL207996,1 51.5,2 21,3 514.46,4 26,5 8.26}
{0 CHEMBL208100,1 61.5,2 22,3 611.82,4 28,5 8.194}
{0 CHEMBL208149,1 55.5,2 22,3 522.69,4 28,5 7.585}
{0 CHEMBL208236,1 55.5,2 22,3 522.69,4 28,5 7.975}
{0 CHEMBL208382,1 68.5,2 28,3 644.84,4 34,5 7.607}
{0 CHEMBL209295,1 58.5,2 22,3 541.72,4 27,5 8.377}
{0 CHEMBL210840,1 39.5,2 16,3 368.49,4 20,5 6.31}
{0 CHEMBL2171452,1 54.5,2 15,3 546.74,4 19,5 8}
{0 CHEMBL2172707,1 17.5,2 8,3 164.6,4 11,5 5.433}
{0 CHEMBL2172710,1 32,2 14,3 314.37,4 14,5 6.686}
{0 CHEMBL2172734,1 33,2 14,3 328.4,4 14,5 6.297}
{0 CHEMBL217899,1 35.5,2 9,3 339.51,4 15,5 7}
{0 CHEMBL2179105,1 40.5,2 9,3 395.52,4 13,5 5}
{0 CHEMBL218103,1 31,2 5,3 313.5,4 10,5 7.398}
{0 CHEMBL218653,1 38,2 11,3 367.92,4 16,5 7.114}
{0 CHEMBL218793,1 39,2 11,3 363.51,4 16,5 5.613}
{0 CHEMBL218990,1 37,2 10,3 334.47,4 16,5 6.155}
{0 CHEMBL226630,1 28.5,2 4,3 324.43,4 7,5 5.62}
{0 CHEMBL252387,1 41.5,2 15,3 412.51,4 18,5 6.345}
{0 CHEMBL296435,1 26,2 5,3 277.42,4 10,5 4.796}
{0 CHEMBL307646,1 30,2 8,3 320.38,4 8,5 7.745}
{0 CHEMBL32442,1 40,2 17,3 373.53,4 18,5 8.347}
{0 CHEMBL345360,1 42.5,2 20,3 341.39,4 25,5 5}
{0 CHEMBL345812,1 32.5,2 14,3 266.28,4 19,5 5}
{0 CHEMBL351500,1 35.5,2 16,3 291.33,4 20,5 6.051}
{0 CHEMBL351613,1 41.5,2 19,3 328.35,4 25,5 6.215}
{0 CHEMBL351900,1 41.5,2 14,3 399.33,4 21,5 5.495}
{0 CHEMBL351915,1 31.5,2 14,3 251.26,4 19,5 5}
{0 CHEMBL370220,1 53.5,2 26,3 451.58,4 31,5 7.924}
{0 CHEMBL371037,1 59.5,2 24,3 537.73,4 28,5 8.167}
{0 CHEMBL371089,1 55.5,2 24,3 512.72,4 27,5 8.538}
{0 CHEMBL372575,1 64,2 25,3 587.77,4 33,5 8.041}
{0 CHEMBL377709,1 60.5,2 22,3 593.83,4 28,5 8.77}
{0 CHEMBL378681,1 63.5,2 27,3 563.74,4 32,5 8.022}
{0 CHEMBL379768,1 61.5,2 22,3 590.82,4 28,5 7.77}
{0 CHEMBL380321,1 65.5,2 28,3 574.75,4 33,5 10.301}
{0 CHEMBL380933,1 71.5,2 28,3 684.94,4 34,5 8.229}
{0 CHEMBL381681,1 58,2 25,3 509.67,4 31,5 8.921}
{0 CHEMBL382168,1 58.5,2 22,3 540.74,4 27,5 8.77}
{0 CHEMBL382545,1 52.5,2 26,3 463.05,4 29,5 7.658}
{0 CHEMBL383225,1 64.5,2 28,3 559.73,4 33,5 9}
{0 CHEMBL383762,1 50.5,2 14,3 570.5,4 18,5 6.87}
{0 CHEMBL383837,1 49.5,2 21,3 445.58,4 26,5 7.77}
{0 CHEMBL42126,1 34,2 12,3 381.28,4 13,5 7.854}
{0 CHEMBL430893,1 26,2 7,3 275.38,4 7,5 5.433}
{0 CHEMBL466068,1 40,2 11,3 397.53,4 16,5 5}
{0 CHEMBL466280,1 46,2 10,3 479.52,4 17,5 6}
{0 CHEMBL466481,1 38,2 9,3 367.51,4 16,5 5}
{0 CHEMBL511115,1 33,2 7,3 343.46,4 8,5 6.09}
{0 CHEMBL549560,1 48,2 17,3 448.52,4 22,5 6.975}
{0 CHEMBL551052,1 45,2 12,3 468.62,4 14,5 5.699}
{0 CHEMBL564209,1 46.5,2 15,3 468.58,4 18,5 7.337}
{0 CHEMBL567470,1 44,2 12,3 453.6,4 14,5 5.699}
{0 CHEMBL583914,1 47,2 13,3 429.58,4 18,5 6}
{0 CHEMBL591501,1 45,2 12,3 468.62,4 14,5 5.699}
{0 CHEMBL63,1 26,2 7,3 275.38,4 7,5 5.45}
{0 CHEMBL74078,1 45.5,2 21,3 371.37,4 26,5 7.167}
{0 CHEMBL77826,1 46.5,2 21,3 368.37,4 28,5 5.91}
{0 CHEMBL90375,1 29,2 8,3 322.4,4 8,5 6.9}
{0 CHEMBL91551,1 31,2 8,3 334.41,4 8,5 7.021}
{0 CHEMBL91571,1 28,2 8,3 308.37,4 8,5 7.815}
