"molecule_id","AMW","C.","H.","Me","Mi","Mp","Mv","MW","N.","nAB","nAT","nB","nBM","nBO","nBR","nBT","nC","nCL","nCsp","nCsp2","nCsp3","nDB","nF","nH","nHet","nHM","nI","nN","nO","nP","nS","nSK","nTB","nX","O.","RBF","RBN","SCBO","Se","Si","Sp","Sv","X.","pXC50"
{1 9.561,2 34.7,3 34.7,4 1.057,5 1.147,6 0.661,7 0.671,8 468.47,9 12.2,10 16,11 49,13 19,14 35,16 52,17 17,20 12,21 5,22 3,23 1,24 17,25 15,26 1,28 6,29 7,31 1,32 32,34 1,35 14.3,36 0.115,37 6,38 46,39 51.793,40 56.207,41 32.369,42 32.863,43 2,44 7.42}
{0 CHEMBL1162031,1 9.896,2 34.7,3 34.7,4 1.053,5 1.139,6 0.679,7 0.68,8 484.92,9 12.2,10 16,11 49,13 19,14 35,16 52,17 17,18 1,20 12,21 5,22 3,24 17,25 15,26 2,28 6,29 7,31 1,32 32,34 1,35 14.3,36 0.115,37 6,38 46,39 51.604,40 55.811,41 33.29,42 33.307,43 2,44 4.742}
{0 CHEMBL1162032,1 10.018,2 34,3 34,4 1.059,5 1.14,6 0.675,7 0.68,8 500.92,9 12,10 16,11 50,13 19,14 36,16 53,17 17,18 1,20 12,21 5,22 3,24 17,25 16,26 2,28 6,29 8,31 1,32 33,34 1,35 16,36 0.113,37 6,38 47,39 52.931,40 57.02,41 33.744,42 34.022,43 2,44 7.215}
{0 CHEMBL1162033,1 10.018,2 34,3 34,4 1.059,5 1.14,6 0.675,7 0.68,8 500.92,9 12,10 16,11 50,13 19,14 36,16 53,17 17,18 1,20 12,21 5,22 3,24 17,25 16,26 2,28 6,29 8,31 1,32 33,34 1,35 16,36 0.113,37 6,38 47,39 52.931,40 57.02,41 33.744,42 34.022,43 2,44 7.921}
{0 CHEMBL1162034,1 10.018,2 34,3 34,4 1.059,5 1.14,6 0.675,7 0.68,8 500.92,9 12,10 16,11 50,13 19,14 36,16 53,17 17,18 1,20 12,21 5,22 3,24 17,25 16,26 2,28 6,29 8,31 1,32 33,34 1,35 16,36 0.113,37 6,38 47,39 52.931,40 57.02,41 33.744,42 34.022,43 2,44 7.699}
{0 CHEMBL1162035,1 9.689,2 34,3 34,4 1.062,5 1.148,6 0.656,7 0.672,8 484.47,9 12,10 16,11 50,13 19,14 36,16 53,17 17,20 12,21 5,22 3,23 1,24 17,25 16,26 1,28 6,29 8,31 1,32 33,34 1,35 16,36 0.113,37 6,38 47,39 53.12,40 57.416,41 32.824,42 33.578,43 2,44 7.921}
{0 CHEMBL1162036,1 10.907,2 34,3 34,4 1.057,5 1.138,6 0.685,7 0.684,8 545.37,9 12,10 16,11 50,13 19,14 36,15 1,16 53,17 17,20 12,21 5,22 3,24 17,25 16,26 2,28 6,29 8,31 1,32 33,34 1,35 16,36 0.113,37 6,38 47,39 52.836,40 56.918,41 34.239,42 34.22,43 2,44 7.678}
{0 CHEMBL1162037,1 9.066,2 34,3 37.7,4 1.047,5 1.141,6 0.654,7 0.655,8 480.51,9 11.3,10 16,11 53,13 19,14 36,16 56,17 18,20 12,21 6,22 3,24 20,25 15,26 1,28 6,29 8,31 1,32 33,35 15.1,36 0.107,37 6,38 47,39 55.491,40 60.491,41 34.648,42 34.721,44 7.854}
{0 CHEMBL1162038,1 10.085,2 34,3 32.1,4 1.076,5 1.161,6 0.65,7 0.677,8 534.48,9 11.3,10 16,11 53,13 19,14 39,16 56,17 18,20 12,21 6,22 3,23 3,24 17,25 18,26 1,28 6,29 8,31 1,32 36,34 3,35 15.1,36 0.107,37 6,38 50,39 57.029,40 61.511,41 34.46,42 35.871,43 5.7,44 5.359}
{0 CHEMBL1162039,1 9.26,2 32.7,3 36.5,4 1.052,5 1.146,6 0.652,7 0.658,8 481.5,9 13.5,10 16,11 52,13 19,14 36,16 55,17 17,20 12,21 5,22 3,24 19,25 16,26 1,28 7,29 8,31 1,32 33,35 15.4,36 0.109,37 6,38 47,39 54.709,40 59.575,41 33.892,42 34.216,44 7.398}
{0 CHEMBL1162040,1 9.689,2 34,3 34,4 1.062,5 1.148,6 0.656,7 0.672,8 484.47,9 12,10 16,11 50,13 19,14 36,16 53,17 17,20 12,21 5,22 3,23 1,24 17,25 16,26 1,28 6,29 8,31 1,32 33,34 1,35 16,36 0.113,37 6,38 47,39 53.12,40 57.416,41 32.824,42 33.578,43 2,44 8.137}
{0 CHEMBL1162041,1 9.46,2 33.3,3 35.3,4 1.058,5 1.143,6 0.654,7 0.665,8 482.48,9 11.8,10 16,11 51,13 19,14 36,16 54,17 17,20 12,21 5,22 3,24 18,25 16,26 1,28 6,29 9,31 1,32 33,35 17.6,36 0.111,37 6,38 47,39 53.935,40 58.286,41 33.341,42 33.91,44 6.863}
{0 CHEMBL1162042,1 9.46,2 33.3,3 35.3,4 1.058,5 1.143,6 0.654,7 0.665,8 482.48,9 11.8,10 16,11 51,13 19,14 36,16 54,17 17,20 12,21 5,22 3,24 18,25 16,26 1,28 6,29 9,31 1,32 33,35 17.6,36 0.111,37 6,38 47,39 53.935,40 58.286,41 33.341,42 33.91,44 4}
{0 CHEMBL1162043,1 9.54,2 32.7,3 34.7,4 1.058,5 1.146,6 0.656,7 0.667,8 467.47,9 14.3,10 10,11 49,13 16,14 35,16 52,17 16,20 11,21 5,22 6,24 17,25 16,26 1,28 7,29 8,31 1,32 32,35 16.3,36 0.115,37 6,38 46,39 51.825,40 56.159,41 32.131,42 32.689,44 5.432}
{0 CHEMBL1162044,1 9.78,2 33.3,3 33.3,4 1.063,5 1.152,6 0.659,7 0.674,8 469.46,9 14.6,10 16,11 48,13 19,14 35,16 51,17 16,20 11,21 5,22 3,23 1,24 16,25 16,26 1,28 7,29 7,31 1,32 32,34 1,35 14.6,36 0.118,37 6,38 46,39 51.011,40 55.29,41 31.614,42 32.358,43 2.1,44 5.538}
{0 CHEMBL1162045,1 10.123,2 33.3,3 33.3,4 1.059,5 1.144,6 0.678,7 0.683,8 485.91,9 14.6,10 16,11 48,13 19,14 35,16 51,17 16,18 1,20 11,21 5,22 3,24 16,25 16,26 2,28 7,29 7,31 1,32 32,34 1,35 14.6,36 0.118,37 6,38 46,39 50.822,40 54.894,41 32.534,42 32.802,43 2.1,44 6.757}
{0 CHEMBL1162046,1 8.837,2 28.8,3 40.4,4 1.05,5 1.154,6 0.628,7 0.63,8 459.5,9 13.5,10 10,11 52,13 13,14 34,16 55,17 15,20 6,21 9,22 3,24 21,25 16,26 1,28 7,29 8,31 1,32 31,35 15.4,36 0.091,37 5,38 42,39 54.593,40 59.99,41 32.653,42 32.743,44 4}
{0 CHEMBL1162047,1 8.51,2 30.8,3 42.3,4 1.039,5 1.148,6 0.634,7 0.626,8 442.51,9 11.5,10 10,11 52,13 13,14 33,16 55,17 16,20 6,21 10,22 3,24 22,25 14,26 1,28 6,29 7,31 1,32 30,35 13.5,36 0.109,37 6,38 41,39 54.047,40 59.697,41 32.955,42 32.534,44 4.303}
{0 CHEMBL1162048,1 8.301,2 30.9,3 43.6,4 1.035,5 1.147,6 0.631,7 0.619,8 456.54,9 10.9,10 10,11 55,13 13,14 34,16 58,17 17,20 6,21 11,22 3,24 24,25 14,26 1,28 6,29 7,31 1,32 31,35 12.7,36 0.103,37 6,38 42,39 56.931,40 63.112,41 34.716,42 34.06,44 4.762}
{0 CHEMBL1162049,1 9.248,2 28.6,3 38.1,4 1.057,5 1.154,6 0.635,7 0.642,8 388.41,9 14.3,10 10,11 42,13 13,14 28,16 44,17 12,20 6,21 6,22 3,24 16,25 14,26 1,28 6,29 7,31 1,32 26,35 16.7,36 0.114,37 5,38 36,39 44.396,40 48.452,41 26.67,42 26.953,44 4}
{0 CHEMBL1162050,1 9.405,2 27.9,3 37.2,4 1.063,5 1.155,6 0.631,7 0.643,8 404.41,9 14,10 10,11 43,13 13,14 29,16 45,17 12,20 6,21 6,22 3,24 16,25 15,26 1,28 6,29 8,31 1,32 27,35 18.6,36 0.133,37 6,38 37,39 45.724,40 49.661,41 27.125,42 27.668,44 5.602}
{0 CHEMBL1162051,1 8.933,2 34.6,3 38.5,4 1.042,5 1.14,6 0.658,7 0.654,8 464.51,9 11.5,10 16,11 52,13 19,14 35,16 55,17 18,20 12,21 6,22 3,24 20,25 14,26 1,28 6,29 7,31 1,32 32,35 13.5,36 0.127,37 7,38 46,39 54.164,40 59.282,41 34.193,42 34.007,44 4}
{0 CHEMBL1162052,1 11.048,2 33.3,3 25.5,4 1.095,5 1.174,6 0.66,7 0.706,8 563.46,9 17.6,10 16,11 51,13 21,14 41,16 54,17 17,20 12,21 5,22 5,23 4,24 13,25 21,26 1,28 9,29 7,31 1,32 38,34 4,35 13.7,36 0.13,37 7,38 54,39 55.869,40 59.89,41 33.676,42 36.024,43 7.8,44 4}
{0 CHEMBL1162053,1 8.659,2 33.3,3 40.4,4 1.038,5 1.144,6 0.648,7 0.641,8 493.56,9 12.3,10 16,11 57,13 19,14 37,16 60,17 19,20 12,21 7,22 3,24 23,25 15,26 1,28 7,29 7,31 1,32 34,35 12.3,36 0.133,37 8,38 48,39 59.149,40 65.196,41 36.96,42 36.555,44 4.438}
{0 CHEMBL1627105,1 8.838,2 41.4,3 37.1,4 1.031,5 1.125,6 0.685,7 0.676,8 618.68,9 8.6,10 28,11 70,13 31,14 49,16 75,17 29,20 24,21 5,22 3,24 26,25 15,26 1,28 6,29 8,31 1,32 44,35 11.4,36 0.107,37 8,38 66,39 72.142,40 78.737,41 47.932,42 47.302,44 8.854}
{0 CHEMBL218023,1 8.933,2 34.6,3 38.5,4 1.042,5 1.14,6 0.658,7 0.654,8 464.51,9 11.5,10 16,11 52,13 19,14 35,16 55,17 18,20 12,21 6,22 3,24 20,25 14,26 1,28 6,29 7,31 1,32 32,35 13.5,36 0.109,37 6,38 46,39 54.164,40 59.282,41 34.193,42 34.007,44 8.638}
{0 CHEMBL218683,1 9.127,2 33.3,3 37.3,4 1.047,5 1.144,6 0.656,7 0.657,8 465.5,9 13.7,10 16,11 51,13 19,14 35,16 54,17 17,20 12,21 5,22 3,24 19,25 15,26 1,28 7,29 7,31 1,32 32,35 13.7,36 0.111,37 6,38 46,39 53.382,40 58.365,41 33.438,42 33.501,44 8.432}
{0 CHEMBL220160,1 9.33,2 34,3 36,4 1.052,5 1.142,6 0.658,7 0.664,8 466.48,9 12,10 16,11 50,13 19,14 35,16 53,17 17,20 12,21 5,22 3,24 18,25 15,26 1,28 6,29 8,31 1,32 32,35 16,36 0.113,37 6,38 46,39 52.607,40 57.076,41 32.886,42 33.195,44 8.18}
{0 CHEMBL220161,1 9.283,2 34.1,3 36.4,4 1.047,5 1.142,6 0.664,7 0.665,8 408.44,9 13.6,10 16,11 44,13 19,14 30,16 46,17 15,20 12,21 3,22 3,24 16,25 13,26 1,28 6,29 6,31 1,32 28,35 13.6,36 0.174,37 8,38 41,39 46.069,40 50.242,41 29.216,42 29.238,44 4.777}
{0 CHEMBL238486,1 8.769,2 40,3 36,4 1.038,5 1.135,6 0.667,7 0.672,8 438.44,9 12,10 16,11 50,13 19,14 36,16 54,17 20,20 15,21 5,22 3,24 18,25 12,28 6,29 6,32 32,35 12,36 0.074,37 4,38 47,39 51.876,40 56.737,41 33.33,42 33.578,44 4}
{0 CHEMBL371502,1 9.33,2 34,3 36,4 1.052,5 1.142,6 0.658,7 0.664,8 466.48,9 12,10 16,11 50,13 19,14 35,16 53,17 17,20 12,21 5,22 3,24 18,25 15,26 1,28 6,29 8,31 1,32 32,35 16,36 0.113,37 6,38 46,39 52.607,40 57.076,41 32.886,42 33.195,44 7.971}
{0 CHEMBL384655,1 8.969,2 37.5,3 37.5,4 1.034,5 1.134,6 0.678,7 0.668,8 430.49,9 12.5,10 16,11 48,13 20,14 33,16 51,17 18,20 14,21 4,22 4,24 18,25 12,26 1,28 6,29 5,31 1,32 30,35 10.4,36 0.118,37 6,38 45,39 49.625,40 54.448,41 32.523,42 32.05,44 6.081}
{0 CHEMBL385125,1 8.65,2 36,3 40,4 1.03,5 1.137,6 0.666,7 0.652,8 432.51,9 12,10 16,11 50,13 19,14 33,16 53,17 18,20 12,21 6,22 3,24 20,25 12,26 1,28 6,29 5,31 1,32 30,35 10,36 0.113,37 6,38 44,39 51.509,40 56.863,41 33.284,42 32.577,44 7.215}
{0 CHEMBL387162,1 9.193,2 34.7,3 36.7,4 1.047,5 1.14,6 0.662,7 0.663,8 450.48,9 12.2,10 16,11 49,13 19,14 34,16 52,17 17,20 12,21 5,22 3,24 18,25 14,26 1,28 6,29 7,31 1,32 31,35 14.3,36 0.115,37 6,38 45,39 51.28,40 55.867,41 32.432,42 32.48,44 8.495}
{0 CHEMBL392739,1 8.589,2 36,3 38,4 1.04,5 1.145,6 0.647,7 0.652,8 429.44,9 14,10 16,11 50,13 18,14 34,16 53,17 18,20 13,21 5,22 2,24 19,25 13,28 7,29 6,32 31,35 12,36 0.075,37 4,38 44,39 51.978,40 57.236,41 32.335,42 32.599,44 5.903}
{0 CHEMBL437891,1 9.127,2 33.3,3 37.3,4 1.047,5 1.144,6 0.656,7 0.657,8 465.5,9 13.7,10 16,11 51,13 19,14 35,16 54,17 17,20 12,21 5,22 3,24 19,25 15,26 1,28 7,29 7,31 1,32 32,35 13.7,36 0.111,37 6,38 46,39 53.382,40 58.365,41 33.438,42 33.501,44 6.114}
{0 CHEMBL438072,1 9.193,2 34.7,3 36.7,4 1.047,5 1.14,6 0.662,7 0.663,8 450.48,9 12.2,10 16,11 49,13 19,14 34,16 52,17 17,20 12,21 5,22 3,24 18,25 14,26 1,28 6,29 7,31 1,32 31,35 14.3,36 0.115,37 6,38 45,39 51.28,40 55.867,41 32.432,42 32.48,44 7.036}
{0 CHEMBL447500,1 8.838,2 41.4,3 37.1,4 1.031,5 1.125,6 0.685,7 0.676,8 618.68,9 8.6,10 28,11 70,13 31,14 49,16 75,17 29,20 24,21 5,22 3,24 26,25 15,26 1,28 6,29 8,31 1,32 44,35 11.4,36 0.107,37 8,38 66,39 72.142,40 78.737,41 47.932,42 47.302,44 7.328}
{0 CHEMBL456074,1 8.838,2 41.4,3 37.1,4 1.031,5 1.125,6 0.685,7 0.676,8 618.68,9 8.6,10 28,11 70,13 31,14 49,16 75,17 29,20 24,21 5,22 3,24 26,25 15,26 1,28 6,29 8,31 1,32 44,35 11.4,36 0.107,37 8,38 66,39 72.142,40 78.737,41 47.932,42 47.302,44 9.004}
{0 CHEMBL458606,1 9.127,2 35.3,3 37.3,4 1.047,5 1.137,6 0.66,7 0.661,8 465.49,9 9.8,10 16,11 51,13 19,14 35,16 54,17 18,20 12,21 6,22 3,24 19,25 14,26 1,28 5,29 8,31 1,32 32,35 15.7,36 0.13,37 7,38 46,39 53.389,40 57.993,41 33.642,42 33.7,44 5.481}
{0 CHEMBL459678,1 8.429,2 33.9,3 41.9,4 1.035,5 1.141,6 0.644,7 0.634,8 522.6,9 9.7,10 16,11 62,13 19,14 39,16 65,17 21,20 12,21 9,22 3,24 26,25 15,26 1,28 6,29 8,31 1,32 36,35 12.9,36 0.138,37 9,38 50,39 64.142,40 70.737,41 39.932,42 39.302,44 5.943}
{0 CHEMBL459679,1 8.676,2 35,3 40,4 1.038,5 1.139,6 0.653,7 0.646,8 520.58,9 10,10 16,11 60,13 19,14 40,16 64,17 21,20 12,21 9,22 3,24 24,25 15,26 1,28 6,29 8,31 1,32 36,35 13.3,36 0.125,37 8,38 51,39 62.258,40 68.322,41 39.17,42 38.775,44 6.907}
{0 CHEMBL461568,1 8.62,2 33.9,3 40.7,4 1.038,5 1.141,6 0.647,7 0.64,8 508.57,9 10.2,10 16,11 59,13 19,14 38,16 62,17 20,20 12,21 8,22 3,24 24,25 15,26 1,28 6,29 8,31 1,32 35,35 13.6,36 0.129,37 8,38 49,39 61.258,40 67.322,41 38.17,42 37.775,44 8.155}
{0 CHEMBL516501,1 8.831,2 33.9,3 39.3,4 1.042,5 1.141,6 0.65,7 0.647,8 494.54,9 10.7,10 16,11 56,13 19,14 37,16 59,17 19,20 12,21 7,22 3,24 22,25 15,26 1,28 6,29 8,31 1,32 34,35 14.3,36 0.136,37 8,38 48,39 58.374,40 63.907,41 36.409,42 36.248,44 8.357}
{0 CHEMBL518346,1 9.066,2 34,3 37.7,4 1.047,5 1.141,6 0.654,7 0.655,8 480.51,9 11.3,10 16,11 53,13 19,14 36,16 56,17 18,20 12,21 6,22 3,24 20,25 15,26 1,28 6,29 8,31 1,32 33,35 15.1,36 0.125,37 7,38 47,39 55.491,40 60.491,41 34.648,42 34.721,44 8.796}
{0 CHEMBL518959,1 8.486,2 34.9,3 41.3,4 1.034,5 1.139,6 0.65,7 0.64,8 534.61,9 9.5,10 16,11 63,13 19,14 41,16 67,17 22,20 12,21 10,22 3,24 26,25 15,26 1,28 6,29 8,31 1,32 37,35 12.7,36 0.119,37 8,38 52,39 65.142,40 71.737,41 40.932,42 40.302,44 5.026}
{0 CHEMBL519775,1 8.835,2 38.1,3 38.1,4 1.036,5 1.132,6 0.669,7 0.663,8 556.61,9 9.5,10 22,11 63,13 25,14 43,16 67,17 24,20 18,21 6,22 3,24 24,25 15,26 1,28 6,29 8,31 1,32 39,35 12.7,36 0.134,37 9,38 57,39 65.258,40 71.322,41 42.17,42 41.775,44 5.083}
{0 CHEMBL608838,1 9.542,2 33.9,3 33.9,4 1.058,5 1.145,6 0.658,7 0.672,8 591.58,9 14.5,10 21,11 62,13 25,14 45,16 66,17 21,20 15,21 6,22 4,24 21,25 20,26 1,28 9,29 10,31 1,32 41,35 16.1,36 0.136,37 9,38 59.5,39 65.567,40 70.99,41 40.812,42 41.688,44 8.504}
{0 CHEMBL608839,1 9.039,2 37.7,3 36.2,4 1.039,5 1.136,6 0.673,7 0.671,8 623.67,9 13,10 27,11 69,13 30,14 49,16 74,17 26,20 20,21 6,22 3,24 25,25 18,26 1,28 9,29 8,31 1,32 44,35 11.6,36 0.108,37 8,38 65.5,39 71.68,40 78.402,41 46.426,42 46.312,44 9.229}
{0 CHEMBL608840,1 8.856,2 33.8,3 38.5,4 1.041,5 1.145,6 0.653,7 0.651,8 575.63,9 13.8,10 21,11 65,13 24,14 44,16 69,17 22,20 14,21 8,22 3,24 25,25 18,26 1,28 9,29 8,31 1,32 40,35 12.3,36 0.13,37 9,38 57.5,39 67.68,40 74.402,41 42.426,42 42.312,44 8.801}
{0 CHEMBL608841,1 9.043,2 38.3,3 36.7,4 1.04,5 1.132,6 0.673,7 0.671,8 542.58,9 10,10 22,11 60,13 25,14 42,16 64,17 23,20 18,21 5,22 3,24 22,25 15,26 1,28 6,29 8,31 1,32 38,35 13.3,36 0.109,37 7,38 56,39 62.374,40 67.907,41 40.409,42 40.248,44 9.569}
{0 CHEMBL608842,1 9.039,2 37.7,3 36.2,4 1.039,5 1.136,6 0.673,7 0.671,8 623.67,9 13,10 27,11 69,13 30,14 49,16 74,17 26,20 20,21 6,22 3,24 25,25 18,26 1,28 9,29 8,31 1,32 44,35 11.6,36 0.108,37 8,38 65.5,39 71.68,40 78.402,41 46.426,42 46.312,44 9.022}
{0 CHEMBL608843,1 8.671,2 33.8,3 39.7,4 1.038,5 1.144,6 0.65,7 0.645,8 589.66,9 13.2,10 21,11 68,13 24,14 45,16 72,17 23,20 14,21 9,22 3,24 27,25 18,26 1,28 9,29 8,31 1,32 41,35 11.8,36 0.125,37 9,38 58.5,39 70.563,40 77.817,41 44.188,42 43.839,44 8.854}
{0 CHEMBL608844,1 9.33,2 34,3 36,4 1.052,5 1.142,6 0.658,7 0.664,8 466.48,9 12,10 16,11 50,13 19,14 35,16 53,17 17,20 12,21 5,22 3,24 18,25 15,26 1,28 6,29 8,31 1,32 32,35 16,36 0.113,37 6,38 46,39 52.607,40 57.076,41 32.886,42 33.195,44 8.236}
{0 CHEMBL608845,1 9.127,2 35.3,3 37.3,4 1.047,5 1.137,6 0.66,7 0.661,8 465.49,9 9.8,10 16,11 51,13 19,14 35,16 54,17 18,20 13,21 5,22 3,24 19,25 14,26 1,28 5,29 8,31 1,32 32,35 15.7,36 0.111,37 6,38 46,39 53.389,40 57.993,41 33.642,42 33.7,44 7.614}
{0 CHEMBL609097,1 9.127,2 33.3,3 37.3,4 1.047,5 1.144,6 0.656,7 0.657,8 465.5,9 13.7,10 16,11 51,13 19,14 35,16 54,17 17,20 12,21 5,22 3,24 19,25 15,26 1,28 7,29 7,31 1,32 32,35 13.7,36 0.111,37 6,38 46,39 53.382,40 58.365,41 33.438,42 33.501,44 8.42}
{0 CHEMBL609098,1 9.54,2 34.7,3 34.7,4 1.058,5 1.139,6 0.66,7 0.671,8 467.46,9 10.2,10 11,11 49,13 16,14 35,16 52,17 17,20 12,21 5,22 5,24 17,25 15,26 1,28 5,29 9,31 1,32 32,35 18.4,36 0.115,37 6,38 45.5,39 51.833,40 55.787,41 32.335,42 32.888,44 6.097}
{0 CHEMBL609100,1 9.394,2 36.9,3 33.8,4 1.046,5 1.14,6 0.676,7 0.681,8 610.63,9 15.4,10 27,11 65,13 30,14 48,16 70,17 24,20 19,21 5,22 3,24 22,25 19,26 1,28 10,29 8,31 1,32 43,35 12.3,36 0.114,37 8,38 64.5,39 68.014,40 74.069,41 43.909,42 44.28,44 8.833}
{0 CHEMBL609101,1 9.186,2 36.8,3 35.3,4 1.043,5 1.139,6 0.672,7 0.674,8 624.66,9 14.7,10 27,11 68,13 30,14 49,16 73,17 25,20 20,21 5,22 3,24 24,25 19,26 1,28 10,29 8,31 1,32 44,35 11.8,36 0.11,37 8,38 65.5,39 70.898,40 77.485,41 45.67,42 45.807,44 9.114}
{0 CHEMBL609102,1 9.76,2 32.7,3 32.7,4 1.06,5 1.149,6 0.661,7 0.677,8 507.5,9 17.3,10 16,11 52,13 21,14 38,16 55,17 17,20 12,21 5,22 5,24 17,25 18,26 1,28 9,29 8,31 1,32 35,35 15.4,36 0.127,37 7,38 51,39 55.145,40 59.741,41 34.381,42 35.205,44 4.372}
{0 CHEMBL609103,1 9.317,2 33.8,3 35.4,4 1.053,5 1.145,6 0.655,7 0.665,8 605.61,9 13.8,10 21,11 65,13 25,14 46,16 69,17 22,20 15,21 7,22 4,24 23,25 20,26 1,28 9,29 10,31 1,32 42,35 15.4,36 0.145,37 10,38 60.5,39 68.451,40 74.405,41 42.574,42 43.215,44 8.5}
{0 CHEMBL609105,1 8.72,2 34.8,3 39.1,4 1.037,5 1.142,6 0.655,7 0.65,8 601.67,9 13,10 21,11 69,13 24,14 47,16 74,17 24,20 14,21 10,22 3,24 27,25 18,26 1,28 9,29 8,31 1,32 42,35 11.6,36 0.108,37 8,38 60.5,39 71.563,40 78.817,41 45.188,42 44.839,44 9.268}
{0 CHEMBL609106,1 8.392,2 38.2,3 41.8,4 1.027,5 1.128,6 0.663,7 0.646,8 461.54,9 5.5,10 16,11 55,13 19,14 35,16 58,17 21,20 15,21 6,22 3,24 23,25 11,26 1,28 3,29 7,31 1,32 32,35 12.7,36 0.103,37 6,38 46,39 56.509,40 62.033,41 36.46,42 35.523,44 7.697}
{0 CHEMBL609107,1 8.933,2 34.6,3 38.5,4 1.042,5 1.14,6 0.658,7 0.654,8 464.51,9 11.5,10 16,11 52,13 19,14 35,16 55,17 18,20 12,21 6,22 3,24 20,25 14,26 1,28 6,29 7,31 1,32 32,35 13.5,36 0.109,37 6,38 46,39 54.164,40 59.282,41 34.193,42 34.007,44 8.638}
{0 CHEMBL609108,1 9.193,2 34.7,3 36.7,4 1.047,5 1.14,6 0.662,7 0.663,8 450.48,9 12.2,10 16,11 49,13 19,14 34,16 52,17 17,20 12,21 5,22 3,24 18,25 14,26 1,28 6,29 7,31 1,32 31,35 14.3,36 0.115,37 6,38 45,39 51.28,40 55.867,41 32.432,42 32.48,44 8.456}
{0 CHEMBL609111,1 10.907,2 34,3 34,4 1.057,5 1.138,6 0.685,7 0.684,8 545.37,9 12,10 16,11 50,13 19,14 36,15 1,16 53,17 17,20 12,21 5,22 3,24 17,25 16,26 2,28 6,29 8,31 1,32 33,34 1,35 16,36 0.113,37 6,38 47,39 52.836,40 56.918,41 34.239,42 34.22,43 2,44 5.688}
{0 CHEMBL609979,1 9.715,2 33.3,3 33.3,4 1.062,5 1.144,6 0.659,7 0.675,8 495.48,9 13.7,10 16,11 51,13 21,14 37,16 54,17 17,20 12,21 5,22 5,24 17,25 17,26 1,28 7,29 9,31 1,32 34,35 17.6,36 0.13,37 7,38 50,39 54.153,40 58.369,41 33.585,42 34.404,44 5.135}
{0 CHEMBL611766,1 8.551,2 34.7,3 40.3,4 1.034,5 1.142,6 0.652,7 0.644,8 615.7,9 12.5,10 21,11 72,13 24,14 48,16 77,17 25,20 14,21 11,22 3,24 29,25 18,26 1,28 9,29 8,31 1,32 43,35 11.1,36 0.104,37 8,38 61.5,39 74.447,40 82.232,41 46.949,42 46.366,44 9.495}
{0 CHEMBL611767,1 8.671,2 33.8,3 39.7,4 1.038,5 1.144,6 0.65,7 0.645,8 589.66,9 13.2,10 21,11 68,13 24,14 45,16 72,17 23,20 14,21 9,22 3,24 27,25 18,26 1,28 9,29 8,31 1,32 41,35 11.8,36 0.111,37 8,38 58.5,39 70.563,40 77.817,41 44.188,42 43.839,44 9.018}
{0 CHEMBL611769,1 8.831,2 33.9,3 39.3,4 1.042,5 1.141,6 0.65,7 0.647,8 494.54,9 10.7,10 16,11 56,13 19,14 37,16 59,17 19,20 12,21 7,22 3,24 22,25 15,26 1,28 6,29 8,31 1,32 34,35 14.3,36 0.119,37 7,38 48,39 58.374,40 63.907,41 36.409,42 36.248,44 6.42}
{0 CHEMBL611771,1 8.994,2 37.1,3 37.1,4 1.04,5 1.136,6 0.668,7 0.666,8 557.6,9 11.3,10 22,11 62,13 25,14 43,16 66,17 23,20 18,21 5,22 3,24 23,25 16,26 1,28 7,29 8,31 1,32 39,35 12.9,36 0.121,37 8,38 57,39 64.476,40 70.405,41 41.415,42 41.27,44 9.027}
{0 CHEMBL611772,1 8.348,2 33.8,3 41.9,4 1.031,5 1.144,6 0.645,7 0.634,8 617.72,9 12.2,10 21,11 74,13 24,14 47,16 78,17 25,20 14,21 11,22 3,24 31,25 18,26 1,28 9,29 8,31 1,32 43,35 10.8,36 0.154,37 12,38 60.5,39 76.331,40 84.647,41 47.71,42 46.893,44 9.538}
{0 CHEMBL611774,1 9.393,2 33.3,3 35,4 1.054,5 1.146,6 0.656,7 0.666,8 563.57,9 15,10 21,11 60,13 24,14 43,16 64,17 20,20 14,21 6,22 3,24 21,25 19,26 1,28 9,29 9,31 1,32 39,35 15,36 0.125,37 8,38 56.5,39 63.24,40 68.781,41 39.358,42 39.974,44 9.046}
{0 CHEMBL611775,1 9.186,2 36.8,3 35.3,4 1.043,5 1.139,6 0.672,7 0.674,8 624.66,9 14.7,10 27,11 68,13 30,14 49,16 73,17 25,20 20,21 5,22 3,24 24,25 19,26 1,28 10,29 8,31 1,32 44,35 11.8,36 0.11,37 8,38 65.5,39 70.898,40 77.485,41 45.67,42 45.807,44 9.201}
{0 CHEMBL611776,1 9.237,2 37.9,3 34.8,4 1.042,5 1.136,6 0.677,7 0.679,8 609.64,9 13.6,10 27,11 66,13 30,14 48,16 71,17 25,20 20,21 5,22 3,24 23,25 18,26 1,28 9,29 8,31 1,32 43,35 12.1,36 0.113,37 8,38 64.5,39 68.796,40 74.986,41 44.665,42 44.786,44 8.491}
{0 CHEMBL611777,1 9.139,2 40.3,3 35.5,4 1.038,5 1.128,6 0.684,7 0.681,8 566.6,9 9.7,10 22,11 62,13 26,14 44,16 66,17 25,19 2,20 18,21 5,22 3,24 22,25 15,26 1,28 6,29 8,31 1,32 40,33 1,35 12.9,36 0.091,37 6,38 60,39 64.374,40 69.907,41 42.409,42 42.248,44 9.398}
{0 CHEMBL611780,1 9.394,2 36.9,3 33.8,4 1.046,5 1.14,6 0.676,7 0.681,8 610.63,9 15.4,10 27,11 65,13 30,14 48,16 70,17 24,20 19,21 5,22 3,24 22,25 19,26 1,28 10,29 8,31 1,32 43,35 12.3,36 0.114,37 8,38 64.5,39 68.014,40 74.069,41 43.909,42 44.28,44 9.066}
{0 CHEMBL611782,1 9.338,2 37.3,3 34.3,4 1.047,5 1.137,6 0.673,7 0.679,8 625.64,9 13.4,10 27,11 67,13 30,14 49,16 72,17 25,20 20,21 5,22 3,24 23,25 19,26 1,28 9,29 9,31 1,32 44,35 13.4,36 0.111,37 8,38 65.5,39 70.124,40 76.196,41 45.119,42 45.5,44 9.215}
{0 CHEMBL611783,1 9.394,2 36.9,3 33.8,4 1.046,5 1.14,6 0.676,7 0.681,8 610.63,9 15.4,10 27,11 65,13 30,14 48,16 70,17 24,20 19,21 5,22 3,24 22,25 19,26 1,28 10,29 8,31 1,32 43,35 12.3,36 0.114,37 8,38 64.5,39 68.014,40 74.069,41 43.909,42 44.28,44 9.022}
{0 CHEMBL611784,1 8.503,2 33.8,3 40.8,4 1.034,5 1.144,6 0.647,7 0.639,8 603.69,9 12.7,10 21,11 71,13 24,14 46,16 75,17 24,20 14,21 10,22 3,24 29,25 18,26 1,28 9,29 8,31 1,32 42,35 11.3,36 0.147,37 11,38 59.5,39 73.447,40 81.232,41 45.949,42 45.366,44 9.215}
{0 CHEMBL611785,1 9.039,2 37.7,3 36.2,4 1.039,5 1.136,6 0.673,7 0.671,8 623.67,9 13,10 27,11 69,13 30,14 49,16 74,17 26,20 20,21 6,22 3,24 25,25 18,26 1,28 9,29 8,31 1,32 44,35 11.6,36 0.108,37 8,38 65.5,39 71.68,40 78.402,41 46.426,42 46.312,44 9.319}
{0 CHEMBL611786,1 9.193,2 34.7,3 36.7,4 1.047,5 1.14,6 0.662,7 0.663,8 450.48,9 12.2,10 16,11 49,13 19,14 34,16 52,17 17,20 12,21 5,22 3,24 18,25 14,26 1,28 6,29 7,31 1,32 31,35 14.3,36 0.115,37 6,38 45,39 51.28,40 55.867,41 32.432,42 32.48,44 8.495}
{0 CHEMBL611787,1 8.969,2 37.5,3 37.5,4 1.034,5 1.134,6 0.678,7 0.668,8 430.49,9 12.5,10 16,11 48,13 20,14 33,16 51,17 18,20 14,21 4,22 4,24 18,25 12,26 1,28 6,29 5,31 1,32 30,35 10.4,36 0.118,37 6,38 45,39 49.625,40 54.448,41 32.523,42 32.05,44 6.081}
{0 CHEMBL611788,1 8.65,2 36,3 40,4 1.03,5 1.137,6 0.666,7 0.652,8 432.51,9 12,10 16,11 50,13 19,14 33,16 53,17 18,20 12,21 6,22 3,24 20,25 12,26 1,28 6,29 5,31 1,32 30,35 10,36 0.113,37 6,38 44,39 51.509,40 56.863,41 33.284,42 32.577,44 7.215}
{0 CHEMBL611789,1 11.847,2 34,3 34,4 1.054,5 1.136,6 0.711,7 0.69,8 592.37,9 12,10 16,11 50,13 19,14 36,16 53,17 17,20 12,21 5,22 3,24 17,25 16,26 2,27 1,28 6,29 8,31 1,32 33,34 1,35 16,36 0.113,37 6,38 47,39 52.676,40 56.797,41 35.545,42 34.511,43 2,44 8.519}
{0 CHEMBL612022,1 9.193,2 34.7,3 36.7,4 1.047,5 1.14,6 0.662,7 0.663,8 450.48,9 12.2,10 16,11 49,13 19,14 34,16 52,17 17,20 12,21 5,22 3,24 18,25 14,26 1,28 6,29 7,31 1,32 31,35 14.3,36 0.115,37 6,38 45,39 51.28,40 55.867,41 32.432,42 32.48,44 8.456}
{0 CHEMBL612037,1 8.072,2 33.8,3 43.8,4 1.026,5 1.143,6 0.64,7 0.624,8 645.78,9 11.3,10 21,11 80,13 24,14 49,16 84,17 27,20 14,21 13,22 3,24 35,25 18,26 1,28 9,29 8,31 1,32 45,35 10,36 0.167,37 14,38 62.5,39 82.098,40 91.478,41 51.233,42 49.946,44 8.893}
{0 CHEMBL612040,1 9.338,2 37.3,3 34.3,4 1.047,5 1.137,6 0.673,7 0.679,8 625.64,9 13.4,10 27,11 67,13 30,14 49,16 72,17 25,20 20,21 5,22 3,24 23,25 19,26 1,28 9,29 9,31 1,32 44,35 13.4,36 0.111,37 8,38 65.5,39 70.124,40 76.196,41 45.119,42 45.5,44 8.947}
{0 CHEMBL612041,1 9.186,2 36.8,3 35.3,4 1.043,5 1.139,6 0.672,7 0.674,8 624.66,9 14.7,10 27,11 68,13 30,14 49,16 73,17 25,20 20,21 5,22 3,24 24,25 19,26 1,28 10,29 8,31 1,32 44,35 11.8,36 0.11,37 8,38 65.5,39 70.898,40 77.485,41 45.67,42 45.807,44 9.056}
{0 CHEMBL612042,1 7.835,2 33.7,3 45.3,4 1.022,5 1.143,6 0.637,7 0.616,8 673.84,9 10.5,10 21,11 86,13 24,14 51,16 90,17 29,20 14,21 15,22 3,24 39,25 18,26 1,28 9,29 8,31 1,32 47,35 9.3,36 0.178,37 16,38 64.5,39 87.865,40 98.308,41 54.756,42 53,44 8.292}
{0 CHEMBL612044,1 7.629,2 33.7,3 46.7,4 1.018,5 1.143,6 0.633,7 0.609,8 701.9,9 9.8,10 21,11 92,13 24,14 53,16 96,17 31,20 14,21 17,22 3,24 43,25 18,26 1,28 9,29 8,31 1,32 49,35 8.7,36 0.188,37 18,38 66.5,39 93.632,40 105.138,41 58.279,42 56.054,44 8.577}
{0 CHEMBL612046,1 9.76,2 32.7,3 32.7,4 1.06,5 1.149,6 0.661,7 0.677,8 507.5,9 17.3,10 16,11 52,13 21,14 38,16 55,17 17,20 12,21 5,22 5,24 17,25 18,26 1,28 9,29 8,31 1,32 35,35 15.4,36 0.127,37 7,38 51,39 55.145,40 59.741,41 34.381,42 35.205,44 8.292}
{0 CHEMBL612048,1 9.105,2 34.9,3 36.5,4 1.044,5 1.143,6 0.661,7 0.663,8 573.61,9 14.3,10 21,11 63,13 24,14 45,16 68,17 22,20 14,21 8,22 3,24 23,25 18,26 1,28 9,29 8,31 1,32 40,35 12.7,36 0.118,37 8,38 58.5,39 65.796,40 71.986,41 41.665,42 41.786,44 9.337}
{0 CHEMBL612049,1 8.205,2 33.8,3 42.9,4 1.029,5 1.144,6 0.642,7 0.629,8 631.75,9 11.7,10 21,11 77,13 24,14 48,16 81,17 26,20 14,21 12,22 3,24 33,25 18,26 1,28 9,29 8,31 1,32 44,35 10.4,36 0.16,37 13,38 61.5,39 79.214,40 88.062,41 49.472,42 48.42,44 9.387}
{0 CHEMBL612051,1 8.671,2 33.8,3 39.7,4 1.038,5 1.144,6 0.65,7 0.645,8 589.66,9 13.2,10 21,11 68,13 24,14 45,16 72,17 23,20 14,21 9,22 3,24 27,25 18,26 1,28 9,29 8,31 1,32 41,35 11.8,36 0.139,37 10,38 58.5,39 70.563,40 77.817,41 44.188,42 43.839,44 8.721}
{0 CHEMBL612052,1 9.338,2 37.3,3 34.3,4 1.047,5 1.137,6 0.673,7 0.679,8 625.64,9 13.4,10 27,11 67,13 30,14 49,16 72,17 25,20 20,21 5,22 3,24 23,25 19,26 1,28 9,29 9,31 1,32 44,35 13.4,36 0.111,37 8,38 65.5,39 70.124,40 76.196,41 45.119,42 45.5,44 9.244}
{0 CHEMBL612053,1 8.887,2 35.1,3 38.6,4 1.042,5 1.139,6 0.656,7 0.653,8 506.55,9 10.5,10 16,11 57,13 19,14 39,16 61,17 20,20 12,21 8,22 3,24 22,25 15,26 1,28 6,29 8,31 1,32 35,35 14,36 0.131,37 8,38 50,39 59.374,40 64.907,41 37.409,42 37.248,44 8.733}
{0 CHEMBL612056,1 8.62,2 33.9,3 40.7,4 1.038,5 1.141,6 0.647,7 0.64,8 508.57,9 10.2,10 16,11 59,13 19,14 38,16 62,17 20,20 12,21 8,22 3,24 24,25 15,26 1,28 6,29 8,31 1,32 35,35 13.6,36 0.145,37 9,38 49,39 61.258,40 67.322,41 38.17,42 37.775,44 8.456}
{0 CHEMBL612057,1 8.767,2 35.7,3 38.6,4 1.037,5 1.14,6 0.66,7 0.655,8 613.68,9 12.9,10 21,11 70,13 25,14 48,16 75,17 25,20 16,21 9,22 4,24 27,25 18,26 1,28 9,29 8,31 1,32 43,35 11.4,36 0.107,37 8,38 62.5,39 72.563,40 79.817,41 46.188,42 45.839,44 8.824}
{0 CHEMBL612058,1 8.873,2 33.3,3 39.2,4 1.042,5 1.143,6 0.651,7 0.647,8 452.5,9 11.8,10 16,11 51,13 18,14 34,16 54,17 17,20 11,21 6,22 2,24 20,25 14,26 1,28 6,29 7,31 1,32 31,35 13.7,36 0.13,37 7,38 44,39 53.164,40 58.282,41 33.193,42 33.007,44 6.387}
