"molecule_id","nBT","nC","pXC50"
{1 45,2 22,3 4.287}
{0 CHEMBL1221,1 41,2 18,3 4.533}
{0 CHEMBL1475252,1 44,2 16,3 4}
{0 CHEMBL1812545,1 27,2 11,3 4}
{0 CHEMBL1909733,1 19,2 8,3 7.469}
{0 CHEMBL1909734,1 19,2 8,3 5.824}
{0 CHEMBL1909735,1 19,2 8,3 5.678}
{0 CHEMBL192,1 66,2 22,3 4}
{0 CHEMBL193,1 44,2 17,3 4.337}
{0 CHEMBL193664,1 19,2 8,3 5.301}
{0 CHEMBL194853,1 22,2 9,3 6.921}
{0 CHEMBL196408,1 22,2 9,3 5.77}
{0 CHEMBL198194,1 21,2 8,3 5.398}
{0 CHEMBL198937,1 20,2 8,3 5.886}
{0 CHEMBL206816,1 21,2 10,3 5}
{0 CHEMBL2146496,1 18,2 7,3 7.222}
{0 CHEMBL2147989,1 19,2 8,3 7.699}
{0 CHEMBL2147990,1 20,2 9,3 7.538}
{0 CHEMBL2147991,1 22,2 9,3 7.155}
{0 CHEMBL2147992,1 25,2 10,3 7.523}
{0 CHEMBL2147993,1 21,2 8,3 6.959}
{0 CHEMBL2147994,1 19,2 8,3 5.959}
{0 CHEMBL2147995,1 18,2 7,3 7.301}
{0 CHEMBL2147996,1 18,2 7,3 6.921}
{0 CHEMBL2147997,1 21,2 8,3 6.469}
{0 CHEMBL2147998,1 20,2 8,3 7.658}
{0 CHEMBL2147999,1 21,2 8,3 5.77}
{0 CHEMBL2148000,1 19,2 8,3 6.201}
{0 CHEMBL2148001,1 25,2 10,3 4.886}
{0 CHEMBL2148002,1 22,2 9,3 4.699}
{0 CHEMBL2148074,1 20,2 8,3 8.699}
{0 CHEMBL2148075,1 22,2 9,3 6.921}
{0 CHEMBL2148076,1 19,2 8,3 6.824}
{0 CHEMBL2148077,1 19,2 8,3 5.77}
{0 CHEMBL372363,1 23,2 9,3 4.699}
{0 CHEMBL382312,1 19,2 8,3 7.638}
{0 CHEMBL408,1 61,2 24,3 4.215}
{0 CHEMBL449298,1 21,2 9,3 6}
{0 CHEMBL480,1 41,2 16,3 4.027}
{0 CHEMBL504816,1 31,2 12,3 4.398}
{0 CHEMBL570794,1 59,2 26,3 4.301}
{0 CHEMBL570797,1 18,2 7,3 4.699}
{0 CHEMBL571436,1 20,2 9,3 4.699}
{0 CHEMBL576123,1 32,2 14,3 5.398}
{0 CHEMBL577335,1 28,2 12,3 4.301}
{0 CHEMBL578212,1 31,2 13,3 4.523}
{0 CHEMBL584991,1 26,2 9,3 7.169}
{0 CHEMBL7301,1 63,2 26,3 4.223}
{0 CHEMBL808,1 41,2 18,3 4.951}
{0 CHEMBL91,1 41,2 18,3 4.75}
