"molecule_id","AMW","C.","pXC50"
{1 8.409,2 33.3,3 5}
{0 CHEMBL2093931,1 7.286,2 27.8,3 6.398}
{0 CHEMBL2311128,1 7.523,2 27.3,3 6.658}
{0 CHEMBL2311129,1 7.286,2 27.8,3 7}
{0 CHEMBL307584,1 7.258,2 28.1,3 5.398}
{0 CHEMBL308139,1 7.258,2 28.1,3 4.301}
{0 CHEMBL308774,1 7.523,2 27.3,3 4.699}
{0 CHEMBL310598,1 7.037,2 28.6,3 6.523}
{0 CHEMBL603590,1 8.151,2 32.1,3 5.699}
{0 CHEMBL604220,1 7.675,2 30,3 5.398}
{0 CHEMBL604221,1 7.522,2 27,3 4.699}
{0 CHEMBL604226,1 7.897,2 30.6,3 5}
{0 CHEMBL604436,1 7.535,2 28.9,3 10}
{0 CHEMBL604639,1 7.675,2 30,3 5.398}
{0 CHEMBL605678,1 8.071,2 31.3,3 4}
{0 CHEMBL605877,1 7.655,2 29.4,3 6.398}
{0 CHEMBL607779,1 7.037,2 28.6,3 6.523}
{0 CHEMBL608479,1 7.655,2 29.4,3 4.699}
{0 CHEMBL608656,1 7.258,2 28.1,3 5.398}
{0 CHEMBL609349,1 6.851,2 28.9,3 4.469}
{0 CHEMBL610997,1 7.402,2 30.3,3 7.155}
{0 CHEMBL77547,1 7.037,2 28.6,3 5.18}
