"molecule_id","RBN","RBF","Sp","Sv","nAT","nBT","Si","MW","nH","AMW","C.","H.","Me","Mi","Mp","pXC50"
{1 4,2 0.074,3 36.665,4 34.551,5 51,6 54,7 57.187,8 463.82,9 21,10 9.095,11 43.1,12 41.2,13 1.011,14 1.121,15 0.719,16 8.745}
{0 CHEMBL112486,1 15,2 0.268,3 35.438,4 31.956,5 57,6 56,7 64.737,8 356.6,9 33,10 6.256,11 35.1,12 57.9,13 0.987,14 1.136,15 0.622,16 6.517}
{0 CHEMBL113262,1 16,2 0.267,3 37.995,4 33.746,5 61,6 60,7 69.371,8 370.54,9 36,10 6.074,11 34.4,12 59,13 0.982,14 1.137,15 0.623,16 6.276}
{0 CHEMBL120473,1 17,2 0.227,3 45.91,4 41.236,5 76,6 75,7 86.597,8 419.74,9 46,10 5.523,11 35.5,12 60.5,13 0.977,14 1.139,15 0.604,16 9}
{0 CHEMBL120788,1 18,2 0.25,3 44.148,4 39.709,5 73,6 72,7 83.182,8 405.71,9 44,10 5.558,11 35.6,12 60.3,13 0.978,14 1.139,15 0.605,16 8.086}
{0 CHEMBL120889,1 18,2 0.247,3 44.665,4 40.041,5 74,6 73,7 84.052,8 403.72,9 45,10 5.456,11 35.1,12 60.8,13 0.976,14 1.136,15 0.604,16 8.155}
{0 CHEMBL120935,1 18,2 0.269,3 41.143,4 36.987,5 68,6 67,7 77.221,8 375.66,9 41,10 5.524,11 35.3,12 60.3,13 0.977,14 1.136,15 0.605,16 5.75}
{0 CHEMBL120944,1 18,2 0.231,3 47.671,4 42.763,5 79,6 78,7 90.012,8 433.77,9 48,10 5.491,11 35.4,12 60.8,13 0.977,14 1.139,15 0.603,16 7.854}
{0 CHEMBL121011,1 17,2 0.266,3 39.381,4 35.46,5 65,6 64,7 73.806,8 361.63,9 39,10 5.564,11 35.4,12 60,13 0.978,14 1.135,15 0.606,16 5.514}
{0 CHEMBL1210154,1 5,2 0.119,3 28.898,4 27.347,5 40,6 42,7 44.242,8 336.44,9 16,10 8.411,11 47.5,12 40,13 1.003,14 1.106,15 0.722,16 5}
{0 CHEMBL121073,1 17,2 0.227,3 45.91,4 41.236,5 76,6 75,7 86.597,8 419.74,9 46,10 5.523,11 35.5,12 60.5,13 0.977,14 1.139,15 0.604,16 8.114}
{0 CHEMBL121203,1 19,2 0.271,3 42.904,4 38.514,5 71,6 70,7 80.636,8 389.69,9 43,10 5.489,11 35.2,12 60.6,13 0.976,14 1.136,15 0.604,16 6.807}
{0 CHEMBL121258,1 18,2 0.257,3 42.904,4 38.514,5 71,6 70,7 80.636,8 389.69,9 43,10 5.489,11 35.2,12 60.6,13 0.976,14 1.136,15 0.604,16 7.626}
{0 CHEMBL121490,1 20,2 0.274,3 44.665,4 40.041,5 74,6 73,7 84.052,8 403.72,9 45,10 5.456,11 35.1,12 60.8,13 0.976,14 1.136,15 0.604,16 7.352}
{0 CHEMBL121681,1 17,2 0.243,3 42.904,4 38.514,5 71,6 70,7 80.636,8 389.69,9 43,10 5.489,11 35.2,12 60.6,13 0.976,14 1.136,15 0.604,16 6.418}
{0 CHEMBL151167,1 15,2 0.25,3 38.023,4 34.046,5 61,6 60,7 69.125,8 366.04,9 36,10 6.001,11 36.1,12 59,13 0.978,14 1.133,15 0.623,16 8.409}
{0 CHEMBL15848,1 16,2 0.262,3 37.62,4 33.933,5 62,6 61,7 70.391,8 347.6,9 37,10 5.606,11 35.5,12 59.7,13 0.978,14 1.135,15 0.607,16 7.23}
{0 CHEMBL188,1 4,2 0.063,3 39.512,4 37.509,5 58,6 63,7 64.607,8 426.55,9 26,10 7.354,11 46.6,12 44.8,13 0.996,14 1.114,15 0.681,16 8.6}
{0 CHEMBL1923761,1 21,2 0.276,3 45.478,4 41.878,5 76,6 76,7 86.391,8 452.7,9 44,10 5.957,11 34.2,12 57.9,13 0.992,14 1.137,15 0.598,16 7.106}
{0 CHEMBL1923763,1 22,2 0.259,3 50.762,4 46.459,5 85,6 85,7 96.636,8 494.79,9 50,10 5.821,11 34.1,12 58.8,13 0.989,14 1.137,15 0.597,16 8.201}
{0 CHEMBL1950351,1 4,2 0.056,3 43.665,4 40.539,5 68,6 72,7 76.896,8 473.7,9 35,10 6.966,11 36.8,12 51.5,13 0.997,14 1.131,15 0.642,16 8.721}
{0 CHEMBL214229,1 5,2 0.085,3 35.523,4 33.552,5 56,6 59,7 63.604,8 384.53,9 28,10 6.867,11 37.5,12 50,13 1,14 1.136,15 0.634,16 6}
{0 CHEMBL214511,1 4,2 0.075,3 33.54,4 31.762,5 50,6 53,7 56.066,8 361.48,9 23,10 7.23,11 44,12 46,13 0.996,14 1.121,15 0.671,16 6}
{0 CHEMBL216057,1 4,2 0.068,3 37,4 35.199,5 56,6 59,7 63.236,8 407.53,9 26,10 7.277,11 42.9,12 46.4,13 1.001,14 1.129,15 0.661,16 6.826}
{0 CHEMBL216067,1 5,2 0.083,3 37.517,4 35.53,5 57,6 60,7 64.106,8 405.54,9 27,10 7.115,11 42.1,12 47.4,13 0.998,14 1.125,15 0.658,16 6}
{0 CHEMBL216276,1 3,2 0.054,3 36.807,4 34.723,5 52,6 56,7 58.243,8 441.39,9 22,10 8.488,11 44.2,12 42.3,13 1.004,14 1.12,15 0.708,16 6.44}
{0 CHEMBL216333,1 4,2 0.073,3 37.494,4 35.89,5 51,6 55,7 56.539,8 464.37,9 19,10 9.105,11 49,12 37.3,13 1.011,14 1.109,15 0.735,16 5}
{0 CHEMBL216335,1 5,2 0.091,3 37.438,4 36.594,5 51,6 55,7 56.914,8 494.36,9 17,10 9.693,11 47.1,12 33.3,13 1.026,14 1.116,15 0.734,16 5.347}
{0 CHEMBL216382,1 4,2 0.068,3 37,4 35.199,5 56,6 59,7 63.236,8 407.53,9 26,10 7.277,11 42.9,12 46.4,13 1.001,14 1.129,15 0.661,16 7.569}
{0 CHEMBL216438,1 5,2 0.081,3 38.142,4 35.906,5 59,6 62,7 66.963,8 433,9 29,10 7.339,11 37.3,12 49.2,13 1.003,14 1.135,15 0.646,16 6}
{0 CHEMBL216555,1 6,2 0.081,3 45.358,4 42.439,5 70,6 74,7 79.138,8 473.68,9 35,10 6.767,11 40,12 50,13 0.992,14 1.131,15 0.648,16 6}
{0 CHEMBL216595,1 3,2 0.054,3 37.665,4 35.551,5 52,6 56,7 58.187,8 475.83,9 21,10 9.151,11 44.2,12 40.4,13 1.01,14 1.119,15 0.724,16 5.921}
{0 CHEMBL216659,1 3,2 0.059,3 35.216,4 34.032,5 47,6 51,7 52.254,8 452.33,9 16,10 9.624,11 51.1,12 34,13 1.018,14 1.112,15 0.749,16 5.301}
{0 CHEMBL216690,1 4,2 0.067,3 36.824,4 34.342,5 57,6 60,7 64.311,8 379.55,9 29,10 6.659,11 40.4,12 50.9,13 0.99,14 1.128,15 0.646,16 6}
{0 CHEMBL216735,1 3,2 0.053,3 37.563,4 35.229,5 53,6 57,7 59.16,8 440.4,9 23,10 8.309,11 45.3,12 43.4,13 1,14 1.116,15 0.709,16 6.046}
{0 CHEMBL216888,1 4,2 0.075,3 34.336,4 32.973,5 50,6 53,7 56.349,8 413.91,9 21,10 8.278,11 44,12 42,13 1.013,14 1.127,15 0.687,16 6.766}
{0 CHEMBL217094,1 5,2 0.083,3 37.137,4 34.885,5 57,6 60,7 64.465,8 417.98,9 28,10 7.333,11 38.6,12 49.1,13 1.002,14 1.131,15 0.652,16 6}
{0 CHEMBL217247,1 5,2 0.072,3 40.569,4 37.659,5 66,6 69,7 75.265,8 416.63,9 36,10 6.313,11 34.8,12 54.5,13 0.993,14 1.14,15 0.615,16 6}
{0 CHEMBL217266,1 4,2 0.068,3 37.063,4 34.815,5 56,6 59,7 62.896,8 389.54,9 27,10 6.956,11 42.9,12 48.2,13 0.992,14 1.123,15 0.662,16 6.844}
{0 CHEMBL217549,1 4,2 0.068,3 37,4 35.199,5 56,6 59,7 63.236,8 407.53,9 26,10 7.277,11 42.9,12 46.4,13 1.001,14 1.129,15 0.661,16 6.86}
{0 CHEMBL217583,1 4,2 0.075,3 34.336,4 32.973,5 50,6 53,7 56.349,8 413.91,9 21,10 8.278,11 44,12 42,13 1.013,14 1.127,15 0.687,16 6.305}
{0 CHEMBL218295,1 5,2 0.085,3 37.063,4 34.815,5 56,6 59,7 62.896,8 389.54,9 27,10 6.956,11 42.9,12 48.2,13 0.992,14 1.123,15 0.662,16 6}
{0 CHEMBL218432,1 5,2 0.088,3 38.5,4 36.911,5 53,6 57,7 59.037,8 479.39,9 20,10 9.045,11 47.2,12 37.7,13 1.012,14 1.114,15 0.726,16 5.301}
{0 CHEMBL218571,1 3,2 0.059,3 36.136,4 34.476,5 47,6 51,7 51.858,8 468.78,9 16,10 9.974,11 51.1,12 34,13 1.014,14 1.103,15 0.769,16 5}
{0 CHEMBL218957,1 3,2 0.057,3 35.904,4 34.024,5 49,6 53,7 54.771,8 461.8,9 19,10 9.424,11 44.9,12 38.8,13 1.013,14 1.118,15 0.733,16 5.688}
{0 CHEMBL219037,1 3,2 0.056,3 36.852,4 36.325,5 50,6 54,7 56.348,8 502.34,9 16,10 10.047,11 50,12 32,13 1.035,14 1.127,15 0.737,16 5}
{0 CHEMBL219578,1 3,2 0.059,3 36.994,4 35.303,5 47,6 51,7 51.802,8 503.22,9 15,10 10.707,11 51.1,12 31.9,13 1.021,14 1.102,15 0.787,16 5}
{0 CHEMBL224053,1 3,2 0.051,3 39.426,4 37.078,5 55,6 59,7 61.602,8 489.86,9 23,10 8.907,11 43.6,12 41.8,13 1.008,14 1.12,15 0.717,16 7.506}
{0 CHEMBL224114,1 3,2 0.053,3 39.659,4 37.529,5 53,6 57,7 58.688,8 496.84,9 20,10 9.374,11 49.1,12 37.7,13 1.008,14 1.107,15 0.748,16 8.241}
{0 CHEMBL224847,1 3,2 0.056,3 38.756,4 36.83,5 50,6 54,7 55.217,8 517.25,9 17,10 10.345,11 50,12 34,13 1.018,14 1.104,15 0.775,16 8.602}
{0 CHEMBL225377,1 3,2 0.056,3 37.898,4 36.003,5 50,6 54,7 55.273,8 482.81,9 18,10 9.656,11 50,12 36,13 1.011,14 1.105,15 0.758,16 8.362}
{0 CHEMBL225415,1 3,2 0.051,3 38.568,4 36.25,5 55,6 59,7 61.658,8 455.42,9 24,10 8.28,11 43.6,12 43.6,13 1.002,14 1.121,15 0.701,16 9.959}
{0 CHEMBL225622,1 3,2 0.05,3 40.182,4 37.583,5 56,6 60,7 62.519,8 488.87,9 24,10 8.73,11 44.6,12 42.9,13 1.004,14 1.116,15 0.718,16 9.523}
{0 CHEMBL232116,1 2,2 0.035,3 37.853,4 33.453,5 54,6 57,7 60.154,8 404.72,9 28,10 7.495,11 38.9,12 51.9,13 0.98,14 1.114,15 0.701,16 8.222}
{0 CHEMBL232129,1 3,2 0.06,3 33.597,4 31.264,5 48,6 50,7 54.552,8 434.62,9 21,10 9.055,11 37.5,12 43.8,13 1.021,14 1.137,15 0.7,16 5.917}
{0 CHEMBL232328,1 2,2 0.038,3 36.33,4 32.399,5 50,6 53,7 55.324,8 400.68,9 24,10 8.014,11 42,12 48,13 0.983,14 1.106,15 0.727,16 8.167}
{0 CHEMBL232730,1 3,2 0.064,3 32.33,4 28.399,5 46,6 47,7 51.324,8 352.64,9 24,10 7.666,11 37,12 52.2,13 0.982,14 1.116,15 0.703,16 5.695}
{0 CHEMBL2337202,1 5,2 0.086,3 38.546,4 37.04,5 55,6 58,7 62.827,8 517.84,9 22,10 9.415,11 41.8,12 40,13 1.028,14 1.142,15 0.701,16 6.542}
{0 CHEMBL2337203,1 4,2 0.073,3 37.659,4 35.23,5 52,6 55,7 58.151,8 463.83,9 22,10 8.92,11 46.2,12 42.3,13 1.006,14 1.118,15 0.724,16 6.385}
{0 CHEMBL2337204,1 4,2 0.073,3 37.659,4 35.23,5 52,6 55,7 58.151,8 463.83,9 22,10 8.92,11 46.2,12 42.3,13 1.006,14 1.118,15 0.724,16 7.588}
{0 CHEMBL2337205,1 5,2 0.086,3 38.938,4 36.088,5 55,6 58,7 61.436,8 463.86,9 25,10 8.434,11 43.6,12 45.5,13 1,14 1.117,15 0.708,16 6.757}
{0 CHEMBL2337206,1 5,2 0.089,3 38.176,4 35.562,5 53,6 56,7 59.02,8 461.84,9 23,10 8.714,11 45.3,12 43.4,13 1.002,14 1.114,15 0.72,16 7.336}
{0 CHEMBL2338174,1 2,2 0.036,3 32.813,4 30.299,5 51,6 55,7 57.315,8 325.49,9 27,10 6.382,11 41.2,12 52.9,13 0.985,14 1.124,15 0.643,16 5}
{0 CHEMBL2338175,1 3,2 0.052,3 34.574,4 31.826,5 54,6 58,7 60.73,8 339.52,9 29,10 6.287,11 40.7,12 53.7,13 0.984,14 1.125,15 0.64,16 5.301}
{0 CHEMBL2338176,1 5,2 0.081,3 36.79,4 34.068,5 58,6 62,7 65.355,8 369.55,9 31,10 6.372,11 39.7,12 53.4,13 0.989,14 1.127,15 0.634,16 5}
{0 CHEMBL2338177,1 1,2 0.019,3 31.603,4 29.079,5 49,6 53,7 55.188,8 310.48,9 26,10 6.336,11 40.8,12 53.1,13 0.982,14 1.126,15 0.645,16 5}
{0 CHEMBL2338178,1 1,2 0.021,3 28.836,4 26.531,5 44,6 48,7 49.275,8 281.43,9 23,10 6.396,11 43.2,12 52.3,13 0.981,14 1.12,15 0.655,16 5}
{0 CHEMBL2338179,1 1,2 0.021,3 28.836,4 26.531,5 44,6 48,7 49.275,8 281.43,9 23,10 6.396,11 43.2,12 52.3,13 0.981,14 1.12,15 0.655,16 5}
{0 CHEMBL2338181,1 1,2 0.019,3 32.358,4 29.585,5 50,6 54,7 56.105,8 309.49,9 27,10 6.19,11 42,12 54,13 0.978,14 1.122,15 0.647,16 5}
{0 CHEMBL2338182,1 1,2 0.02,3 30.597,4 28.058,5 47,6 51,7 52.69,8 295.46,9 25,10 6.286,11 42.6,12 53.2,13 0.979,14 1.121,15 0.651,16 5}
{0 CHEMBL2338183,1 1,2 0.021,3 28.773,4 26.914,5 44,6 48,7 49.615,8 299.42,9 22,10 6.805,11 43.2,12 50,13 0.992,14 1.128,15 0.654,16 5.222}
{0 CHEMBL2338184,1 1,2 0.02,3 30.41,4 29.208,5 47,6 51,7 53.709,8 349.43,9 22,10 7.435,11 42.6,12 46.8,13 1.012,14 1.143,15 0.647,16 5}
{0 CHEMBL2338185,1 1,2 0.02,3 30.597,4 28.058,5 47,6 51,7 52.69,8 295.46,9 25,10 6.286,11 42.6,12 53.2,13 0.979,14 1.121,15 0.651,16 5}
{0 CHEMBL2338186,1 1,2 0.02,3 29.841,4 27.552,5 46,6 50,7 51.773,8 296.45,9 24,10 6.445,11 41.3,12 52.2,13 0.984,14 1.126,15 0.649,16 5}
{0 CHEMBL2338187,1 1,2 0.022,3 27.074,4 25.004,5 41,6 45,7 45.86,8 267.4,9 21,10 6.522,11 43.9,12 51.2,13 0.982,14 1.119,15 0.66,16 5}
{0 CHEMBL2338188,1 1,2 0.021,3 28.836,4 26.531,5 44,6 48,7 49.275,8 281.43,9 23,10 6.396,11 43.2,12 52.3,13 0.981,14 1.12,15 0.655,16 5}
{0 CHEMBL2346668,1 3,2 0.058,3 34.432,4 32.051,5 48,6 52,7 53.2,8 421.36,9 21,10 8.778,11 47.9,12 43.8,13 0.992,14 1.108,15 0.717,16 6.201}
{0 CHEMBL2346977,1 3,2 0.057,3 34.324,4 32.52,5 49,6 53,7 54.441,8 367.48,9 21,10 7.5,11 49,12 42.9,13 0.992,14 1.111,15 0.7,16 7.257}
{0 CHEMBL2346978,1 5,2 0.086,3 36.75,4 34.982,5 54,6 58,7 60.192,8 400.51,9 24,10 7.417,11 46.3,12 44.4,13 0.998,14 1.115,15 0.681,16 6.021}
{0 CHEMBL2346979,1 5,2 0.086,3 36.75,4 34.982,5 54,6 58,7 60.192,8 400.51,9 24,10 7.417,11 46.3,12 44.4,13 0.998,14 1.115,15 0.681,16 7.067}
{0 CHEMBL2346980,1 3,2 0.056,3 34.086,4 32.047,5 50,6 54,7 55.856,8 357.49,9 23,10 7.15,11 46,12 46,13 0.989,14 1.117,15 0.682,16 6.447}
{0 CHEMBL2346981,1 3,2 0.056,3 34.944,4 32.875,5 50,6 54,7 55.8,8 391.93,9 22,10 7.839,11 46,12 44,13 0.996,14 1.116,15 0.699,16 7.019}
{0 CHEMBL238082,1 3,2 0.058,3 33.08,4 31.026,5 48,6 52,7 53.358,8 342.47,9 22,10 7.135,11 47.9,12 45.8,13 0.987,14 1.112,15 0.689,16 6.87}
{0 CHEMBL238083,1 3,2 0.056,3 33.841,4 31.552,5 50,6 54,7 55.773,8 344.49,9 24,10 6.89,11 46,12 48,13 0.985,14 1.115,15 0.677,16 6.268}
{0 CHEMBL23838,1 7,2 0.219,3 20.744,4 19.922,5 32,6 32,7 36.385,8 275.22,9 14,10 8.601,11 31.3,12 43.8,13 1.038,14 1.137,15 0.648,16 5.921}
{0 CHEMBL239257,1 7,2 0.132,3 32.171,4 29.739,5 52,6 53,7 59.524,8 356.55,9 28,10 6.857,11 30.8,12 53.8,13 1.001,14 1.145,15 0.619,16 4.433}
{0 CHEMBL240109,1 5,2 0.082,3 41.739,4 39.2,5 58,6 61,7 64.858,8 540.93,9 24,10 9.326,11 41.4,12 41.4,13 1.016,14 1.118,15 0.72,16 4.433}
{0 CHEMBL240324,1 5,2 0.088,3 37.506,4 35.513,5 54,6 57,7 60.637,8 459.01,9 23,10 8.5,11 40.7,12 42.6,13 1.012,14 1.123,15 0.695,16 4.87}
{0 CHEMBL240697,1 3,2 0.058,3 33.938,4 31.853,5 48,6 52,7 53.302,8 376.91,9 21,10 7.852,11 47.9,12 43.8,13 0.994,14 1.11,15 0.707,16 7.499}
{0 CHEMBL240913,1 3,2 0.058,3 33.017,4 31.409,5 48,6 52,7 53.698,8 360.46,9 21,10 7.51,11 47.9,12 43.8,13 0.997,14 1.119,15 0.688,16 8.035}
{0 CHEMBL241567,1 5,2 0.072,3 44.546,4 41.598,5 65,6 69,7 72.8,8 512.12,9 30,10 7.879,11 41.5,12 46.2,13 1.001,14 1.12,15 0.685,16 4.924}
{0 CHEMBL241774,1 8,2 0.131,3 38.79,4 36.093,5 59,6 61,7 66.883,8 453.06,9 29,10 7.679,11 35.6,12 49.2,13 1.005,14 1.134,15 0.657,16 5.074}
{0 CHEMBL246952,1 1,2 0.02,3 30.597,4 28.058,5 47,6 51,7 52.69,8 295.46,9 25,10 6.286,11 42.6,12 53.2,13 0.979,14 1.121,15 0.651,16 5}
{0 CHEMBL248135,1 4,2 0.08,3 31.705,4 28.981,5 49,6 50,7 55.318,8 334.53,9 26,10 6.827,11 36.7,12 53.1,13 0.991,14 1.129,15 0.647,16 5.301}
{0 CHEMBL272203,1 4,2 0.075,3 34.807,4 32.723,5 50,6 53,7 56.243,8 417.37,9 22,10 8.347,11 42,12 44,13 1.004,14 1.125,15 0.696,16 9}
{0 CHEMBL309042,1 15,2 0.238,3 38.864,4 35.129,5 64,6 63,7 72.936,8 363.62,9 38,10 5.682,11 35.9,12 59.4,13 0.98,14 1.14,15 0.607,16 7.824}
{0 CHEMBL320106,1 18,2 0.277,3 40.483,4 36.362,5 66,6 65,7 74.935,8 397.69,9 39,10 6.026,11 33.3,12 59.1,13 0.984,14 1.135,15 0.613,16 4}
{0 CHEMBL331420,1 17,2 0.236,3 44.148,4 39.709,5 73,6 72,7 83.182,8 405.71,9 44,10 5.558,11 35.6,12 60.3,13 0.978,14 1.139,15 0.605,16 8.319}
{0 CHEMBL332064,1 17,2 0.236,3 44.148,4 39.709,5 73,6 72,7 83.182,8 405.71,9 44,10 5.558,11 35.6,12 60.3,13 0.978,14 1.139,15 0.605,16 8.481}
{0 CHEMBL333149,1 13,2 0.26,3 30.472,4 26.692,5 51,6 50,7 58.541,8 294.44,9 32,10 5.773,11 29.4,12 62.7,13 0.984,14 1.148,15 0.597,16 8.722}
{0 CHEMBL333514,1 18,2 0.247,3 44.665,4 40.041,5 74,6 73,7 84.052,8 403.72,9 45,10 5.456,11 35.1,12 60.8,13 0.976,14 1.136,15 0.604,16 7.565}
{0 CHEMBL364266,1 4,2 0.077,3 35.5,4 31.869,5 49,6 52,7 54.494,8 458.37,9 23,10 9.354,11 44.9,12 46.9,13 0.986,14 1.112,15 0.724,16 8.886}
{0 CHEMBL371214,1 3,2 0.053,3 34.637,4 31.144,5 55,6 57,7 61.853,8 312.54,9 32,10 5.683,11 40,12 58.2,13 0.972,14 1.125,15 0.63,16 6.339}
{0 CHEMBL374889,1 4,2 0.075,3 36.284,4 34.67,5 49,6 53,7 54.412,8 449.36,9 18,10 9.171,11 49,12 36.7,13 1.009,14 1.11,15 0.74,16 5.643}
{0 CHEMBL381689,1 5,2 0.069,3 45.512,4 42.035,5 68,6 72,7 76.292,8 476.11,9 34,10 7.002,11 42.6,12 50,13 0.987,14 1.122,15 0.669,16 7.155}
{0 CHEMBL384595,1 4,2 0.071,3 35.302,4 33.289,5 53,6 56,7 59.481,8 375.51,9 25,10 7.085,11 43.4,12 47.2,13 0.994,14 1.122,15 0.666,16 6.896}
{0 CHEMBL385057,1 4,2 0.067,3 36.762,4 34.726,5 57,6 60,7 64.651,8 397.54,9 28,10 6.974,11 40.4,12 49.1,13 0.999,14 1.134,15 0.645,16 6}
{0 CHEMBL385151,1 4,2 0.075,3 37.142,4 35.497,5 49,6 53,7 54.356,8 483.8,9 17,10 9.873,11 49,12 34.7,13 1.016,14 1.109,15 0.758,16 5}
{0 CHEMBL385268,1 3,2 0.059,3 35.279,4 33.648,5 47,6 51,7 51.914,8 434.34,9 17,10 9.241,11 51.1,12 36.2,13 1.007,14 1.105,15 0.751,16 5.618}
{0 CHEMBL385508,1 5,2 0.085,3 35.523,4 33.552,5 56,6 59,7 63.604,8 384.53,9 28,10 6.867,11 37.5,12 50,13 1,14 1.136,15 0.634,16 6}
{0 CHEMBL385808,1 4,2 0.074,3 34.296,4 32.267,5 51,6 54,7 56.983,8 360.49,9 24,10 7.068,11 45.1,12 47.1,13 0.992,14 1.117,15 0.672,16 6}
{0 CHEMBL386014,1 3,2 0.053,3 38.421,4 36.056,5 53,6 57,7 59.104,8 474.84,9 22,10 8.959,11 45.3,12 41.5,13 1.006,14 1.115,15 0.725,16 6.079}
{0 CHEMBL386489,1 4,2 0.075,3 33.478,4 32.145,5 50,6 53,7 56.405,8 379.47,9 22,10 7.589,11 44,12 44,13 1.006,14 1.128,15 0.67,16 6.416}
{0 CHEMBL386644,1 3,2 0.054,3 37.665,4 35.551,5 52,6 56,7 58.187,8 475.83,9 21,10 9.151,11 44.2,12 40.4,13 1.01,14 1.119,15 0.724,16 6.038}
{0 CHEMBL386725,1 4,2 0.075,3 34.398,4 32.589,5 50,6 53,7 56.01,8 395.92,9 22,10 7.918,11 44,12 44,13 1.002,14 1.12,15 0.688,16 6.334}
{0 CHEMBL386832,1 4,2 0.073,3 37.722,4 34.847,5 52,6 55,7 57.811,8 445.84,9 23,10 8.574,11 46.2,12 44.2,13 0.996,14 1.112,15 0.725,16 7.951}
{0 CHEMBL386858,1 3,2 0.059,3 36.994,4 35.303,5 47,6 51,7 51.802,8 503.22,9 15,10 10.707,11 51.1,12 31.9,13 1.021,14 1.102,15 0.787,16 5.581}
{0 CHEMBL387001,1 4,2 0.068,3 37,4 35.199,5 56,6 59,7 63.236,8 407.53,9 26,10 7.277,11 42.9,12 46.4,13 1.001,14 1.129,15 0.661,16 8.367}
{0 CHEMBL387112,1 4,2 0.069,3 40.114,4 38.244,5 54,6 58,7 59.898,8 512.84,9 20,10 9.497,11 48.1,12 37,13 1.014,14 1.109,15 0.743,16 10.886}
{0 CHEMBL389203,1 3,2 0.054,3 37.665,4 35.551,5 52,6 56,7 58.187,8 475.83,9 21,10 9.151,11 44.2,12 40.4,13 1.01,14 1.119,15 0.724,16 7.83}
{0 CHEMBL389669,1 3,2 0.051,3 38.568,4 36.25,5 55,6 59,7 61.658,8 455.42,9 24,10 8.28,11 43.6,12 43.6,13 1.002,14 1.121,15 0.701,16 6.775}
{0 CHEMBL389693,1 3,2 0.056,3 39.614,4 37.658,5 50,6 54,7 55.161,8 551.69,9 16,10 11.034,11 50,12 32,13 1.024,14 1.103,15 0.792,16 7.588}
{0 CHEMBL391430,1 3,2 0.056,3 34.699,4 32.38,5 50,6 54,7 55.717,8 378.93,9 23,10 7.579,11 46,12 46,13 0.991,14 1.114,15 0.694,16 7.069}
{0 CHEMBL391839,1 4,2 0.067,3 38.523,4 35.764,5 57,6 60,7 64.365,8 495.49,9 27,10 8.693,11 36.8,12 47.4,13 1.005,14 1.129,15 0.676,16 4.416}
{0 CHEMBL393324,1 5,2 0.096,3 35.977,4 34.438,5 49,6 52,7 54.309,8 451.96,9 18,10 9.224,11 46.9,12 36.7,13 1.015,14 1.108,15 0.734,16 5.242}
{0 CHEMBL409150,1 5,2 0.089,3 37.682,4 36.49,5 53,6 56,7 59.922,8 489.38,9 20,10 9.234,11 45.3,12 37.7,13 1.023,14 1.131,15 0.711,16 7.222}
{0 CHEMBL410727,1 5,2 0.089,3 39.523,4 37.378,5 53,6 56,7 59.131,8 522.28,9 20,10 9.854,11 45.3,12 37.7,13 1.016,14 1.116,15 0.746,16 7.602}
{0 CHEMBL414366,1 3,2 0.056,3 37.04,4 35.175,5 50,6 54,7 55.329,8 448.37,9 19,10 8.967,11 50,12 38,13 1.005,14 1.107,15 0.741,16 5.301}
{0 CHEMBL443842,1 3,2 0.055,3 36.853,4 32.453,5 53,6 55,7 59.154,8 392.71,9 28,10 7.41,11 37.7,12 52.8,13 0.98,14 1.116,15 0.695,16 7.097}
{0 CHEMBL444970,1 6,2 0.207,3 21.409,4 19.974,5 29,6 29,7 32.798,8 334.53,9 11,10 11.536,11 31,12 37.9,13 1.053,14 1.131,15 0.738,16 8.262}
{0 CHEMBL462582,1 15,2 0.25,3 37.995,4 34.045,5 60,6 60,7 67.909,8 379.53,9 34,10 6.325,11 35,12 56.7,13 0.985,14 1.132,15 0.633,16 8.398}
{0 CHEMBL462609,1 20,2 0.294,3 41.04,4 35.853,5 69,6 68,7 79.032,8 378.62,9 44,10 5.487,11 30.4,12 63.8,13 0.978,14 1.145,15 0.595,16 7.699}
{0 CHEMBL462610,1 15,2 0.259,3 38.568,4 34.528,5 58,6 58,7 65.741,8 458.83,9 31,10 7.911,11 32.8,12 53.4,13 1.001,14 1.133,15 0.665,16 7.854}
{0 CHEMBL463656,1 6,2 0.107,3 35.091,4 33.068,5 52,6 56,7 58.355,8 372.51,9 24,10 7.164,11 44.2,12 46.2,13 0.992,14 1.122,15 0.675,16 7.2}
{0 CHEMBL464679,1 4,2 0.073,3 33.33,4 30.332,5 53,6 55,7 59.647,8 314.51,9 30,10 5.934,11 39.6,12 56.6,13 0.979,14 1.125,15 0.629,16 8.74}
{0 CHEMBL465,1 4,2 0.073,3 33.33,4 30.332,5 53,6 55,7 59.647,8 314.51,9 30,10 5.934,11 39.6,12 56.6,13 0.979,14 1.125,15 0.629,16 7.393}
{0 CHEMBL475904,1 15,2 0.238,3 38.62,4 34.933,5 63,6 63,7 71.391,8 359.61,9 37,10 5.708,11 36.5,12 58.7,13 0.979,14 1.133,15 0.613,16 6.108}
{0 CHEMBL482356,1 2,2 0.038,3 35.995,4 32.754,5 50,6 53,7 55.557,8 419.05,9 23,10 8.381,11 42,12 46,13 0.995,14 1.111,15 0.72,16 9.155}
{0 CHEMBL485369,1 15,2 0.238,3 38.62,4 34.933,5 63,6 63,7 71.391,8 359.61,9 37,10 5.708,11 36.5,12 58.7,13 0.979,14 1.133,15 0.613,16 5.593}
{0 CHEMBL494211,1 6,2 0.102,3 36.853,4 34.595,5 55,6 59,7 61.77,8 386.54,9 26,10 7.028,11 43.6,12 47.3,13 0.99,14 1.123,15 0.67,16 5.6}
{0 CHEMBL499569,1 7,2 0.25,3 17.347,4 15.741,5 29,6 28,7 33.415,8 196.32,9 17,10 6.77,11 27.6,12 58.6,13 1.007,14 1.152,15 0.598,16 5.886}
{0 CHEMBL512224,1 16,2 0.25,3 39.665,4 36.001,5 64,6 64,7 72.743,8 413.55,9 36,10 6.462,11 32.8,12 56.3,13 0.994,14 1.137,15 0.62,16 7.921}
{0 CHEMBL514909,1 5,2 0.093,3 33.784,4 32.256,5 50,6 54,7 56.149,8 374.48,9 22,10 7.49,11 44,12 44,13 1,14 1.123,15 0.676,16 6.47}
{0 CHEMBL517157,1 6,2 0.105,3 35.546,4 33.783,5 53,6 57,7 59.564,8 388.51,9 24,10 7.33,11 43.4,12 45.3,13 0.998,14 1.124,15 0.671,16 7}
{0 CHEMBL541216,1 3,2 0.051,3 39.426,4 37.078,5 55,6 59,7 61.602,8 489.86,9 23,10 8.907,11 43.6,12 41.8,13 1.008,14 1.12,15 0.717,16 8.007}
{0 CHEMBL559612,1 10,2 0.147,3 40.591,4 36.68,5 67,6 68,7 75.932,8 376.64,9 40,10 5.621,11 35.8,12 59.7,13 0.98,14 1.133,15 0.606,16 7.377}
{0 CHEMBL97038,1 11,2 0.275,3 24.392,4 21.848,5 41,6 40,7 47.076,8 252.44,9 25,10 6.157,11 29.3,12 61,13 0.993,14 1.148,15 0.595,16 8.161}
