{
  "data_set_description": {
    "collection_date": "November 2013",
    "creator": "Dr Jeremy Besnard, Dr Ivan Olier, Dr Noureddin Sadawi, Dr Larisa Soldatova, Dr Crina Grosan, Prof Ross King, Dr Richard Bickerton, Prof Andrew Hopkins and Dr Willem van Hoorn",
    "default_target_attribute": "pXC50",
    "description": "This dataset contains QSAR data (from ChEMBL version 17) showing activity values (unit is pseudo-pCI50) of several compounds on drug target ChEMBL_ID: CHEMBL4505 (TID: 12978), and it has 23 rows and 1123 features (not including molecule IDs and class feature: molecule_id and pXC50). The features represent Molecular Descriptors which were generated from SMILES strings. Missing value imputation was applied to this dataset (By choosing the Median).",
    "description_version": "1",
    "file_id": "3233602",
    "format": "ARFF",
    "id": "23817",
    "licence": "Public",
    "md5_checksum": "523ebaab5ec3bcb32ab3f667da233192",
    "minio_url": "https://data.openml.org/datasets/0002/23817/dataset_23817.pq",
    "name": "QSAR-DATASET-FOR-DRUG-TARGET-CHEMBL4505",
    "original_data_url": "https://www.ebi.ac.uk/chembl/target/inspect/CHEMBL4505",
    "parquet_url": "https://data.openml.org/datasets/0002/23817/dataset_23817.pq",
    "processing_date": "2018-10-03 22:27:05",
    "row_id_attribute": "molecule_id",
    "status": "deactivated",
    "tag": [
      "MetaQSAR",
      "study_13"
    ],
    "upload_date": "2016-07-14T13:17:34",
    "url": "https://api.openml.org/data/v1/download/3233602/QSAR-DATASET-FOR-DRUG-TARGET-CHEMBL4505.arff",
    "version": "7",
    "visibility": "public"
  }
}