"molecule_id","AMW","C.","H.","Me","Mi","Mp","Mv","MW","N.","pXC50"
{1 7.901,2 41.7,3 44.4,4 0.994,5 1.122,6 0.701,7 0.651,8 284.42,9 11.1,10 4.745}
{0 CHEMBL1078675,1 8.241,2 45.9,3 42.6,4 0.999,5 1.106,6 0.718,7 0.67,8 502.7,9 3.3,10 6.495}
{0 CHEMBL1078778,1 8.395,2 45,3 41.7,4 1.003,5 1.109,6 0.718,7 0.673,8 503.69,9 5,10 7.523}
{0 CHEMBL1078779,1 8.554,2 44.1,3 40.7,4 1.006,5 1.112,6 0.717,7 0.676,8 504.68,9 6.8,10 5.321}
{0 CHEMBL1078855,1 8.148,2 46.6,3 41.4,4 1.005,5 1.109,6 0.704,7 0.67,8 472.6,9 3.4,10 4.886}
{0 CHEMBL1078981,1 8.309,2 45.6,3 40.4,4 1.009,5 1.112,6 0.703,7 0.673,8 473.59,9 5.3,10 4.79}
{0 CHEMBL1079067,1 8.309,2 45.6,3 40.4,4 1.009,5 1.112,6 0.703,7 0.673,8 473.59,9 5.3,10 8}
{0 CHEMBL1079068,1 8.309,2 45.6,3 40.4,4 1.009,5 1.112,6 0.703,7 0.673,8 473.59,9 5.3,10 5.131}
{0 CHEMBL1079105,1 7.859,2 44.3,3 45.7,4 0.999,5 1.112,6 0.693,7 0.647,8 550.16,9 1.4,10 4.252}
{0 CHEMBL1079162,1 7.859,2 44.3,3 45.7,4 0.999,5 1.112,6 0.693,7 0.647,8 550.16,9 1.4,10 6.097}
{0 CHEMBL108035,1 7.924,2 44.1,3 44.1,4 0.991,5 1.115,6 0.713,7 0.659,8 269.4,9 8.8,10 5.959}
{0 CHEMBL108077,1 11.664,2 38.5,3 42.3,4 1,5 1.106,6 0.787,7 0.695,8 303.27,9 7.7,10 4.699}
{0 CHEMBL108101,1 8.569,2 33.3,3 44.4,4 1.005,5 1.136,6 0.698,7 0.643,8 308.48,9 16.7,10 6.481}
{0 CHEMBL1086193,1 7.096,2 33,3 49.6,4 1.015,5 1.146,6 0.612,7 0.589,8 816.04,9 7.8,10 5.569}
{0 CHEMBL1086429,1 7.017,2 35.5,3 49.6,4 1.009,5 1.139,6 0.623,7 0.595,8 849.11,9 6.6,10 6.699}
{0 CHEMBL1086431,1 7.273,2 33.6,3 48.2,4 1.018,5 1.145,6 0.616,7 0.597,8 799.99,9 8.2,10 6.398}
{0 CHEMBL1086432,1 7.138,2 33.6,3 49.1,4 1.015,5 1.144,6 0.615,7 0.592,8 828.05,9 7.8,10 7.097}
{0 CHEMBL1086433,1 7.076,2 33.6,3 49.6,4 1.014,5 1.144,6 0.614,7 0.59,8 842.08,9 7.6,10 7.097}
{0 CHEMBL1086434,1 7.204,2 33.6,3 48.7,4 1.016,5 1.145,6 0.616,7 0.594,8 814.02,9 8,10 6.523}
{0 CHEMBL1086435,1 6.964,2 33.3,3 50.5,4 1.012,5 1.145,6 0.611,7 0.585,8 773.01,9 7.2,10 6}
{0 CHEMBL1086436,1 6.904,2 33.3,3 50.9,4 1.01,5 1.144,6 0.611,7 0.583,8 787.04,9 7,10 5.886}
{0 CHEMBL1086437,1 7.034,2 33.1,3 50,4 1.014,5 1.145,6 0.611,7 0.587,8 830.07,9 7.6,10 5.745}
{0 CHEMBL108700,1 9.198,2 37.8,3 48.6,4 0.991,5 1.124,6 0.706,7 0.635,8 340.32,9 8.1,10 5.398}
{0 CHEMBL108865,1 8.154,2 42.9,3 42.9,4 1,5 1.118,6 0.705,7 0.661,8 285.4,9 8.6,10 6.26}
{0 CHEMBL1089963,1 7.573,2 46.2,3 43.6,4 1.004,5 1.114,6 0.678,7 0.651,8 590.72,9 2.6,10 6.469}
{0 CHEMBL1090038,1 7.701,2 44.6,3 43.1,4 1.01,5 1.118,6 0.671,7 0.649,8 500.59,9 3.1,10 6.824}
{0 CHEMBL1090281,1 7.115,2 43.2,3 47.4,4 0.998,5 1.121,6 0.66,7 0.625,8 675.89,9 3.2,10 6.328}
{0 CHEMBL1090282,1 7.115,2 43.2,3 47.4,4 0.998,5 1.121,6 0.66,7 0.625,8 675.89,9 3.2,10 6.854}
{0 CHEMBL1090646,1 6.713,2 34.7,3 52,4 1.005,5 1.14,6 0.614,7 0.581,8 657.9,9 5.1,10 5.237}
{0 CHEMBL1090700,1 6.958,2 42.3,3 48.7,4 0.997,5 1.122,6 0.654,7 0.617,8 542.73,9 2.6,10 5.406}
{0 CHEMBL1090971,1 7.622,2 42.7,3 44,4 1.011,5 1.123,6 0.662,7 0.64,8 571.68,9 4,10 5.854}
{0 CHEMBL1092456,1 7.446,2 43.7,3 45.1,4 1.006,5 1.119,6 0.664,7 0.637,8 528.65,9 2.8,10 5.854}
{0 CHEMBL1092752,1 7.48,2 43.1,3 45.1,4 1.009,5 1.12,6 0.66,7 0.635,8 381.46,9 2,10 5.119}
{0 CHEMBL109619,1 9.12,2 36.1,3 50,4 0.991,5 1.127,6 0.697,7 0.625,8 328.31,9 8.3,10 5.745}
{0 CHEMBL109893,1 8.154,2 42.9,3 42.9,4 1,5 1.118,6 0.705,7 0.661,8 285.4,9 8.6,10 5.097}
{0 CHEMBL111632,1 7.901,2 41.7,3 44.4,4 0.994,5 1.122,6 0.701,7 0.651,8 284.42,9 11.1,10 6.097}
{0 CHEMBL1171633,1 10.168,2 43.7,3 35.2,4 1.042,5 1.133,6 0.7,7 0.693,8 721.95,9 5.6,10 6.328}
{0 CHEMBL1171635,1 7.926,2 43.1,3 41.7,4 1.016,5 1.123,6 0.668,7 0.652,8 570.65,9 5.6,10 5.367}
{0 CHEMBL1171636,1 7.982,2 45.9,3 40.5,4 1.012,5 1.117,6 0.684,7 0.665,8 590.68,9 5.4,10 6.032}
{0 CHEMBL1171802,1 7.302,2 41.5,3 46.3,4 1.005,5 1.126,6 0.655,7 0.626,8 598.76,9 4.9,10 8.585}
{0 CHEMBL1171803,1 8.424,2 42.2,3 41,4 1.027,5 1.136,6 0.667,7 0.654,8 699.18,9 4.8,10 6.06}
{0 CHEMBL1171804,1 9.542,2 43.7,3 35.2,4 1.043,5 1.135,6 0.693,7 0.691,8 677.5,9 5.6,10 7.06}
{0 CHEMBL1171866,1 8.855,2 42,3 39.5,4 1.03,5 1.133,6 0.682,7 0.666,8 717.22,9 4.9,10 6.155}
{0 CHEMBL1171868,1 8.965,2 45.1,3 36.6,4 1.034,5 1.13,6 0.687,7 0.683,8 735.16,9 4.9,10 6.097}
{0 CHEMBL1224166,1 7.232,2 26.1,3 60.9,4 0.985,5 1.129,6 0.656,7 0.556,8 166.34,10 5.353}
{0 CHEMBL1224167,1 8.465,2 45.2,3 45.2,4 0.989,5 1.095,6 0.745,7 0.67,8 262.42,10 5.636}
{0 CHEMBL1224168,1 6.703,2 27.6,3 62.1,4 0.98,5 1.131,6 0.641,7 0.546,8 194.4,10 4}
{0 CHEMBL1224169,1 6.662,2 32.4,3 59.5,4 0.978,5 1.125,6 0.652,7 0.564,8 246.48,10 4}
{0 CHEMBL1224170,1 6.356,2 28.6,3 62.9,4 0.977,5 1.132,6 0.632,7 0.54,8 222.46,10 6.444}
{0 CHEMBL1224171,1 6.11,2 29.3,3 63.4,4 0.975,5 1.133,6 0.626,7 0.535,8 250.52,10 6}
{0 CHEMBL1224242,1 7.614,2 36.7,3 53.3,4 0.985,5 1.112,6 0.695,7 0.61,8 228.41,10 4}
{0 CHEMBL181504,1 9.22,2 36.4,3 45.5,4 1.006,5 1.128,6 0.718,7 0.654,8 304.27,9 9.1,10 7.222}
{0 CHEMBL181752,1 10.008,2 45.7,3 37.1,4 1.009,5 1.108,6 0.77,7 0.716,8 350.29,9 8.6,10 7.42}
{0 CHEMBL181902,1 8.927,2 37.8,3 45.9,4 1.003,5 1.125,6 0.715,7 0.652,8 330.31,9 8.1,10 5.959}
{0 CHEMBL182790,1 10.122,2 42.9,3 37.1,4 1.019,5 1.114,6 0.754,7 0.708,8 354.28,9 8.6,10 7.155}
{0 CHEMBL182795,1 9.949,2 44.1,3 38.2,4 1.01,5 1.112,6 0.763,7 0.708,8 338.28,9 8.8,10 7.42}
{0 CHEMBL183005,1 9.522,2 43.2,3 40.5,4 1.006,5 1.114,6 0.749,7 0.692,8 352.31,9 8.1,10 7.046}
{0 CHEMBL183396,1 9.587,2 44.7,3 39.5,4 1.006,5 1.111,6 0.756,7 0.7,8 364.32,9 7.9,10 7.222}
{0 CHEMBL183767,1 9.949,2 44.1,3 38.2,4 1.01,5 1.112,6 0.763,7 0.708,8 338.28,9 8.8,10 7.097}
{0 CHEMBL184629,1 7.338,2 39.2,3 46.8,4 1.012,5 1.129,6 0.64,7 0.617,8 579.71,9 3.8,10 5.959}
{0 CHEMBL205707,1 7.619,2 35.6,3 45.8,4 1.026,5 1.138,6 0.624,7 0.612,8 449.51,9 5.1,10 7}
{0 CHEMBL206415,1 7.118,2 32.4,3 51.4,4 1.011,5 1.141,6 0.619,7 0.584,8 526.73,9 5.4,10 6.222}
{0 CHEMBL206922,1 7.619,2 35.6,3 45.8,4 1.026,5 1.138,6 0.624,7 0.612,8 449.51,9 5.1,10 6.097}
{0 CHEMBL207070,1 6.645,2 32.5,3 53.2,4 1.009,5 1.144,6 0.599,7 0.569,8 511.69,9 3.9,10 6}
{0 CHEMBL207092,1 6.645,2 32.5,3 53.2,4 1.009,5 1.144,6 0.599,7 0.569,8 511.69,9 3.9,10 5.721}
{0 CHEMBL207526,1 6.645,2 32.5,3 53.2,4 1.009,5 1.144,6 0.599,7 0.569,8 511.69,9 3.9,10 6}
{0 CHEMBL207797,1 6.725,2 32.4,3 52.7,4 1.011,5 1.144,6 0.599,7 0.571,8 497.66,9 4.1,10 5.509}
{0 CHEMBL207838,1 6.812,2 32.4,3 52.1,4 1.013,5 1.144,6 0.6,7 0.574,8 483.63,9 4.2,10 5.509}
{0 CHEMBL208129,1 7.15,2 38.8,3 48.2,4 1.008,5 1.13,6 0.637,7 0.609,8 607.77,9 3.5,10 6.097}
{0 CHEMBL208156,1 6.906,2 32.4,3 51.5,4 1.016,5 1.144,6 0.601,7 0.577,8 469.6,9 4.4,10 6.484}
{0 CHEMBL208263,1 7.338,2 39.2,3 46.8,4 1.012,5 1.129,6 0.64,7 0.617,8 579.71,9 3.8,10 5.959}
{0 CHEMBL208297,1 6.987,2 38.5,3 49.5,4 1.005,5 1.131,6 0.633,7 0.603,8 635.83,9 3.3,10 6.155}
{0 CHEMBL208418,1 6.645,2 32.5,3 53.2,4 1.009,5 1.144,6 0.599,7 0.569,8 511.69,9 3.9,10 5.721}
{0 CHEMBL249814,1 7.449,2 42.7,3 45.3,4 1.008,5 1.121,6 0.658,7 0.633,8 558.68,9 2.7,10 8.456}
{0 CHEMBL249815,1 7.449,2 42.7,3 45.3,4 1.008,5 1.121,6 0.658,7 0.633,8 558.68,9 2.7,10 7.523}
{0 CHEMBL313679,1 10.601,2 37,3 44.4,4 1.001,5 1.123,6 0.734,7 0.663,8 286.22,9 11.1,10 6.638}
{0 CHEMBL323975,1 7.924,2 44.1,3 44.1,4 0.991,5 1.115,6 0.713,7 0.659,8 269.4,9 8.8,10 7.046}
{0 CHEMBL326220,1 9.111,2 35.9,3 48.7,4 0.994,5 1.13,6 0.695,7 0.629,8 355.34,9 10.3,10 5.398}
{0 CHEMBL359965,1 8.542,2 31.6,3 52.6,4 0.995,5 1.112,6 0.714,7 0.617,8 162.3,10 5.275}
{0 CHEMBL367811,1 9.22,2 36.4,3 45.5,4 1.006,5 1.128,6 0.718,7 0.654,8 304.27,9 9.1,10 5.478}
{0 CHEMBL377234,1 7.619,2 35.6,3 45.8,4 1.026,5 1.138,6 0.624,7 0.612,8 449.51,9 5.1,10 5.301}
{0 CHEMBL377650,1 6.645,2 32.5,3 53.2,4 1.009,5 1.144,6 0.599,7 0.569,8 511.69,9 3.9,10 5.854}
{0 CHEMBL377676,1 7.338,2 39.2,3 46.8,4 1.012,5 1.129,6 0.64,7 0.617,8 579.71,9 3.8,10 6.155}
{0 CHEMBL377682,1 6.812,2 32.4,3 52.1,4 1.013,5 1.144,6 0.6,7 0.574,8 483.63,9 4.2,10 5.509}
{0 CHEMBL377947,1 7.409,2 41.2,3 45.9,4 1.01,5 1.125,6 0.651,7 0.627,8 629.77,9 3.5,10 5.721}
{0 CHEMBL378288,1 7.066,2 38.6,3 48.9,4 1.007,5 1.13,6 0.635,7 0.606,8 621.8,9 3.4,10 5.638}
{0 CHEMBL378902,1 7.066,2 38.6,3 48.9,4 1.007,5 1.13,6 0.635,7 0.606,8 621.8,9 3.4,10 5.553}
{0 CHEMBL379355,1 6.987,2 38.5,3 49.5,4 1.005,5 1.131,6 0.633,7 0.603,8 635.83,9 3.3,10 6.222}
{0 CHEMBL379406,1 6.987,2 38.5,3 49.5,4 1.005,5 1.131,6 0.633,7 0.603,8 635.83,9 3.3,10 6.222}
{0 CHEMBL379509,1 7.409,2 41.2,3 45.9,4 1.01,5 1.125,6 0.651,7 0.627,8 629.77,9 3.5,10 5.921}
{0 CHEMBL379571,1 6.987,2 38.5,3 49.5,4 1.005,5 1.131,6 0.633,7 0.603,8 635.83,9 3.3,10 6.155}
{0 CHEMBL379649,1 7.619,2 35.6,3 45.8,4 1.026,5 1.138,6 0.624,7 0.612,8 449.51,9 5.1,10 6.301}
{0 CHEMBL379944,1 7.443,2 39.5,3 46.1,4 1.014,5 1.129,6 0.643,7 0.621,8 565.68,9 3.9,10 5.509}
{0 CHEMBL380076,1 7.066,2 38.6,3 48.9,4 1.007,5 1.13,6 0.635,7 0.606,8 621.8,9 3.4,10 5.921}
{0 CHEMBL380077,1 7.409,2 41.2,3 45.9,4 1.01,5 1.125,6 0.651,7 0.627,8 629.77,9 3.5,10 5.409}
{0 CHEMBL380337,1 7.443,2 39.5,3 46.1,4 1.014,5 1.129,6 0.643,7 0.621,8 565.68,9 3.9,10 5.796}
{0 CHEMBL382388,1 7.066,2 38.6,3 48.9,4 1.007,5 1.13,6 0.635,7 0.606,8 621.8,9 3.4,10 5.959}
{0 CHEMBL382431,1 7.708,2 32,3 46,4 1.035,5 1.146,6 0.605,7 0.601,8 385.42,9 6,10 6.046}
{0 CHEMBL382910,1 6.906,2 32.4,3 51.5,4 1.016,5 1.144,6 0.601,7 0.577,8 469.6,9 4.4,10 5.796}
{0 CHEMBL383647,1 7.066,2 38.6,3 48.9,4 1.007,5 1.13,6 0.635,7 0.606,8 621.8,9 3.4,10 6.301}
{0 CHEMBL416771,1 8.447,2 34.8,3 43.5,4 1.006,5 1.137,6 0.694,7 0.646,8 194.29,9 17.4,10 4.699}
{0 CHEMBL439510,1 7.15,2 38.8,3 48.2,4 1.008,5 1.13,6 0.637,7 0.609,8 607.77,9 3.5,10 6.097}
{0 CHEMBL441354,1 6.645,2 32.5,3 53.2,4 1.009,5 1.144,6 0.599,7 0.569,8 511.69,9 3.9,10 5.481}
{0 CHEMBL452863,1 7.11,2 38.6,3 50,4 0.998,5 1.127,6 0.652,7 0.608,8 497.72,9 4.3,10 5}
{0 CHEMBL454688,1 7.01,2 38.4,3 50.7,4 0.996,5 1.128,6 0.65,7 0.604,8 511.75,9 4.1,10 5.222}
{0 CHEMBL495016,1 9.252,2 44.9,3 36.7,4 1.016,5 1.122,6 0.725,7 0.698,8 453.36,9 12.2,10 5.959}
{0 CHEMBL495017,1 9.252,2 44.9,3 36.7,4 1.016,5 1.122,6 0.725,7 0.698,8 453.36,9 12.2,10 6.046}
{0 CHEMBL495803,1 7.501,2 42.1,3 43.9,4 1,5 1.13,6 0.673,7 0.642,8 427.56,9 12.3,10 6.046}
{0 CHEMBL496404,1 8.046,2 43.6,3 40,4 1.012,5 1.126,6 0.682,7 0.663,8 442.52,9 10.9,10 6.301}
{0 CHEMBL497018,1 7.746,2 45.3,3 41.5,4 1,5 1.123,6 0.69,7 0.661,8 410.52,9 11.3,10 5.824}
{0 CHEMBL497019,1 7.746,2 45.3,3 41.5,4 1,5 1.123,6 0.69,7 0.661,8 410.52,9 11.3,10 5.745}
{0 CHEMBL497234,1 7.901,2 47.3,3 40,4 1,5 1.119,6 0.701,7 0.674,8 434.54,9 10.9,10 6.155}
{0 CHEMBL497235,1 8.14,2 43.5,3 39.1,4 1.012,5 1.128,6 0.685,7 0.668,8 374.44,9 13,10 6.509}
{0 CHEMBL497237,1 8.489,2 43.5,3 39.1,4 1.007,5 1.122,6 0.711,7 0.678,8 390.51,9 13,10 6.62}
{0 CHEMBL497435,1 8.14,2 43.5,3 39.1,4 1.012,5 1.128,6 0.685,7 0.668,8 374.44,9 13,10 7.523}
{0 CHEMBL497620,1 8.838,2 42.4,3 42.4,4 1.006,5 1.125,6 0.693,7 0.658,8 521.46,9 10.2,10 5.824}
{0 CHEMBL501901,1 9.057,2 43.7,3 36.6,4 1.038,5 1.135,6 0.681,7 0.679,8 643.06,9 5.6,10 6.092}
{0 CHEMBL521904,1 7.664,2 44.2,3 42.3,4 1,5 1.125,6 0.684,7 0.655,8 398.51,9 11.5,10 4.301}
{0 CHEMBL523733,1 8.549,2 44.9,3 38.8,4 1.009,5 1.123,6 0.708,7 0.681,8 418.92,9 12.2,10 5.854}
{0 CHEMBL524075,1 7.821,2 43.4,3 41.5,4 1.006,5 1.127,6 0.68,7 0.656,8 414.51,9 11.3,10 6.097}
{0 CHEMBL524619,1 7.847,2 44.9,3 40.8,4 1.003,5 1.125,6 0.69,7 0.664,8 384.48,9 12.2,10 6.155}
{0 CHEMBL524810,1 8.031,2 43.8,3 39.6,4 1.007,5 1.129,6 0.689,7 0.667,8 385.47,9 14.6,10 6.585}
{0 CHEMBL525165,1 8.489,2 43.5,3 39.1,4 1.007,5 1.122,6 0.711,7 0.678,8 390.51,9 13,10 6.097}
{0 CHEMBL565244,1 8.549,2 44.9,3 38.8,4 1.009,5 1.123,6 0.708,7 0.681,8 418.92,9 12.2,10 4.699}
{0 CHEMBL566094,1 8.549,2 44.9,3 38.8,4 1.009,5 1.123,6 0.708,7 0.681,8 418.92,9 12.2,10 5.921}
{0 CHEMBL569173,1 9.682,2 44.9,3 30.6,4 1.055,5 1.159,6 0.684,7 0.703,8 474.43,9 12.2,10 5.284}
{0 CHEMBL569190,1 7.991,2 45.3,3 39.6,4 1.004,5 1.125,6 0.695,7 0.671,8 423.52,9 13.2,10 6.301}
{0 CHEMBL569883,1 7.355,2 43.1,3 44.8,4 0.996,5 1.127,6 0.674,7 0.64,8 426.57,9 10.3,10 4.824}
{0 CHEMBL570364,1 7.885,2 42.9,3 41.1,4 1.008,5 1.129,6 0.679,7 0.657,8 441.54,9 12.5,10 6.398}
{0 CHEMBL571269,1 8.119,2 40,3 40,4 1.018,5 1.137,6 0.668,7 0.655,8 446.52,9 14.5,10 5.398}
{0 CHEMBL571276,1 8.046,2 43.6,3 40,4 1.012,5 1.126,6 0.682,7 0.663,8 442.52,9 10.9,10 5}
{0 CHEMBL571711,1 8.702,2 44.2,3 36.5,4 1.03,5 1.145,6 0.681,7 0.677,8 452.48,9 11.5,10 5.097}
{0 CHEMBL571938,1 8.046,2 43.6,3 40,4 1.012,5 1.126,6 0.682,7 0.663,8 442.52,9 10.9,10 5.921}
{0 CHEMBL574590,1 8.541,2 45.5,3 37.9,4 1.011,5 1.118,6 0.711,7 0.685,8 563.69,9 10.6,10 5.046}
{0 CHEMBL576484,1 7.501,2 43.6,3 43.6,4 0.998,5 1.126,6 0.679,7 0.647,8 412.54,9 10.9,10 4.824}
{0 CHEMBL582971,1 8.541,2 45.5,3 37.9,4 1.011,5 1.118,6 0.711,7 0.685,8 563.69,9 10.6,10 5.699}
{0 CHEMBL584314,1 7.991,2 45.3,3 39.6,4 1.004,5 1.125,6 0.695,7 0.671,8 423.52,9 13.2,10 6.585}
{0 CHEMBL594178,1 8.483,2 47.4,3 36.8,4 1.021,5 1.114,6 0.695,7 0.686,8 322.34,9 5.3,10 4.417}
{0 CHEMBL594179,1 7.893,2 42.3,3 42.3,4 1.019,5 1.123,6 0.661,7 0.646,8 410.46,9 3.8,10 4.712}
{0 CHEMBL594622,1 8.313,2 43.5,3 39.1,4 1.027,5 1.121,6 0.67,7 0.664,8 382.4,9 4.3,10 5.027}
{0 CHEMBL594623,1 8.42,2 46.4,3 37.5,4 1.022,5 1.116,6 0.689,7 0.68,8 471.5,9 5.4,10 4.854}
{0 CHEMBL596265,1 8.647,2 45.5,3 38.2,4 1.018,5 1.113,6 0.705,7 0.683,8 475.56,9 5.5,10 4.728}
{0 CHEMBL596442,1 8.387,2 45.9,3 37.8,4 1.022,5 1.117,6 0.686,7 0.677,8 310.33,9 5.4,10 5.201}
{0 CHEMBL603639,1 7.719,2 48.4,3 41.9,4 1.002,5 1.11,6 0.693,7 0.665,8 478.58,9 3.2,10 5.398}
{0 CHEMBL609013,1 7.952,2 48.6,3 40,4 1.005,5 1.112,6 0.7,7 0.675,8 278.33,9 5.7,10 4.712}
{0 CHEMBL73007,1 9.015,2 36,3 44,4 1,5 1.12,6 0.734,7 0.662,8 225.37,9 12,10 4.699}
{0 CHEMBL88734,1 11.341,2 37.5,3 41.7,4 1.006,5 1.122,6 0.753,7 0.683,8 272.19,9 12.5,10 7.301}
{0 CHEMBL91704,1 7.276,2 40.5,3 48.1,4 0.998,5 1.124,6 0.664,7 0.621,8 574.81,9 5.1,10 8.228}
{0 CHEMBL92099,1 10.23,2 37,3 40.7,4 1.017,5 1.125,6 0.748,7 0.687,8 276.21,9 11.1,10 6.959}
