"molecule_id","AMW","C.","H.","Me","Mi","Mp","Mv","MW","N.","nAB","nAT","nB","nBM","nBO","nBR","nBT","nC","nCL","nCsp","nCsp2","nCsp3","nDB","nF","nH","nHet","nHM","nI","nN","nO","nP","nS","nSK","nTB","nX","O.","RBF","RBN","SCBO","Se","Si","Sp","Sv","X.","pXC50"
{1 6.354,2 34.4,3 54.1,4 0.992,5 1.143,6 0.616,7 0.572,8 387.59,9 8.2,10 11,11 61,13 12,14 29,16 62,17 21,20 10,21 11,22 1,24 33,25 7,28 5,29 2,32 28,35 3.3,36 0.194,37 12,38 35.5,39 60.534,40 69.723,41 37.597,42 34.912,44 6}
{0 CHEMBL104538,1 6.397,2 36.6,3 53.8,4 0.993,5 1.135,6 0.622,7 0.578,8 594.88,9 4.3,10 12,11 93,13 15,14 45,16 95,17 34,20 15,21 19,22 3,24 50,25 9,28 4,29 5,32 43,35 5.4,36 0.158,37 15,38 54,39 92.367,40 105.59,41 57.807,42 53.776,44 6.447}
{0 CHEMBL105459,1 6.831,2 35.6,3 51.1,4 1.006,5 1.138,6 0.618,7 0.587,8 614.82,9 4.4,10 12,11 90,13 16,14 45,16 91,17 32,20 16,21 16,22 4,24 46,25 12,28 4,29 8,32 44,35 8.9,36 0.187,37 17,38 55,39 90.581,40 102.388,41 55.648,42 52.867,44 5.42}
{0 CHEMBL1098668,1 7.256,2 35.6,3 49.4,4 1.008,5 1.139,6 0.633,7 0.601,8 631.25,9 6.9,10 12,11 87,13 17,14 45,16 88,17 31,18 1,20 16,21 15,22 5,24 43,25 13,26 1,28 6,29 6,32 44,34 1,35 6.9,36 0.182,37 16,38 56,39 87.687,40 99.079,41 55.086,42 52.254,43 1.1,44 7.5}
{0 CHEMBL1098669,1 7.066,2 36.4,3 48.9,4 1.007,5 1.139,6 0.63,7 0.601,8 621.82,9 8,10 12,11 88,13 18,14 46,16 89,17 32,19 1,20 16,21 15,22 5,24 43,25 13,28 7,29 6,32 45,33 1,35 6.8,36 0.191,37 17,38 59,39 88.581,40 100.218,41 55.472,42 52.921,44 6.851}
{0 CHEMBL1098670,1 6.976,2 37.1,3 49.4,4 1.004,5 1.136,6 0.632,7 0.6,8 620.83,9 6.7,10 12,11 89,13 18,14 46,16 90,17 33,19 2,20 16,21 15,22 5,24 44,25 12,28 6,29 6,32 45,33 1,35 6.7,36 0.189,37 17,38 59,39 89.363,40 101.135,41 56.228,42 53.426,44 6.478}
{0 CHEMBL1098671,1 7.202,2 41,3 47,4 1.002,5 1.128,6 0.654,7 0.622,8 597.78,9 6,10 18,11 83,13 23,14 46,16 85,17 34,19 2,20 21,21 11,22 4,24 39,25 10,28 5,29 5,32 44,33 1,35 6,36 0.176,37 15,38 61,39 83.167,40 93.597,41 54.245,42 51.637,44 7.658}
{0 CHEMBL111720,1 8.848,2 39.7,3 44.4,4 1.024,5 1.142,6 0.657,7 0.635,8 557.45,9 3.2,10 12,11 63,13 14,14 37,15 1,16 65,17 25,20 14,21 11,22 2,23 3,24 28,25 10,26 1,28 2,29 4,32 35,34 4,35 6.3,36 0.154,37 10,38 45,39 64.534,40 71.923,41 41.415,42 39.979,43 6.3,44 6.638}
{0 CHEMBL112212,1 8.875,2 36.8,3 46.1,4 1.017,5 1.132,6 0.668,7 0.632,8 674.47,9 5.3,10 12,11 76,13 16,14 42,15 1,16 77,17 28,18 2,20 16,21 12,22 4,24 35,25 13,26 3,28 4,29 6,32 41,34 3,35 7.9,36 0.195,37 15,38 52,39 77.269,40 86.038,41 50.762,42 48.01,43 3.9,44 7.041}
{0 CHEMBL112261,1 7.817,2 39.3,3 48.3,4 1.003,5 1.128,6 0.655,7 0.617,8 695.72,9 4.5,10 18,11 89,13 22,14 48,15 1,16 91,17 35,20 22,21 13,22 4,24 43,25 11,26 1,28 4,29 6,32 46,34 1,35 6.7,36 0.187,37 17,38 61,39 89.272,40 100.395,41 58.33,42 54.936,43 1.1,44 6.857}
{0 CHEMBL112468,1 8.155,2 40,3 46.7,4 1.005,5 1.127,6 0.664,7 0.628,8 611.59,9 5.3,10 18,11 75,13 21,14 42,15 1,16 77,17 30,20 20,21 10,22 3,24 35,25 10,26 1,28 4,29 5,32 40,34 1,35 6.7,36 0.182,37 14,38 54,39 75.41,40 84.525,41 49.83,42 47.114,43 1.3,44 7.387}
{0 CHEMBL112598,1 7.755,2 35.2,3 49.5,4 1.009,5 1.138,6 0.635,7 0.601,8 705.73,9 6.6,10 12,11 91,13 17,14 47,15 1,16 92,17 32,20 16,21 16,22 5,24 45,25 14,26 1,28 6,29 7,32 46,34 1,35 7.7,36 0.196,37 18,38 58,39 91.803,40 103.601,41 57.796,42 54.693,43 1.1,44 8.658}
{0 CHEMBL112935,1 8.232,2 35.5,3 48.7,4 1.009,5 1.132,6 0.654,7 0.612,8 625.65,9 5.3,10 11,11 76,13 15,14 40,15 1,16 77,17 27,20 14,21 13,22 4,24 37,25 12,26 2,28 4,29 6,31 1,32 39,34 1,35 7.9,36 0.208,37 16,38 49.5,39 76.698,40 86.07,41 49.694,42 46.542,43 1.3,44 6.458}
{0 CHEMBL113208,1 6.86,2 35.6,3 50.6,4 1.004,5 1.139,6 0.623,7 0.591,8 596.81,9 6.9,10 12,11 87,13 17,14 44,16 88,17 31,20 16,21 15,22 5,24 44,25 12,28 6,29 6,32 43,35 6.9,36 0.182,37 16,38 55,39 87.363,40 99.135,41 54.228,42 51.426,44 9.252}
{0 CHEMBL113331,1 8.678,2 36.8,3 44.7,4 1.028,5 1.147,6 0.643,7 0.625,8 659.56,9 5.3,10 12,11 76,13 16,14 43,15 1,16 77,17 28,20 16,21 12,22 4,23 3,24 34,25 14,26 1,28 4,29 6,32 42,34 4,35 7.9,36 0.195,37 15,38 53,39 78.159,40 87.169,41 48.858,42 47.505,43 5.3,44 8}
{0 CHEMBL113876,1 8.223,2 36.7,3 46.8,4 1.016,5 1.134,6 0.645,7 0.618,8 649.6,9 5.1,10 12,11 79,13 16,14 44,15 1,16 81,17 29,20 16,21 13,22 4,24 37,25 13,26 1,28 4,29 8,32 42,34 1,35 10.1,36 0.185,37 15,38 54,39 80.276,40 89.568,41 50.955,42 48.785,43 1.3,44 6.883}
{0 CHEMBL114278,1 7.805,2 36.5,3 50,4 1.004,5 1.134,6 0.643,7 0.603,8 577.58,9 5.4,10 12,11 74,13 15,14 38,15 1,16 75,17 27,20 14,21 13,22 3,24 37,25 10,26 1,28 4,29 5,32 37,34 1,35 6.8,36 0.2,37 15,38 47,39 74.294,40 83.94,41 47.591,42 44.64,43 1.4,44 7.167}
{0 CHEMBL114634,1 7.897,2 39.5,3 48.1,4 1.002,5 1.128,6 0.659,7 0.619,8 639.65,9 4.9,10 18,11 81,13 21,14 44,15 1,16 83,17 32,20 20,21 12,22 3,24 39,25 10,26 1,28 4,29 5,32 42,34 1,35 6.2,36 0.193,37 16,38 56,39 81.178,40 91.355,41 53.353,42 50.167,43 1.2,44 7.523}
{0 CHEMBL115048,1 6.241,2 36.6,3 54.9,4 0.99,5 1.135,6 0.62,7 0.573,8 511.78,9 3.7,10 11,11 82,13 14,14 38,16 83,17 30,20 13,21 17,22 3,24 45,25 7,28 3,29 4,32 37,35 4.9,36 0.181,37 15,38 46.5,39 81.17,40 93.052,41 50.824,42 46.986,44 7.301}
{0 CHEMBL115214,1 7.715,2 39.1,3 48.9,4 1.002,5 1.128,6 0.653,7 0.614,8 709.75,9 4.3,10 18,11 92,13 22,14 49,15 1,16 94,17 36,20 22,21 14,22 4,24 45,25 11,26 1,28 4,29 6,32 47,34 1,35 6.5,36 0.191,37 18,38 62,39 92.156,40 103.81,41 60.091,42 56.462,43 1.1,44 6.547}
{0 CHEMBL115297,1 8.008,2 38.8,3 47.5,4 1.005,5 1.13,6 0.657,7 0.621,8 640.64,9 6.3,10 18,11 80,13 21,14 44,15 1,16 82,17 31,20 20,21 11,22 3,24 38,25 11,26 1,28 5,29 5,32 42,34 1,35 6.3,36 0.195,37 16,38 56,39 80.396,40 90.439,41 52.597,42 49.662,43 1.3,44 7.131}
{0 CHEMBL115660,1 6.787,2 35.6,3 51.1,4 1.003,5 1.139,6 0.622,7 0.588,8 610.84,9 6.7,10 12,11 90,13 17,14 45,16 91,17 32,20 16,21 16,22 5,24 46,25 12,28 6,29 6,32 44,35 6.7,36 0.187,37 17,38 56,39 90.247,40 102.55,41 55.989,42 52.953,44 7.337}
{0 CHEMBL116267,1 7.886,2 36.6,3 48.8,4 1.007,5 1.135,6 0.644,7 0.609,8 646.65,9 6.1,10 12,11 82,13 16,14 44,15 1,16 84,17 30,20 16,21 14,22 4,24 40,25 12,26 1,28 5,29 6,32 42,34 1,35 7.3,36 0.179,37 15,38 54,39 82.607,40 93.063,41 52.813,42 49.903,43 1.2,44 6.842}
{0 CHEMBL116282,1 8.376,2 40.8,3 44.7,4 1.008,5 1.126,6 0.672,7 0.64,8 636.6,9 6.6,10 18,11 76,13 22,14 44,15 1,16 78,17 31,19 1,20 20,21 10,22 3,24 34,25 11,26 1,28 5,29 5,32 42,33 1,34 1,35 6.6,36 0.179,37 14,38 58,39 76.629,40 85.608,41 51.074,42 48.608,43 1.3,44 6.592}
{0 CHEMBL1208799,1 6.972,2 38.1,3 50.5,4 0.998,5 1.13,6 0.645,7 0.602,8 732.05,9 4.8,10 18,11 105,13 21,14 56,16 109,17 40,20 21,21 19,22 3,24 53,25 12,26 1,28 5,29 6,31 1,32 52,35 5.7,36 0.128,37 14,38 68,39 104.756,40 118.633,41 67.677,42 63.226,44 10}
{0 CHEMBL1209492,1 7.187,2 38.5,3 49,4 1.001,5 1.129,6 0.65,7 0.611,8 689.96,9 5.2,10 18,11 96,13 21,14 53,16 100,17 37,20 21,21 16,22 3,24 47,25 12,26 1,28 5,29 6,31 1,32 49,35 6.3,36 0.13,37 13,38 65,39 96.105,40 108.387,41 62.393,42 58.646,44 8.187}
{0 CHEMBL1209493,1 7.111,2 38.4,3 49.5,4 1,5 1.129,6 0.648,7 0.608,8 703.99,9 5.1,10 18,11 99,13 21,14 54,16 103,17 38,20 21,21 17,22 3,24 49,25 12,26 1,28 5,29 6,31 1,32 50,35 6.1,36 0.136,37 14,38 66,39 98.988,40 111.802,41 64.154,42 60.172,44 8.041}
{0 CHEMBL1209494,1 7.039,2 38.2,3 50,4 0.999,5 1.13,6 0.646,7 0.605,8 718.02,9 4.9,10 18,11 102,13 21,14 55,16 106,17 39,20 21,21 18,22 3,24 51,25 12,26 1,28 5,29 6,31 1,32 51,35 5.9,36 0.132,37 14,38 67,39 101.872,40 115.218,41 65.915,42 61.699,44 7.77}
{0 CHEMBL1209495,1 7.111,2 38.4,3 49.5,4 1,5 1.129,6 0.648,7 0.608,8 703.99,9 5.1,10 18,11 99,13 21,14 54,16 103,17 38,20 21,21 17,22 3,24 49,25 12,26 1,28 5,29 6,31 1,32 50,35 6.1,36 0.126,37 13,38 66,39 98.988,40 111.802,41 64.154,42 60.172,44 8.071}
{0 CHEMBL1209496,1 7.039,2 38.2,3 50,4 0.999,5 1.13,6 0.646,7 0.605,8 718.02,9 4.9,10 18,11 102,13 21,14 55,16 106,17 39,20 21,21 18,22 3,24 51,25 12,26 1,28 5,29 6,31 1,32 51,35 5.9,36 0.132,37 14,38 67,39 101.872,40 115.218,41 65.915,42 61.699,44 8.921}
{0 CHEMBL1209497,1 7.039,2 38.2,3 50,4 0.999,5 1.13,6 0.646,7 0.605,8 718.02,9 4.9,10 18,11 102,13 21,14 55,16 106,17 39,20 21,21 18,22 3,24 51,25 12,26 1,28 5,29 6,31 1,32 51,35 5.9,36 0.142,37 15,38 67,39 101.872,40 115.218,41 65.915,42 61.699,44 9.167}
{0 CHEMBL1209498,1 6.908,2 38,3 50.9,4 0.997,5 1.13,6 0.643,7 0.6,8 746.08,9 4.6,10 18,11 108,13 21,14 57,16 112,17 41,20 21,21 20,22 3,24 55,25 12,26 1,28 5,29 6,31 1,32 53,35 5.6,36 0.143,37 16,38 69,39 107.639,40 122.048,41 69.438,42 64.753,44 8.292}
{0 CHEMBL1209499,1 7.039,2 38.2,3 50,4 0.999,5 1.13,6 0.646,7 0.605,8 718.02,9 4.9,10 18,11 102,13 21,14 55,16 106,17 39,20 21,21 18,22 3,24 51,25 12,26 1,28 5,29 6,31 1,32 51,35 5.9,36 0.132,37 14,38 67,39 101.872,40 115.218,41 65.915,42 61.699,44 10}
{0 CHEMBL1209500,1 6.908,2 38,3 50.9,4 0.997,5 1.13,6 0.643,7 0.6,8 746.08,9 4.6,10 18,11 108,13 21,14 57,16 112,17 41,20 21,21 20,22 3,24 55,25 12,26 1,28 5,29 6,31 1,32 53,35 5.6,36 0.143,37 16,38 69,39 107.639,40 122.048,41 69.438,42 64.753,44 8.377}
{0 CHEMBL1209501,1 6.791,2 37.7,3 51.8,4 0.995,5 1.131,6 0.64,7 0.595,8 774.14,9 4.4,10 18,11 114,13 21,14 59,16 118,17 43,20 21,21 22,22 3,24 59,25 12,26 1,28 5,29 6,31 1,32 55,35 5.3,36 0.144,37 17,38 71,39 113.406,40 128.878,41 72.961,42 67.806,44 8}
{0 CHEMBL1213687,1 6.503,2 36,3 53,4 0.996,5 1.138,6 0.621,7 0.58,8 1066.55,9 5.5,10 23,11 164,13 29,14 80,16 167,17 59,20 27,21 32,22 6,24 87,25 18,28 9,29 9,32 77,35 5.5,36 0.204,37 34,38 97.5,39 163.322,40 186.562,41 101.836,42 95.171,44 9.314}
{0 CHEMBL162362,1 6.903,2 36.4,3 50,4 1.003,5 1.139,6 0.629,7 0.596,8 455.62,9 7.6,10 12,11 66,13 15,14 34,16 67,17 24,20 14,21 10,22 3,24 33,25 9,28 5,29 4,32 33,35 6.1,36 0.179,37 12,38 43,39 66.189,40 75.142,41 41.506,42 39.341,44 5.699}
{0 CHEMBL162454,1 7.078,2 40.9,3 47.7,4 0.998,5 1.128,6 0.654,7 0.619,8 622.84,9 6.8,10 24,11 88,13 27,14 49,16 91,17 36,20 26,21 10,22 3,24 42,25 10,28 6,29 4,32 46,35 4.5,36 0.165,37 15,38 64,39 87.825,40 99.301,41 57.557,42 54.47,44 6.889}
{0 CHEMBL162495,1 6.987,2 41.6,3 48.3,4 0.996,5 1.126,6 0.655,7 0.618,8 621.85,9 5.6,10 24,11 89,13 27,14 49,16 92,17 37,20 26,21 11,22 3,24 43,25 9,28 5,29 4,32 46,35 4.5,36 0.163,37 15,38 64,39 88.607,40 100.218,41 58.313,42 54.975,44 6.032}
{0 CHEMBL162554,1 7.078,2 40.9,3 47.7,4 0.998,5 1.128,6 0.654,7 0.619,8 622.84,9 6.8,10 24,11 88,13 27,14 49,16 91,17 36,20 26,21 10,22 3,24 42,25 10,28 6,29 4,32 46,35 4.5,36 0.165,37 15,38 64,39 87.825,40 99.301,41 57.557,42 54.47,44 6.824}
{0 CHEMBL162898,1 8.19,2 37.3,3 43.4,4 1.029,5 1.144,6 0.646,7 0.631,8 679.79,9 6,10 18,11 83,13 23,14 49,16 85,17 31,20 20,21 11,22 5,23 3,24 36,25 16,26 1,28 5,29 7,31 1,32 47,34 3,35 8.4,36 0.188,37 16,38 63,39 85.436,40 94.955,41 53.614,42 52.403,43 3.6,44 5.699}
{0 CHEMBL163038,1 6.755,2 37.3,3 50.8,4 0.998,5 1.136,6 0.632,7 0.595,8 398.56,9 6.8,10 12,11 59,13 14,14 30,16 60,17 22,20 13,21 9,22 2,24 30,25 7,28 4,29 3,32 29,35 5.1,36 0.183,37 11,38 38,39 58.876,40 67.019,41 37.285,42 35.078,44 5.699}
{0 CHEMBL163104,1 6.987,2 41.6,3 48.3,4 0.996,5 1.126,6 0.655,7 0.618,8 621.85,9 5.6,10 24,11 89,13 27,14 49,16 92,17 37,20 26,21 11,22 3,24 43,25 9,28 5,29 4,32 46,35 4.5,36 0.163,37 15,38 64,39 88.607,40 100.218,41 58.313,42 54.975,44 6.917}
{0 CHEMBL163249,1 8.034,2 39.5,3 47.4,4 1.002,5 1.129,6 0.663,7 0.624,8 610.61,9 6.6,10 18,11 76,13 21,14 42,15 1,16 78,17 30,20 20,21 10,22 3,24 36,25 10,26 1,28 5,29 4,32 40,34 1,35 5.3,36 0.179,37 14,38 54,39 76.185,40 85.814,41 50.381,42 47.42,43 1.3,44 6.268}
{0 CHEMBL1699130,1 7.1,2 39.4,3 48.5,4 1.006,5 1.129,6 0.639,7 0.61,8 468.6,9 3,10 12,11 66,13 16,14 35,16 67,17 26,20 16,21 10,22 4,24 32,25 8,28 2,29 6,32 34,35 9.1,36 0.224,37 15,38 45,39 66.421,40 74.481,41 42.159,42 40.234,44 5.078}
{0 CHEMBL176013,1 6.996,2 39,3 49.4,4 1.005,5 1.129,6 0.635,7 0.604,8 538.7,9 2.6,10 12,11 77,13 15,14 42,16 80,17 30,20 17,21 13,22 3,24 38,25 9,28 2,29 7,32 39,35 9.1,36 0.175,37 14,38 51,39 77.4,40 86.936,41 48.898,42 46.529,44 5.602}
{0 CHEMBL176845,1 6.948,2 42.3,3 48.5,4 0.994,5 1.124,6 0.658,7 0.619,8 673.93,9 5.2,10 28,11 97,13 31,14 54,16 101,17 41,20 29,21 12,22 3,24 47,25 9,28 5,29 4,32 50,35 4.1,36 0.168,37 17,38 71,39 96.374,40 109.048,41 63.836,42 60.029,44 7.959}
{0 CHEMBL176888,1 7.443,2 43.4,3 45.3,4 1.008,5 1.119,6 0.661,7 0.635,8 788.96,9 1.9,10 24,11 106,13 30,14 63,16 111,17 46,20 32,21 14,22 6,24 48,25 12,28 2,29 10,32 58,35 9.4,36 0.153,37 17,38 81,39 106.799,40 118.64,41 70.069,42 67.307,44 8.222}
{0 CHEMBL177262,1 6.599,2 30.8,3 53.8,4 1.01,5 1.148,6 0.591,7 0.562,8 514.7,9 5.1,11 78,13 6,14 35,16 77,17 24,20 8,21 16,22 6,24 42,25 12,28 4,29 8,32 36,35 10.3,36 0.221,37 17,38 41,39 78.814,40 89.557,41 46.125,42 43.813,44 5.387}
{0 CHEMBL177374,1 7.165,2 38.5,3 50,4 0.995,5 1.12,6 0.681,7 0.622,8 745.12,9 1.9,10 12,11 104,13 18,14 55,16 107,17 40,19 4,20 18,21 18,22 4,24 52,25 12,26 2,28 2,29 8,32 52,33 2,35 7.7,36 0.121,37 13,38 69,39 103.468,40 116.5,41 70.796,42 64.701,44 6.886}
{0 CHEMBL177718,1 7.272,2 39.5,3 47.4,4 1.011,5 1.128,6 0.639,7 0.615,8 552.68,9 2.6,10 12,11 76,13 16,14 43,16 79,17 30,20 18,21 12,22 4,24 36,25 10,28 2,29 8,32 40,35 10.5,36 0.165,37 13,38 53,39 76.843,40 85.73,41 48.591,42 46.717,44 7.018}
{0 CHEMBL1777836,1 8.189,2 40.3,3 41.8,4 1.016,5 1.127,6 0.677,7 0.652,8 548.68,9 9,10 21,11 67,13 24,14 43,16 71,17 27,20 20,21 7,22 3,24 28,25 12,26 1,28 6,29 5,31 1,32 39,35 7.5,36 0.127,37 9,38 56.5,39 68.043,40 75.524,41 45.33,42 43.684,44 4.824}
{0 CHEMBL1780012,1 8.641,2 48.6,3 38.9,4 1.007,5 1.105,6 0.726,7 0.691,8 622.18,9 4.2,10 34,11 72,13 35,14 49,16 77,17 35,18 1,20 32,21 3,22 1,24 28,25 9,26 2,28 3,29 4,31 1,32 44,34 1,35 5.6,36 0.117,37 9,38 67,39 72.502,40 79.594,41 52.239,42 49.786,43 1.4,44 5.717}
{0 CHEMBL1780014,1 7.062,2 43.4,3 47.4,4 0.994,5 1.122,6 0.665,7 0.627,8 536.73,9 5.3,10 23,11 76,13 26,14 43,16 79,17 33,20 24,21 9,22 3,24 36,25 7,28 4,29 3,32 40,35 3.9,36 0.127,37 10,38 57.5,39 75.527,40 85.265,41 50.569,42 47.659,44 4.939}
{0 CHEMBL1780016,1 7.813,2 43.9,3 43.9,4 1.003,5 1.116,6 0.688,7 0.651,8 515.68,9 4.5,10 22,11 66,13 25,14 40,16 69,17 29,20 22,21 7,22 3,24 29,25 8,26 1,28 3,29 4,31 1,32 37,35 6.1,36 0.116,37 8,38 54,39 66.178,40 73.65,41 45.381,42 42.959,44 5.651}
{0 CHEMBL1780017,1 8.034,2 42.9,3 44.4,4 0.997,5 1.12,6 0.7,7 0.653,8 506.12,9 7.9,10 22,11 63,13 24,14 38,16 66,17 27,18 1,20 21,21 6,22 2,24 28,25 8,26 2,28 5,29 1,31 1,32 35,34 1,35 1.6,36 0.152,37 10,38 51,39 62.84,40 70.547,41 44.125,42 41.158,43 1.6,44 5.771}
{0 CHEMBL1780018,1 7.732,2 44.4,3 44.4,4 1.002,5 1.114,6 0.685,7 0.649,8 556.73,9 2.8,10 18,11 72,13 23,14 43,16 75,17 32,20 24,21 8,22 5,24 32,25 8,26 1,28 2,29 5,31 1,32 40,35 6.9,36 0.133,37 10,38 57,39 72.171,40 80.192,41 49.353,42 46.706,44 5.307}
{0 CHEMBL1780020,1 7.994,2 45.8,3 42.4,4 1.001,5 1.112,6 0.702,7 0.664,8 471.62,9 5.1,10 18,11 59,13 21,14 38,16 63,17 27,20 22,21 5,22 3,24 25,25 7,26 1,28 3,29 3,31 1,32 34,35 5.1,36 0.079,37 5,38 50,39 59.083,40 65.61,41 41.404,42 39.19,44 5.246}
{0 CHEMBL1790772,1 6.495,2 35.7,3 53.2,4 0.997,5 1.138,6 0.619,7 0.579,8 1110.61,9 5.3,10 22,11 171,13 29,14 83,16 174,17 61,20 26,21 35,22 7,24 91,25 19,28 9,29 10,32 80,35 5.8,36 0.213,37 37,38 101,39 170.417,40 194.602,41 105.814,42 98.939,44 8.018}
{0 CHEMBL1790773,1 6.443,2 35.8,3 53.5,4 0.994,5 1.138,6 0.62,7 0.578,8 1024.51,9 5.7,10 22,11 159,13 28,14 77,16 162,17 57,20 25,21 32,22 6,24 85,25 17,28 9,29 8,32 74,35 5,36 0.198,37 32,38 94,39 158.111,40 180.938,41 98.621,42 91.929,44 8.821}
{0 CHEMBL1790774,1 6.503,2 36,3 53,4 0.996,5 1.138,6 0.621,7 0.58,8 1066.55,9 5.5,10 23,11 164,13 29,14 80,16 167,17 59,20 27,21 32,22 6,24 87,25 18,28 9,29 9,32 77,35 5.5,36 0.204,37 34,38 97.5,39 163.322,40 186.562,41 101.836,42 95.171,44 9.229}
{0 CHEMBL1790775,1 6.218,2 32.9,3 55.7,4 0.995,5 1.144,6 0.603,7 0.56,8 926.41,9 6,10 11,11 149,13 17,14 67,16 150,17 49,20 15,21 34,22 6,24 83,25 17,28 9,29 8,32 66,35 5.4,36 0.22,37 33,38 78.5,39 148.228,40 170.522,41 89.859,42 83.403,44 6.402}
{0 CHEMBL1790776,1 6.305,2 34.6,3 54.7,4 0.994,5 1.141,6 0.612,7 0.569,8 1002.51,9 5.7,10 17,11 159,13 23,14 74,16 161,17 55,20 21,21 34,22 6,24 87,25 17,28 9,29 8,32 72,35 5,36 0.211,37 34,38 88.5,39 157.995,40 181.353,41 97.382,42 90.456,44 6.87}
{0 CHEMBL189976,1 7.874,2 39.3,3 43.8,4 1.026,5 1.141,6 0.64,7 0.629,8 700.78,9 4.5,10 18,11 89,13 22,14 53,16 92,17 35,20 22,21 13,22 4,23 3,24 39,25 15,28 4,29 8,32 50,34 3,35 9,36 0.174,37 16,38 66,39 91.352,40 101.576,41 56.938,42 55.963,43 3.4,44 7.721}
{0 CHEMBL190290,1 7.755,2 35.2,3 49.5,4 1.009,5 1.138,6 0.635,7 0.601,8 705.73,9 6.6,10 12,11 91,13 17,14 47,15 1,16 92,17 32,20 16,21 16,22 5,24 45,25 14,26 1,28 6,29 7,32 46,34 1,35 7.7,36 0.196,37 18,38 58,39 91.803,40 103.601,41 57.796,42 54.693,43 1.1,44 8.244}
{0 CHEMBL190348,1 7.879,2 44.2,3 42.9,4 1.018,5 1.131,6 0.663,7 0.646,8 606.69,9 2.6,10 24,11 77,13 26,14 47,16 80,17 34,20 26,21 8,22 2,23 3,24 33,25 10,28 2,29 5,32 44,34 3,35 6.5,36 0.175,37 14,38 61,39 78.399,40 87.121,41 51.04,42 49.722,43 3.9,44 6.511}
{0 CHEMBL190539,1 8.28,2 43.2,3 41.9,4 1.022,5 1.13,6 0.675,7 0.654,8 612.72,9 2.7,10 23,11 74,13 25,14 46,16 77,17 32,20 24,21 8,22 2,23 3,24 31,25 11,26 1,28 2,29 5,31 1,32 43,34 3,35 6.8,36 0.182,37 14,38 59.5,39 75.592,40 83.626,41 49.926,42 48.383,43 4.1,44 6.159}
{0 CHEMBL191130,1 7.182,2 37.5,3 48.1,4 1.01,5 1.135,6 0.633,7 0.607,8 746.95,9 5.8,10 18,11 104,13 23,14 57,16 107,17 39,20 22,21 17,22 5,24 50,25 15,28 6,29 9,32 54,35 8.7,36 0.178,37 19,38 71,39 104.996,40 118.009,41 65.875,42 63.151,44 8.959}
{0 CHEMBL191260,1 7.234,2 36.7,3 49,4 1.005,5 1.134,6 0.641,7 0.606,8 708.97,9 6.1,10 17,11 98,13 22,14 52,16 100,17 36,20 20,21 16,22 5,24 48,25 14,26 1,28 6,29 7,31 1,32 50,35 7.1,36 0.19,37 19,38 65.5,39 98.534,40 111.095,41 62.853,42 59.382,44 8.959}
{0 CHEMBL191487,1 8.01,2 41.4,3 44.3,4 1.018,5 1.135,6 0.664,7 0.638,8 560.69,9 2.9,10 17,11 70,13 19,14 42,16 73,17 29,20 18,21 11,22 2,23 3,24 31,25 10,26 1,28 2,29 4,31 1,32 39,34 3,35 5.7,36 0.151,37 11,38 52.5,39 71.265,40 79.417,41 46.472,42 44.668,43 4.3,44 6.585}
{0 CHEMBL1941005,1 8.741,2 48.8,3 34.1,4 1.02,5 1.115,6 0.712,7 0.704,8 358.38,9 9.8,10 22,11 41,13 25,14 30,16 44,17 20,20 19,21 1,22 3,24 14,25 7,28 4,29 3,32 27,35 7.3,36 0.114,37 5,38 44,39 41.807,40 45.697,41 29.193,42 28.864,44 4.69}
{0 CHEMBL1941006,1 8.424,2 48.8,3 36.6,4 1.014,5 1.113,6 0.706,7 0.692,8 345.38,9 7.3,10 22,11 41,13 23,14 29,16 44,17 20,20 19,21 1,22 1,24 15,25 6,28 3,29 3,32 26,35 7.3,36 0.091,37 4,38 41,39 41.589,40 45.614,41 28.949,42 28.369,44 4.708}
{0 CHEMBL1941007,1 8.918,2 51.3,3 35.9,4 1.007,5 1.106,6 0.741,7 0.712,8 347.82,9 7.7,10 22,11 39,13 23,14 28,16 42,17 20,18 1,20 19,21 1,22 1,24 14,25 5,26 1,28 3,29 1,32 25,34 1,35 2.6,36 0.095,37 4,38 40,39 39.258,40 43.14,41 28.898,42 27.767,43 2.6,44 4.674}
{0 CHEMBL1941008,1 8.741,2 48.8,3 34.1,4 1.02,5 1.115,6 0.712,7 0.704,8 358.38,9 9.8,10 22,11 41,13 25,14 30,16 44,17 20,20 19,21 1,22 3,24 14,25 7,28 4,29 3,32 27,35 7.3,36 0.114,37 5,38 44,39 41.807,40 45.697,41 29.193,42 28.864,44 4.514}
{0 CHEMBL1941009,1 8.741,2 48.8,3 34.1,4 1.02,5 1.115,6 0.712,7 0.704,8 358.38,9 9.8,10 22,11 41,13 25,14 30,16 44,17 20,20 19,21 1,22 3,24 14,25 7,28 4,29 3,32 27,35 7.3,36 0.114,37 5,38 44,39 41.807,40 45.697,41 29.193,42 28.864,44 4.516}
{0 CHEMBL1941010,1 8.497,2 51.3,3 35.9,4 1.011,5 1.116,6 0.717,7 0.701,8 331.37,9 7.7,10 22,11 39,13 23,14 28,16 42,17 20,20 19,21 1,22 1,23 1,24 14,25 5,28 3,29 1,32 25,34 1,35 2.6,36 0.095,37 4,38 40,39 39.447,40 43.535,41 27.978,42 27.323,43 2.6,44 5}
{0 CHEMBL1941011,1 8.958,2 51.3,3 33.3,4 1.025,5 1.125,6 0.716,7 0.71,8 349.36,9 7.7,10 22,11 39,13 23,14 29,16 42,17 20,20 19,21 1,22 1,23 2,24 13,25 6,28 3,29 1,32 26,34 2,35 2.6,36 0.095,37 4,38 41,39 39.96,40 43.875,41 27.915,42 27.706,43 5.1,44 4.319}
{0 CHEMBL1941012,1 8.035,2 51.3,3 38.5,4 0.998,5 1.108,6 0.719,7 0.691,8 313.38,9 7.7,10 22,11 39,13 23,14 27,16 42,17 20,20 19,21 1,22 1,24 15,25 4,28 3,29 1,32 24,35 2.6,36 0.095,37 4,38 39,39 38.934,40 43.196,41 28.04,42 26.94,44 5}
{0 CHEMBL1941013,1 7.949,2 53.1,3 38.8,4 0.994,5 1.103,6 0.726,7 0.694,8 389.48,9 6.1,10 28,11 49,13 29,14 34,16 53,17 26,20 25,21 1,22 1,24 19,25 4,28 3,29 1,32 30,35 2,36 0.094,37 5,38 49,39 48.702,40 54.026,41 35.563,42 33.993,44 4.833}
{0 CHEMBL1941014,1 7.986,2 48.8,3 39.5,4 1.003,5 1.112,6 0.704,7 0.679,8 343.41,9 7,10 22,11 43,13 23,14 29,16 46,17 21,20 19,21 2,22 1,24 17,25 5,28 3,29 2,32 26,35 4.7,36 0.109,37 5,38 41,39 43.145,40 47.82,41 30.256,42 29.181,44 4.424}
{0 CHEMBL1941015,1 7.946,2 46.8,3 40.4,4 1.008,5 1.116,6 0.691,7 0.669,8 373.44,9 6.4,10 22,11 47,13 23,14 31,16 50,17 22,20 19,21 3,22 1,24 19,25 6,28 3,29 3,32 28,35 6.4,36 0.12,37 6,38 43,39 47.356,40 52.445,41 32.472,42 31.423,44 4.469}
{0 CHEMBL194415,1 9.25,2 39.7,3 44.9,4 1.014,5 1.124,6 0.678,7 0.642,8 721.49,9 3.8,10 17,11 78,13 20,14 46,15 2,16 81,17 31,20 19,21 12,22 3,24 35,25 12,26 2,28 3,29 7,32 43,34 2,35 9,36 0.198,37 16,38 57.5,39 79.076,40 87.702,41 52.847,42 50.074,43 2.6,44 5.638}
{0 CHEMBL195004,1 9.08,2 39.5,3 45.7,4 1.012,5 1.125,6 0.674,7 0.637,8 735.52,9 3.7,10 17,11 81,13 20,14 47,15 2,16 84,17 32,20 19,21 13,22 3,24 37,25 12,26 2,28 3,29 7,32 44,34 2,35 8.6,36 0.167,37 14,38 58.5,39 81.96,40 91.118,41 54.608,42 51.601,43 2.5,44 5.301}
{0 CHEMBL196062,1 7.278,2 38.5,3 47.4,4 1.012,5 1.131,6 0.636,7 0.612,8 567.7,9 3.8,10 12,11 78,13 17,14 43,16 80,17 30,20 19,21 11,22 5,24 37,25 11,28 3,29 8,32 41,35 10.3,36 0.2,37 16,38 54,39 78.945,40 88.229,41 49.597,42 47.738,44 6.793}
{0 CHEMBL196165,1 9.686,2 38.9,3 43.1,4 1.023,5 1.126,6 0.677,7 0.649,8 697.42,9 4.2,10 12,11 72,13 17,14 43,15 2,16 74,17 28,20 19,21 9,22 5,24 31,25 13,26 2,28 3,29 8,32 41,34 2,35 11.1,36 0.189,37 14,38 54,39 73.636,40 81.081,41 48.779,42 46.735,43 2.8,44 6.775}
{0 CHEMBL196265,1 9.631,2 40.3,3 43.1,4 1.018,5 1.123,6 0.685,7 0.653,8 693.43,9 4.2,10 17,11 72,13 20,14 44,15 2,16 75,17 29,20 19,21 10,22 3,24 31,25 12,26 2,28 3,29 7,32 41,34 2,35 9.7,36 0.187,37 14,38 55.5,39 73.309,40 80.872,41 49.324,42 47.02,43 2.8,44 5.678}
{0 CHEMBL196614,1 9.486,2 38.7,3 44,4 1.02,5 1.127,6 0.674,7 0.643,8 711.45,9 4,10 12,11 75,13 17,14 44,15 2,16 77,17 29,20 19,21 10,22 5,24 33,25 13,26 2,28 3,29 8,32 42,34 2,35 10.7,36 0.195,37 15,38 55,39 76.52,40 84.497,41 50.54,42 48.262,43 2.7,44 7.854}
{0 CHEMBL196696,1 8.795,2 34.1,3 48.2,4 1.016,5 1.138,6 0.645,7 0.61,8 747.55,9 5.9,10 6,11 85,13 11,14 46,15 2,16 87,17 29,20 13,21 16,22 5,24 41,25 15,26 2,28 5,29 8,32 44,34 2,35 9.4,36 0.184,37 16,38 54,39 86.374,40 96.739,41 54.836,42 51.885,43 2.4,44 6.232}
{0 CHEMBL197463,1 9.068,2 34.6,3 46.9,4 1.021,5 1.136,6 0.648,7 0.618,8 734.5,9 4.9,10 6,11 81,13 11,14 45,15 2,16 83,17 28,20 13,21 15,22 5,24 38,25 15,26 2,28 4,29 9,32 43,34 2,35 11.1,36 0.193,37 16,38 53,39 82.716,40 92.035,41 52.523,42 50.052,43 2.5,44 5.886}
{0 CHEMBL197834,1 9.957,2 37.1,3 43.5,4 1.025,5 1.13,6 0.674,7 0.645,8 617.33,9 4.8,10 11,11 62,13 14,14 37,15 2,16 64,17 23,20 13,21 10,22 3,24 27,25 12,26 2,28 3,29 7,32 35,34 2,35 11.3,36 0.188,37 12,38 45.5,39 63.542,40 70.042,41 41.801,42 39.967,43 3.2,44 5.301}
{0 CHEMBL198165,1 9.783,2 36.5,3 44.4,4 1.021,5 1.132,6 0.672,7 0.639,8 616.35,9 6.3,10 11,11 63,13 14,14 37,15 2,16 65,17 23,20 13,21 10,22 3,24 28,25 12,26 2,28 4,29 6,32 35,34 2,35 9.5,36 0.185,37 12,38 45.5,39 64.316,40 71.33,41 42.353,42 40.273,43 3.2,44 5.301}
{0 CHEMBL198356,1 10.375,2 29.6,3 44.4,4 1.041,5 1.147,6 0.643,7 0.623,8 560.24,9 7.4,11 54,13 6,14 29,15 2,16 53,17 16,20 8,21 8,22 6,24 24,25 14,26 2,28 4,29 8,32 30,34 2,35 14.8,36 0.245,37 13,38 35,39 56.203,40 61.919,41 34.739,42 33.649,43 3.7,44 5.301}
{0 CHEMBL198767,1 10.921,2 33.3,3 41.7,4 1.037,5 1.139,6 0.673,7 0.649,8 524.2,9 8.3,10 10,11 48,13 12,14 29,15 2,16 49,17 16,20 8,21 8,22 2,24 20,25 12,26 2,28 4,29 6,32 28,34 2,35 12.5,36 0.224,37 11,38 36,39 49.782,40 54.67,41 32.307,42 31.166,43 4.2,44 5.301}
{0 CHEMBL2069612,1 7.031,2 38.6,3 50,4 0.999,5 1.131,6 0.644,7 0.605,8 801.52,9 5.3,10 23,11 114,13 27,14 60,16 117,17 44,18 1,20 25,21 19,22 4,24 57,25 13,26 1,28 6,29 6,32 57,34 1,35 5.3,36 0.188,37 22,38 75.5,39 113.872,40 128.985,41 73.416,42 68.942,43 0.9,44 8.638}
{0 CHEMBL2069613,1 7.037,2 37.9,3 50,4 1.001,5 1.133,6 0.64,7 0.603,8 872.61,9 5.6,10 23,11 124,13 28,14 65,16 127,17 47,18 1,20 26,21 21,22 5,24 62,25 15,26 1,28 7,29 7,32 62,34 1,35 5.6,36 0.189,37 24,38 81.5,39 124.068,40 140.524,41 79.399,42 74.731,43 0.8,44 8.42}
{0 CHEMBL2069614,1 6.653,2 37.1,3 51.7,4 0.997,5 1.135,6 0.628,7 0.589,8 951.35,9 5.6,10 23,11 143,13 29,14 72,16 146,17 53,20 27,21 26,22 6,24 74,25 16,28 8,29 8,32 69,35 5.6,36 0.192,37 28,38 89.5,39 142.592,40 162.363,41 89.808,42 84.274,44 8.585}
{0 CHEMBL2069615,1 6.663,2 38.6,3 51.5,4 0.996,5 1.131,6 0.634,7 0.594,8 672.95,9 4,10 18,11 101,13 22,14 51,16 103,17 39,20 22,21 17,22 4,24 52,25 10,28 4,29 6,32 49,35 5.9,36 0.184,37 19,38 64,39 100.577,40 114.214,41 64.023,42 60.018,44 8.886}
{0 CHEMBL2069616,1 6.739,2 39,3 51,4 0.998,5 1.129,6 0.635,7 0.597,8 673.93,9 3,10 18,11 100,13 22,14 51,16 102,17 39,20 22,21 17,22 4,24 51,25 10,28 3,29 7,32 49,35 7,36 0.196,37 20,38 64,39 99.803,40 112.926,41 63.472,42 59.711,44 8.721}
{0 CHEMBL207616,1 6.154,2 39.4,3 54.8,4 0.982,5 1.128,6 0.634,7 0.581,8 640.01,9 2.9,10 18,11 104,13 20,14 50,16 107,17 41,20 20,21 21,22 2,24 57,25 6,28 3,29 3,32 47,35 2.9,36 0.178,37 19,38 61,39 102.145,40 117.334,41 65.938,42 60.432,44 7.131}
{0 CHEMBL216917,1 6.718,2 36.8,3 51.4,4 0.999,5 1.136,6 0.627,7 0.59,8 967.35,9 5.6,10 23,11 144,13 29,14 73,16 147,17 53,20 27,21 26,22 6,24 74,25 17,28 8,29 9,32 70,35 6.3,36 0.19,37 28,38 90.5,39 143.919,40 163.573,41 90.262,42 84.989,44 8.409}
{0 CHEMBL218750,1 6.518,2 35.8,3 53.1,4 0.997,5 1.138,6 0.619,7 0.579,8 1166.68,9 5,10 23,11 179,13 30,14 87,16 182,17 64,20 28,21 36,22 7,24 95,25 20,28 9,29 11,32 84,35 6.1,36 0.203,37 37,38 105.5,39 178.511,40 203.642,41 110.791,42 103.708,44 6.395}
{0 CHEMBL219025,1 6.562,2 37.1,3 52.4,4 0.996,5 1.135,6 0.626,7 0.586,8 938.35,9 4.9,10 23,11 143,13 28,14 71,16 146,17 53,20 26,21 27,22 5,24 75,25 15,28 7,29 8,32 68,35 5.6,36 0.192,37 28,38 87.5,39 142.373,40 162.28,41 89.564,42 83.779,44 7.917}
{0 CHEMBL219639,1 6.377,2 34.6,3 54.4,4 0.997,5 1.14,6 0.61,7 0.57,8 867.27,9 4.4,10 12,11 136,13 18,14 63,16 137,17 47,20 18,21 29,22 6,24 74,25 15,28 6,29 9,32 62,35 6.6,36 0.219,37 30,38 75,39 135.599,40 154.991,41 83.012,42 77.473,44 8.004}
{0 CHEMBL219717,1 5.955,2 39.6,3 56,4 0.976,5 1.128,6 0.635,7 0.576,8 541.9,9 3.3,10 18,11 91,13 19,14 42,16 93,17 36,20 19,21 17,22 1,24 51,25 4,28 3,29 1,32 40,35 1.1,36 0.204,37 19,38 52,39 88.839,40 102.669,41 57.745,42 52.422,44 6.368}
{0 CHEMBL219771,1 6.044,2 37.1,3 57.3,4 0.977,5 1.13,6 0.634,7 0.569,8 537.94,9 3.4,10 12,11 89,13 13,14 40,16 91,17 33,20 13,21 20,22 1,24 51,25 5,26 1,28 3,29 1,31 1,32 38,35 1.1,36 0.187,37 17,38 47,39 86.916,40 100.589,41 56.393,42 50.609,44 6.726}
{0 CHEMBL219776,1 5.643,2 36.7,3 58.9,4 0.975,5 1.134,6 0.617,7 0.555,8 507.89,9 3.3,10 12,11 90,13 13,14 38,16 91,17 33,20 13,21 20,22 1,24 53,25 4,28 3,29 1,32 37,35 1.1,36 0.209,37 19,38 45,39 87.723,40 102.084,41 55.507,42 49.949,44 5.827}
{0 CHEMBL219783,1 6.083,2 39.6,3 55.2,4 0.98,5 1.128,6 0.635,7 0.58,8 583.94,9 3.1,10 18,11 96,13 20,14 45,16 98,17 38,20 20,21 18,22 2,24 53,25 5,28 3,29 2,32 43,35 2.1,36 0.184,37 18,38 56,39 94.05,40 108.294,41 60.961,42 55.664,44 7.114}
{0 CHEMBL219831,1 6.129,2 39.3,3 54.8,4 0.98,5 1.13,6 0.637,7 0.582,8 514.83,9 4.8,10 18,11 84,13 19,14 40,16 86,17 33,20 17,21 16,22 1,24 46,25 5,28 4,29 1,32 38,35 1.2,36 0.198,37 17,38 50,39 82.29,40 94.922,41 53.467,42 48.863,44 5.279}
{0 CHEMBL219895,1 6.774,2 39.7,3 51.5,4 1,5 1.143,6 0.632,7 0.594,8 460.64,9 2.9,10 12,11 68,13 13,14 35,16 70,17 27,20 13,21 14,22 1,23 3,24 35,25 6,28 2,29 1,32 33,34 3,35 1.5,36 0.143,37 10,38 42,39 67.974,40 77.699,41 42.984,42 40.39,43 4.4,44 5.444}
{0 CHEMBL219994,1 6.357,2 39.6,3 54.5,4 0.98,5 1.125,6 0.647,7 0.588,8 642.05,9 3,10 18,11 101,13 20,14 49,16 104,17 40,20 20,21 20,22 2,24 55,25 6,26 1,28 3,29 2,31 1,32 46,35 2,36 0.173,37 18,38 60,39 99.01,40 113.629,41 65.37,42 59.378,44 7.252}
{0 CHEMBL220277,1 6.339,2 38.6,3 53.4,4 0.985,5 1.132,6 0.636,7 0.586,8 557.86,9 5.7,10 18,11 88,13 20,14 43,16 90,17 34,20 18,21 16,22 2,24 47,25 7,28 5,29 2,32 41,35 2.3,36 0.2,37 18,38 54,39 86.719,40 99.63,41 55.927,42 51.599,44 6.614}
{0 CHEMBL220322,1 6.284,2 39.6,3 53.8,4 0.985,5 1.128,6 0.636,7 0.586,8 571.88,9 3.3,10 18,11 91,13 19,14 45,16 94,17 36,20 19,21 17,22 1,24 49,25 6,28 3,29 3,32 42,35 3.3,36 0.181,37 17,38 55,39 89.61,40 102.673,41 57.893,42 53.325,44 6.358}
{0 CHEMBL220323,1 6.157,2 40,3 54.7,4 0.982,5 1.126,6 0.636,7 0.583,8 584.92,9 2.1,10 18,11 95,13 20,14 45,16 97,17 38,20 20,21 18,22 2,24 52,25 5,28 2,29 3,32 43,35 3.2,36 0.206,37 20,38 56,39 93.276,40 107.005,41 60.41,42 55.357,44 6.738}
{0 CHEMBL220331,1 6.129,2 39.3,3 54.8,4 0.98,5 1.13,6 0.637,7 0.582,8 514.83,9 4.8,10 18,11 84,13 19,14 40,16 86,17 33,20 17,21 16,22 1,24 46,25 5,28 4,29 1,32 38,35 1.2,36 0.198,37 17,38 50,39 82.29,40 94.922,41 53.467,42 48.863,44 6.231}
{0 CHEMBL220369,1 6.339,2 39.8,3 53.4,4 0.986,5 1.128,6 0.638,7 0.589,8 557.85,9 3.4,10 18,11 88,13 19,14 44,16 91,17 35,20 18,21 17,22 1,24 47,25 6,28 3,29 3,32 41,35 3.4,36 0.187,37 17,38 54,39 86.727,40 99.258,41 56.131,42 51.798,44 6.36}
{0 CHEMBL220370,1 5.974,2 39.3,3 56,4 0.977,5 1.129,6 0.634,7 0.576,8 501.83,9 3.6,10 17,11 84,13 18,14 39,16 86,17 33,20 17,21 16,22 1,24 47,25 4,28 3,29 1,32 37,35 1.2,36 0.198,37 17,38 48.5,39 82.072,40 94.839,41 53.222,42 48.369,44 6.62}
{0 CHEMBL220516,1 5.752,2 36.6,3 58.1,4 0.977,5 1.135,6 0.618,7 0.559,8 534.92,9 4.3,10 12,11 93,13 13,14 41,16 95,17 34,20 13,21 21,22 1,24 54,25 5,28 4,29 1,32 39,35 1.1,36 0.179,37 17,38 48,39 90.825,40 105.583,41 57.512,42 51.97,44 5.594}
{0 CHEMBL220562,1 6.81,2 43.5,3 49.4,4 0.99,5 1.119,6 0.659,7 0.617,8 578.81,9 2.4,10 24,11 85,13 25,14 47,16 89,17 37,20 25,21 12,22 1,24 42,25 6,28 2,29 4,32 43,35 4.7,36 0.169,37 15,38 60,39 84.185,40 95.138,41 56.057,42 52.438,44 6.476}
{0 CHEMBL220667,1 6.371,2 41,3 53,4 0.985,5 1.125,6 0.643,7 0.593,8 528.8,9 2.4,10 18,11 83,13 19,14 42,16 86,17 34,20 19,21 15,22 1,24 44,25 5,28 2,29 3,32 39,35 3.6,36 0.174,37 15,38 52,39 81.741,40 93.344,41 53.364,42 49.25,44 6.275}
{0 CHEMBL220689,1 6.227,2 41.5,3 53.8,4 0.979,5 1.124,6 0.646,7 0.592,8 660.04,9 2.8,10 24,11 106,13 26,14 52,16 109,17 44,20 26,21 18,22 2,24 57,25 5,28 3,29 2,32 49,35 1.9,36 0.193,37 21,38 66,39 103.817,40 119.124,41 68.484,42 62.717,44 7.337}
{0 CHEMBL220718,1 5.963,2 40.7,3 55.8,4 0.975,5 1.125,6 0.639,7 0.58,8 512.85,9 2.3,10 18,11 86,13 19,14 40,16 88,17 35,20 19,21 16,22 1,24 48,25 3,28 2,29 1,32 38,35 1.2,36 0.193,37 17,38 50,39 83.854,40 96.756,41 54.978,42 49.874,44 6.845}
{0 CHEMBL220719,1 6.215,2 38.6,3 54.2,4 0.982,5 1.133,6 0.635,7 0.583,8 515.82,9 6,10 18,11 83,13 19,14 40,16 85,17 32,20 16,21 16,22 1,24 45,25 6,28 5,29 1,32 38,35 1.2,36 0.2,37 17,38 50,39 81.508,40 94.005,41 52.711,42 48.358,44 5.069}
{0 CHEMBL220732,1 6.773,2 42.1,3 50,4 0.992,5 1.122,6 0.652,7 0.61,8 514.72,9 2.6,10 18,11 76,13 19,14 42,16 80,17 32,20 19,21 13,22 1,24 38,25 6,28 2,29 4,32 38,35 5.3,36 0.138,37 11,38 52,39 75.418,40 85.308,41 49.535,42 46.384,44 5.538}
{0 CHEMBL220823,1 6.205,2 40.2,3 54.3,4 0.983,5 1.126,6 0.637,7 0.585,8 570.89,9 2.2,10 18,11 92,13 20,14 44,16 94,17 37,20 20,21 17,22 2,24 50,25 5,28 2,29 3,32 42,35 3.3,36 0.202,37 19,38 55,39 90.392,40 103.59,41 58.648,42 53.83,44 6.334}
{0 CHEMBL220942,1 6.095,2 39.4,3 55.3,4 0.982,5 1.128,6 0.632,7 0.578,8 572.91,9 2.1,10 18,11 94,13 19,14 44,16 96,17 37,20 19,21 18,22 1,24 52,25 5,28 2,29 3,32 42,35 3.2,36 0.208,37 20,38 54,39 92.276,40 106.005,41 59.41,42 54.357,44 6.292}
{0 CHEMBL221149,1 6.129,2 39.3,3 54.8,4 0.98,5 1.13,6 0.637,7 0.582,8 514.83,9 4.8,10 18,11 84,13 19,14 40,16 86,17 33,20 17,21 16,22 1,24 46,25 5,28 4,29 1,32 38,35 1.2,36 0.198,37 17,38 50,39 82.29,40 94.922,41 53.467,42 48.863,44 6.275}
{0 CHEMBL221150,1 5.926,2 36.8,3 56.8,4 0.981,5 1.135,6 0.621,7 0.565,8 562.93,9 4.2,10 12,11 95,13 14,14 43,16 97,17 35,20 14,21 21,22 2,24 54,25 6,28 4,29 2,32 41,35 2.1,36 0.186,37 18,38 51,39 93.152,40 107.792,41 58.967,42 53.685,44 6.333}
{0 CHEMBL221151,1 6.045,2 40,3 55.3,4 0.977,5 1.128,6 0.638,7 0.581,8 513.84,9 3.5,10 18,11 85,13 19,14 40,16 87,17 34,20 18,21 16,22 1,24 47,25 4,28 3,29 1,32 38,35 1.2,36 0.195,37 17,38 50,39 83.072,40 95.839,41 54.222,42 49.369,44 6.427}
{0 CHEMBL221276,1 6.189,2 42.3,3 53.8,4 0.977,5 1.122,6 0.65,7 0.594,8 482.77,9 2.6,10 18,11 78,13 19,14 39,16 81,17 33,20 19,21 14,22 1,24 42,25 3,28 2,29 1,32 36,35 1.3,36 0.148,37 12,38 49,39 76.203,40 87.51,41 50.694,42 46.294,44 5.77}
{0 CHEMBL222722,1 6.339,2 39.8,3 53.4,4 0.986,5 1.128,6 0.638,7 0.589,8 557.85,9 3.4,10 18,11 88,13 19,14 44,16 91,17 35,20 18,21 17,22 1,24 47,25 6,28 3,29 3,32 41,35 3.4,36 0.187,37 17,38 54,39 86.727,40 99.258,41 56.131,42 51.798,44 5.719}
{0 CHEMBL222773,1 6.045,2 40,3 55.3,4 0.977,5 1.128,6 0.638,7 0.581,8 513.84,9 3.5,10 18,11 85,13 19,14 40,16 87,17 34,20 18,21 16,22 1,24 47,25 4,28 3,29 1,32 38,35 1.2,36 0.195,37 17,38 50,39 83.072,40 95.839,41 54.222,42 49.369,44 6.42}
{0 CHEMBL222895,1 6.371,2 41,3 53,4 0.985,5 1.125,6 0.643,7 0.593,8 528.8,9 2.4,10 18,11 83,13 19,14 42,16 86,17 34,20 19,21 15,22 1,24 44,25 5,28 2,29 3,32 39,35 3.6,36 0.151,37 13,38 52,39 81.741,40 93.344,41 53.364,42 49.25,44 5.824}
{0 CHEMBL223243,1 5.97,2 39,3 56,4 0.977,5 1.13,6 0.633,7 0.575,8 596.99,9 4,10 18,11 100,13 19,14 47,16 103,17 39,20 19,21 20,22 1,24 56,25 5,28 4,29 1,32 44,35 1,36 0.175,37 18,38 57,39 97.708,40 112.998,41 63.274,42 57.497,44 6.699}
{0 CHEMBL223290,1 6.574,2 42.3,3 51.3,4 0.987,5 1.122,6 0.652,7 0.605,8 512.75,9 2.6,10 18,11 78,13 19,14 42,16 82,17 33,20 19,21 14,22 1,24 40,25 5,28 2,29 3,32 38,35 3.8,36 0.134,37 11,38 52,39 76.974,40 87.514,41 50.841,42 47.196,44 6.476}
{0 CHEMBL223345,1 5.932,2 38.8,3 56.3,4 0.977,5 1.13,6 0.631,7 0.573,8 611.02,9 3.9,10 18,11 103,13 19,14 48,16 106,17 40,20 19,21 21,22 1,24 58,25 5,28 4,29 1,32 45,35 1,36 0.179,37 19,38 58,39 100.592,40 116.413,41 65.035,42 59.024,44 6.19}
{0 CHEMBL223843,1 5.713,2 37.4,3 58.2,4 0.975,5 1.133,6 0.621,7 0.56,8 519.9,9 3.3,10 12,11 91,13 13,14 40,16 93,17 34,20 13,21 21,22 1,24 53,25 4,28 3,29 1,32 38,35 1.1,36 0.183,37 17,38 47,39 88.723,40 103.084,41 56.507,42 50.949,44 6.433}
{0 CHEMBL230510,1 7.67,2 39.4,3 46.8,4 1.006,5 1.123,6 0.667,7 0.628,8 720.99,9 4.3,10 18,11 94,13 22,14 54,16 98,17 37,20 22,21 15,22 4,24 44,25 13,26 2,28 4,29 7,31 2,32 50,35 7.4,36 0.133,37 13,38 67,39 94.523,40 105.603,41 62.728,42 58.999,44 8.398}
{0 CHEMBL231522,1 7.347,2 40.7,3 47.7,4 1.002,5 1.123,6 0.661,7 0.623,8 631.86,9 3.5,10 18,11 86,13 21,14 49,16 90,17 35,20 21,21 14,22 3,24 41,25 10,26 1,28 3,29 6,31 1,32 45,35 7,36 0.111,37 10,38 61,39 86.134,40 96.56,41 56.858,42 53.549,44 7.409}
{0 CHEMBL231622,1 7.484,2 37.6,3 48.4,4 1.003,5 1.128,6 0.659,7 0.616,8 695.99,9 5.4,10 17,11 93,13 21,14 51,16 96,17 35,20 19,21 16,22 4,24 45,25 13,26 2,28 5,29 6,31 2,32 48,35 6.5,36 0.146,37 14,38 63.5,39 93.298,40 104.892,41 61.279,42 57.306,44 7.444}
{0 CHEMBL2347356,1 8.497,2 46.8,3 42.6,4 1,5 1.112,6 0.719,7 0.674,8 399.34,9 4.3,10 21,11 47,13 21,14 30,16 50,17 22,18 2,20 18,21 4,24 20,25 5,26 2,28 2,29 1,32 27,34 2,35 2.1,36 0.12,37 6,38 40.5,39 47.014,40 52.246,41 33.796,42 31.681,43 4.3,44 5.024}
{0 CHEMBL2347357,1 9,2 47.9,3 37.5,4 1.002,5 1.11,6 0.747,7 0.704,8 431.98,9 10.4,10 23,11 48,13 25,14 33,16 51,17 23,18 1,20 23,22 2,24 18,25 7,26 2,28 5,31 1,32 30,34 1,36 0.098,37 5,38 46.5,39 48.094,40 53.262,41 35.864,42 33.809,43 2.1,44 5.19}
{0 CHEMBL2347358,1 9.786,2 46.6,3 39.7,4 1.005,5 1.101,6 0.748,7 0.696,8 567.56,9 3.4,10 24,11 58,13 27,14 38,15 1,16 61,17 27,20 25,21 2,22 3,24 23,25 8,26 3,28 2,29 3,31 2,32 35,34 1,35 5.2,36 0.148,37 9,38 53,39 58.287,40 63.874,41 43.398,42 40.381,43 1.7,44 5.046}
{0 CHEMBL2347359,1 7.961,2 48.8,3 39,4 0.997,5 1.116,6 0.713,7 0.683,8 652.82,9 12.2,10 40,11 82,13 44,14 56,16 88,17 40,20 38,21 2,22 4,24 32,25 10,28 10,32 50,36 0.114,37 10,38 80,39 81.738,40 91.55,41 58.432,42 56.009,44 5.335}
{0 CHEMBL2347360,1 8.071,2 46,3 42,4 1,5 1.111,6 0.709,7 0.668,8 403.54,9 6,10 23,11 50,13 25,14 32,16 53,17 23,20 21,21 2,22 2,24 21,25 6,26 1,28 3,29 2,31 1,32 29,35 4,36 0.113,37 6,38 45.5,39 49.989,40 55.571,41 35.426,42 33.422,44 5.155}
{0 CHEMBL257594,1 7.77,2 47.8,3 41.3,4 1.001,5 1.114,6 0.696,7 0.668,8 357.44,9 6.5,10 22,11 46,13 23,14 30,16 49,17 22,20 20,21 2,22 1,24 19,25 5,28 3,29 2,32 27,35 4.3,36 0.061,37 3,38 42,39 46.029,40 51.235,41 32.017,42 30.708,44 9.886}
{0 CHEMBL262297,1 7.095,2 42.7,3 47.6,4 0.998,5 1.122,6 0.658,7 0.623,8 581.77,9 3.7,10 23,11 82,13 26,14 46,16 85,17 35,20 25,21 10,22 3,24 39,25 8,28 3,29 5,32 43,35 6.1,36 0.176,37 15,38 60.5,39 81.847,40 92.016,41 53.995,42 51.121,44 5.237}
{0 CHEMBL264770,1 6.96,2 37.6,3 49.5,4 1.003,5 1.135,6 0.633,7 0.601,8 702.94,9 5.9,10 18,11 101,13 23,14 53,16 103,17 38,20 22,21 16,22 5,24 50,25 13,28 6,29 7,32 51,35 6.9,36 0.184,37 19,38 67,39 101.341,40 114.59,41 63.966,42 60.722,44 9.046}
{0 CHEMBL266020,1 7.661,2 40.6,3 46.2,4 1.004,5 1.122,6 0.672,7 0.633,8 812.11,9 4.7,10 24,11 106,13 28,14 62,16 111,17 43,20 28,21 15,22 4,24 49,25 14,26 2,28 5,29 7,31 2,32 57,35 6.6,36 0.144,37 16,38 78,39 106.392,40 118.932,41 71.256,42 67.074,44 7.824}
{0 CHEMBL266256,1 7.579,2 38.9,3 47.4,4 1.003,5 1.125,6 0.666,7 0.624,8 720.01,9 5.3,10 18,11 95,13 22,14 54,16 99,17 37,20 22,21 15,22 4,24 45,25 13,26 2,28 5,29 6,31 2,32 50,35 6.3,36 0.131,37 13,38 67,39 95.298,40 106.892,41 63.279,42 59.306,44 8.398}
{0 CHEMBL266257,1 7.578,2 39.2,3 47.4,4 1.004,5 1.124,6 0.665,7 0.624,8 735.02,9 4.1,10 18,11 97,13 22,14 55,16 101,17 38,20 22,21 16,22 4,24 46,25 13,26 2,28 4,29 7,31 2,32 51,35 7.2,36 0.139,37 14,38 68,39 97.407,40 109.018,41 64.489,42 60.526,44 8.046}
{0 CHEMBL273338,1 6.129,2 39.3,3 54.8,4 0.98,5 1.13,6 0.637,7 0.582,8 514.83,9 4.8,10 18,11 84,13 19,14 40,16 86,17 33,20 17,21 16,22 1,24 46,25 5,28 4,29 1,32 38,35 1.2,36 0.198,37 17,38 50,39 82.29,40 94.922,41 53.467,42 48.863,44 6.192}
{0 CHEMBL284151,1 7.52,2 43.5,3 44.6,4 1.008,5 1.12,6 0.664,7 0.639,8 691.84,9 3.3,10 24,11 92,13 28,14 56,16 97,17 40,20 28,21 12,22 4,24 41,25 11,28 3,29 8,32 51,35 8.7,36 0.155,37 15,38 72,39 92.712,40 103.059,41 61.12,42 58.792,44 6.523}
{0 CHEMBL284534,1 7.23,2 41.3,3 47.1,4 1.006,5 1.124,6 0.65,7 0.621,8 751.95,9 2.9,10 24,11 104,13 27,14 60,16 109,17 43,20 27,21 16,22 3,24 49,25 12,28 3,29 9,32 55,35 8.7,36 0.147,37 16,38 75,39 104.574,40 116.929,41 67.62,42 64.614,44 8.319}
{0 CHEMBL284955,1 6.959,2 41,3 49,4 0.999,5 1.125,6 0.647,7 0.612,8 695.93,9 3,10 24,11 100,13 26,14 55,16 104,17 41,20 26,21 15,22 2,24 49,25 10,28 3,29 7,32 51,35 7,36 0.163,37 17,38 69,39 99.919,40 112.51,41 64.711,42 61.184,44 8.046}
{0 CHEMBL285133,1 7.407,2 40.5,3 47.6,4 1.005,5 1.126,6 0.656,7 0.621,8 622.22,9 3.6,10 18,11 84,13 20,14 48,16 88,17 34,18 1,20 20,21 14,22 2,24 40,25 10,26 1,28 3,29 6,32 44,34 1,35 7.1,36 0.148,37 13,38 59,39 84.381,40 94.584,41 55.069,42 52.19,43 1.2,44 8.699}
{0 CHEMBL285177,1 7.156,2 40,3 49.4,4 0.999,5 1.127,6 0.651,7 0.612,8 608.24,9 3.5,10 18,11 85,13 20,14 46,16 88,17 34,18 1,20 20,21 14,22 2,24 42,25 9,26 1,28 3,29 5,32 43,34 1,35 5.9,36 0.159,37 14,38 57,39 84.938,40 95.79,41 55.375,42 52.002,43 1.2,44 8.699}
{0 CHEMBL290115,1 7.561,2 40.7,3 46.5,4 1.008,5 1.126,6 0.657,7 0.627,8 650.23,9 3.5,10 18,11 86,13 21,14 50,16 90,17 35,18 1,20 21,21 14,22 3,24 40,25 11,26 1,28 3,29 7,32 46,34 1,35 8.1,36 0.144,37 13,38 62,39 86.709,40 96.794,41 56.523,42 53.904,43 1.2,44 8.398}
{0 CHEMBL296588,1 6.18,2 30.6,3 56.8,4 1.001,5 1.148,6 0.587,7 0.548,8 686.02,9 4.5,11 111,13 6,14 47,16 110,17 34,20 6,21 28,22 6,24 63,25 14,28 5,29 9,32 48,35 8.1,36 0.2,37 22,38 53,39 111.079,40 127.417,41 65.2,42 60.817,44 9.167}
{0 CHEMBL300891,1 7.382,2 41,3 47.4,4 1.001,5 1.122,6 0.665,7 0.625,8 575.79,9 3.8,10 18,11 78,13 21,14 44,16 81,17 32,20 21,21 11,22 3,24 37,25 9,26 1,28 3,29 5,31 1,32 41,35 6.4,36 0.111,37 9,38 56,39 78.04,40 87.52,41 51.881,42 48.781,44 7.523}
{0 CHEMBL305635,1 6.478,2 36.5,3 53.1,4 0.994,5 1.136,6 0.623,7 0.581,8 621.91,9 5.2,10 12,11 96,13 16,14 47,16 98,17 35,20 16,21 19,22 4,24 51,25 10,28 5,29 5,32 45,35 5.2,36 0.173,37 17,38 57,39 95.468,40 109.088,41 59.813,42 55.797,44 6.387}
{0 CHEMBL306829,1 6.241,2 36.6,3 54.9,4 0.99,5 1.135,6 0.62,7 0.573,8 511.78,9 3.7,10 11,11 82,13 14,14 38,16 83,17 30,20 13,21 17,22 3,24 45,25 7,28 3,29 4,32 37,35 4.9,36 0.181,37 15,38 46.5,39 81.17,40 93.052,41 50.824,42 46.986,44 7.301}
{0 CHEMBL307156,1 6.233,2 35.3,3 55.3,4 0.993,5 1.137,6 0.612,7 0.567,8 529.8,9 3.5,10 11,11 85,13 13,14 39,16 86,17 30,20 12,21 18,22 2,24 47,25 8,28 3,29 5,32 38,35 5.9,36 0.198,37 17,38 46.5,39 84.381,40 96.676,41 52.04,42 48.228,44 6.745}
{0 CHEMBL308036,1 7.095,2 42.7,3 47.6,4 0.998,5 1.122,6 0.658,7 0.623,8 581.77,9 3.7,10 23,11 82,13 26,14 46,16 85,17 35,20 25,21 10,22 3,24 39,25 8,28 3,29 5,32 43,35 6.1,36 0.176,37 15,38 60.5,39 81.847,40 92.016,41 53.995,42 51.121,44 6.252}
{0 CHEMBL309056,1 7.022,2 40,3 48.8,4 1.002,5 1.128,6 0.643,7 0.61,8 561.74,9 3.8,10 18,11 80,13 21,14 43,16 82,17 32,20 21,21 11,22 3,24 39,25 9,28 3,29 6,32 41,35 7.5,36 0.183,37 15,38 55,39 80.174,40 90.225,41 51.449,42 48.835,44 4.523}
{0 CHEMBL309721,1 6.576,2 39.8,3 51.8,4 0.991,5 1.128,6 0.639,7 0.596,8 545.79,9 3.6,10 17,11 83,13 20,14 42,16 85,17 33,20 19,21 14,22 3,24 43,25 7,28 3,29 4,32 40,35 4.8,36 0.176,37 15,38 53.5,39 82.287,40 93.637,41 53.063,42 49.459,44 7.046}
{0 CHEMBL317098,1 6.372,2 36.3,3 53.9,4 0.993,5 1.136,6 0.621,7 0.577,8 649.97,9 4.9,10 12,11 102,13 16,14 49,16 104,17 37,20 16,21 21,22 4,24 55,25 10,28 5,29 5,32 47,35 4.9,36 0.173,37 18,38 59,39 101.236,40 115.919,41 63.336,42 58.851,44 6.222}
{0 CHEMBL318055,1 6.359,2 36.1,3 54.2,4 0.994,5 1.136,6 0.618,7 0.575,8 527.78,9 3.6,10 11,11 83,13 14,14 39,16 84,17 30,20 13,21 17,22 3,24 45,25 8,28 3,29 5,32 38,35 6,36 0.19,37 16,38 47.5,39 82.498,40 94.261,41 51.279,42 47.701,44 6.745}
{0 CHEMBL319800,1 6.688,2 39.3,3 51.2,4 0.995,5 1.129,6 0.637,7 0.597,8 561.79,9 3.6,10 17,11 84,13 20,14 43,16 86,17 33,20 19,21 14,22 3,24 43,25 8,28 3,29 5,32 41,35 6,36 0.186,37 16,38 54.5,39 83.614,40 94.846,41 53.518,42 50.174,44 5.252}
{0 CHEMBL322979,1 9.097,2 41.8,3 41.8,4 1.028,5 1.136,6 0.67,7 0.652,8 609.48,9 3,10 18,11 67,13 20,14 41,15 1,16 69,17 28,20 20,21 8,22 2,23 3,24 28,25 11,26 1,28 2,29 5,32 39,34 4,35 7.5,36 0.188,37 13,38 52,39 68.861,40 76.132,41 44.87,42 43.694,43 6,44 6.409}
{0 CHEMBL323465,1 6.967,2 40.7,3 50,4 0.993,5 1.126,6 0.655,7 0.611,8 752.48,9 4.6,10 24,11 108,13 27,14 58,16 112,17 44,18 1,20 27,21 17,22 3,24 54,25 10,26 1,28 5,29 4,32 54,34 1,35 3.7,36 0.161,37 18,38 73,39 107.232,40 121.653,41 70.739,42 65.964,43 0.9,44 6.31}
{0 CHEMBL323685,1 6.621,2 33.1,3 52.9,4 1.004,5 1.145,6 0.607,7 0.573,8 801.12,9 6.6,10 6,11 121,13 14,14 58,16 122,17 40,20 14,21 26,22 8,24 64,25 17,28 8,29 9,32 57,35 7.4,36 0.098,37 12,38 69,39 121.501,40 138.497,41 73.455,42 69.355,44 5.824}
{0 CHEMBL324009,1 7.755,2 35.2,3 49.5,4 1.009,5 1.138,6 0.635,7 0.601,8 705.73,9 6.6,10 12,11 91,13 17,14 47,15 1,16 92,17 32,20 16,21 16,22 5,24 45,25 14,26 1,28 6,29 7,32 46,34 1,35 7.7,36 0.196,37 18,38 58,39 91.803,40 103.601,41 57.796,42 54.693,43 1.1,44 7.824}
{0 CHEMBL324737,1 7.914,2 36,3 49.3,4 1.008,5 1.135,6 0.641,7 0.605,8 593.58,9 5.3,10 12,11 75,13 15,14 39,15 1,16 76,17 27,20 14,21 13,22 3,24 37,25 11,26 1,28 4,29 6,32 38,34 1,35 8,36 0.211,37 16,38 48,39 75.621,40 85.15,41 48.046,42 45.355,43 1.3,44 6.606}
{0 CHEMBL325240,1 7.996,2 39,3 47.6,4 1.006,5 1.129,6 0.656,7 0.621,8 655.65,9 4.9,10 18,11 82,13 21,14 45,15 1,16 84,17 32,20 20,21 12,22 3,24 39,25 11,26 1,28 4,29 6,32 43,34 1,35 7.3,36 0.19,37 16,38 57,39 82.505,40 92.565,41 53.807,42 50.882,43 1.2,44 7.538}
{0 CHEMBL325768,1 6.888,2 35.2,3 50.5,4 1.006,5 1.14,6 0.62,7 0.59,8 626.84,9 6.6,10 12,11 91,13 17,14 46,16 92,17 32,20 16,21 16,22 5,24 46,25 13,28 6,29 7,32 45,35 7.7,36 0.196,37 18,38 57,39 91.574,40 103.76,41 56.444,42 53.668,44 7.959}
{0 CHEMBL32684,1 6.893,2 40.8,3 49.5,4 0.998,5 1.125,6 0.645,7 0.609,8 709.96,9 2.9,10 24,11 103,13 26,14 56,16 107,17 42,20 26,21 16,22 2,24 51,25 10,28 3,29 7,32 52,35 6.8,36 0.159,37 17,38 70,39 102.803,40 115.926,41 66.472,42 62.711,44 8.387}
{0 CHEMBL329085,1 7.009,2 42.4,3 48.2,4 0.997,5 1.123,6 0.656,7 0.619,8 595.8,9 3.5,10 23,11 85,13 26,14 47,16 88,17 36,20 25,21 11,22 3,24 41,25 8,28 3,29 5,32 44,35 5.9,36 0.182,37 16,38 61.5,39 84.73,40 95.431,41 55.756,42 52.647,44 4.921}
{0 CHEMBL32997,1 7.692,2 44.2,3 43.3,4 1.011,5 1.118,6 0.669,7 0.647,8 799.94,9 2.9,10 30,11 104,13 34,14 65,16 110,17 46,20 34,21 12,22 4,24 45,25 13,28 3,29 10,32 59,35 9.6,36 0.164,37 18,38 84,39 105.134,40 116.308,41 69.552,42 67.275,44 7}
{0 CHEMBL33989,1 7.246,2 40.2,3 48.8,4 1.001,5 1.127,6 0.654,7 0.616,8 594.21,9 3.7,10 18,11 82,13 20,14 45,16 85,17 33,18 1,20 20,21 13,22 2,24 40,25 9,26 1,28 3,29 5,32 42,34 1,35 6.1,36 0.165,37 14,38 56,39 82.054,40 92.375,41 53.614,42 50.475,43 1.2,44 8.367}
{0 CHEMBL34051,1 8.119,2 44.2,3 41.9,4 1.015,5 1.118,6 0.68,7 0.658,8 698.22,9 3.5,10 24,11 86,13 28,14 55,16 91,17 38,18 1,20 28,21 10,22 4,24 36,25 12,26 1,28 3,29 8,32 50,34 1,35 9.3,36 0.165,37 15,38 71,39 87.269,40 96.173,41 58.455,42 56.566,43 1.2,44 6.658}
{0 CHEMBL34323,1 7.463,2 40.2,3 47.1,4 1.006,5 1.127,6 0.656,7 0.623,8 649.25,9 4.6,10 18,11 87,13 21,14 50,16 91,17 35,18 1,20 21,21 14,22 3,24 41,25 11,26 1,28 4,29 6,32 46,34 1,35 6.9,36 0.143,37 13,38 62,39 87.483,40 98.082,41 57.074,42 54.211,43 1.1,44 8.523}
{0 CHEMBL349421,1 8.376,2 40.8,3 44.7,4 1.008,5 1.126,6 0.672,7 0.64,8 636.6,9 6.6,10 18,11 76,13 22,14 45,15 1,16 79,17 31,20 21,21 10,22 4,24 34,25 11,26 1,28 5,29 5,32 42,34 1,35 6.6,36 0.152,37 12,38 58,39 76.629,40 85.608,41 51.074,42 48.608,43 1.3,44 5.721}
{0 CHEMBL349736,1 7.087,2 41.1,3 47.8,4 0.999,5 1.127,6 0.653,7 0.619,8 637.85,9 5.6,10 24,11 90,13 27,14 50,16 93,17 37,20 26,21 11,22 3,24 43,25 10,28 5,29 5,32 47,35 5.6,36 0.172,37 16,38 65,39 89.934,40 101.427,41 58.768,42 55.69,44 5.845}
{0 CHEMBL349737,1 7.087,2 41.1,3 47.8,4 0.999,5 1.127,6 0.653,7 0.619,8 637.85,9 5.6,10 24,11 90,13 27,14 50,16 93,17 37,20 26,21 11,22 3,24 43,25 10,28 5,29 5,32 47,35 5.6,36 0.172,37 16,38 65,39 89.934,40 101.427,41 58.768,42 55.69,44 6.421}
{0 CHEMBL351939,1 7.37,2 43,3 45.3,4 1.002,5 1.123,6 0.666,7 0.635,8 633.81,9 5.8,10 24,11 86,13 28,14 51,16 90,17 37,20 27,21 10,22 4,24 39,25 10,28 5,29 5,32 47,35 5.8,36 0.144,37 13,38 67,39 86.167,40 96.597,41 57.245,42 54.637,44 6.032}
{0 CHEMBL353118,1 7.068,2 41.9,3 47.7,4 0.997,5 1.126,6 0.658,7 0.621,8 607.82,9 5.8,10 24,11 86,13 27,14 48,16 89,17 36,20 26,21 10,22 3,24 41,25 9,28 5,29 4,32 45,35 4.7,36 0.169,37 15,38 63,39 85.723,40 96.803,41 56.552,42 53.449,44 6.932}
{0 CHEMBL353782,1 7.092,2 39.7,3 47.9,4 1.001,5 1.131,6 0.647,7 0.615,8 517.69,9 6.8,10 18,11 73,13 21,14 40,16 75,17 29,20 20,21 9,22 3,24 35,25 9,28 5,29 4,32 38,35 5.5,36 0.173,37 13,38 52,39 73.072,40 82.557,41 47.267,42 44.868,44 5.699}
{0 CHEMBL363286,1 6.96,2 37.6,3 49.5,4 1.003,5 1.135,6 0.633,7 0.601,8 702.94,9 5.9,10 18,11 101,13 23,14 53,16 103,17 38,20 22,21 16,22 5,24 50,25 13,28 6,29 7,32 51,35 6.9,36 0.184,37 19,38 67,39 101.341,40 114.59,41 63.966,42 60.722,44 8.357}
{0 CHEMBL363692,1 7.598,2 42.5,3 45.2,4 1.015,5 1.136,6 0.652,7 0.63,8 554.66,9 2.7,10 18,11 73,13 20,14 43,16 76,17 31,20 20,21 11,22 2,23 3,24 33,25 9,28 2,29 4,32 40,34 3,35 5.5,36 0.145,37 11,38 54,39 74.072,40 82.912,41 47.586,42 46.007,43 4.1,44 6.67}
{0 CHEMBL364630,1 6.843,2 39.3,3 50,4 0.998,5 1.13,6 0.64,7 0.603,8 574.79,9 4.8,10 18,11 84,13 21,14 44,16 86,17 33,20 20,21 13,22 3,24 42,25 9,28 4,29 5,32 42,35 6,36 0.186,37 16,38 56,39 83.832,40 94.929,41 53.762,42 50.669,44 7.796}
{0 CHEMBL365935,1 7.637,2 39.5,3 45.3,4 1.02,5 1.141,6 0.64,7 0.622,8 656.77,9 4.7,10 18,11 86,13 22,14 49,16 88,17 34,20 22,21 12,22 4,23 3,24 39,25 13,28 4,29 6,32 47,34 3,35 7,36 0.182,37 16,38 62,39 87.698,40 98.158,41 55.029,42 53.533,43 3.5,44 7.319}
{0 CHEMBL366393,1 9.348,2 39.5,3 44.7,4 1.017,5 1.124,6 0.675,7 0.642,8 710.46,9 2.6,10 12,11 76,13 16,14 45,15 2,16 79,17 30,20 18,21 12,22 4,24 34,25 12,26 2,28 2,29 8,32 42,34 2,35 10.5,36 0.165,37 13,38 55,39 77.301,40 85.413,41 51.296,42 48.767,43 2.6,44 7.328}
{0 CHEMBL366394,1 7.342,2 43.8,3 45.8,4 1.004,5 1.119,6 0.663,7 0.634,8 704.88,9 2.1,10 24,11 96,13 28,14 57,16 101,17 42,20 30,21 12,22 4,24 44,25 10,28 2,29 8,32 52,35 8.3,36 0.149,37 15,38 73,39 96.378,40 107.391,41 63.637,42 60.824,44 7.538}
{0 CHEMBL367044,1 7.429,2 40,3 46,4 1.012,5 1.128,6 0.646,7 0.623,8 742.9,9 4,10 22,11 100,13 26,14 59,16 105,17 40,20 24,21 16,22 4,24 46,25 14,28 4,29 10,32 54,35 10,36 0.143,37 15,38 74,39 101.236,40 112.806,41 64.557,42 62.296,44 6.742}
{0 CHEMBL367192,1 7.676,2 38.9,3 44.4,4 1.019,5 1.132,6 0.643,7 0.627,8 828.96,9 5.6,10 24,11 108,13 28,14 65,16 113,17 42,20 26,21 16,22 4,24 48,25 18,28 6,29 12,32 60,35 11.1,36 0.168,37 19,38 81,39 110.094,40 122.222,41 69.478,42 67.769,44 7.886}
{0 CHEMBL367384,1 7.418,2 43.2,3 45.5,4 1.007,5 1.12,6 0.66,7 0.634,8 652.8,9 2.3,10 24,11 88,13 26,14 53,16 93,17 38,20 26,21 12,22 2,24 40,25 10,28 2,29 8,32 48,35 9.1,36 0.14,37 13,38 67,39 88.61,40 98.561,41 58.114,42 55.77,44 7.071}
{0 CHEMBL367562,1 7.529,2 46,3 44,4 1.004,5 1.114,6 0.676,7 0.648,8 752.92,9 2,10 24,11 100,13 30,14 61,16 105,17 46,19 4,20 30,21 12,22 4,24 44,25 10,28 2,29 8,32 56,33 2,35 8,36 0.124,37 13,38 81,39 100.378,40 111.391,41 67.637,42 64.824,44 7.387}
{0 CHEMBL367607,1 7.509,2 39.6,3 45.8,4 1.018,5 1.127,6 0.64,7 0.622,8 720.84,9 2.1,10 12,11 96,13 20,14 55,16 99,17 38,20 24,21 14,22 8,24 44,25 14,28 2,29 12,32 52,35 12.5,36 0.192,37 19,38 69,39 97.687,40 108.229,41 61.455,42 59.683,44 8.051}
{0 CHEMBL368479,1 7.186,2 43.1,3 47.1,4 1.001,5 1.12,6 0.658,7 0.626,8 732.94,9 2,10 24,11 102,13 28,14 59,16 107,17 44,20 30,21 14,22 4,24 48,25 10,28 2,29 8,32 54,35 7.8,36 0.14,37 15,38 75,39 102.145,40 114.221,41 67.16,42 63.878,44 6.889}
{0 CHEMBL369171,1 7.509,2 42.5,3 45,4 1.011,5 1.122,6 0.657,7 0.634,8 600.72,9 2.5,10 12,11 80,13 18,14 47,16 83,17 34,19 4,20 18,21 12,22 4,24 36,25 10,28 2,29 8,32 44,33 2,35 10,36 0.157,37 13,38 61,39 80.843,40 89.73,41 52.591,42 50.717,44 7.432}
{0 CHEMBL369831,1 7.774,2 43.1,3 43.1,4 1.017,5 1.12,6 0.661,7 0.644,8 792.9,9 2,10 24,11 102,13 28,14 65,16 109,17 44,20 30,21 14,22 4,24 44,25 14,28 2,29 12,32 58,35 11.8,36 0.138,37 15,38 81,39 103.687,40 114.229,41 67.455,42 65.683,44 7.854}
{0 CHEMBL369870,1 7.717,2 43.8,3 43.8,4 1.015,5 1.126,6 0.662,7 0.642,8 740.86,9 2.1,10 24,11 96,13 28,14 59,16 101,17 42,20 30,21 12,22 4,23 2,24 42,25 12,28 2,29 8,32 54,34 2,35 8.3,36 0.149,37 15,38 75,39 97.403,40 108.07,41 63.512,42 61.591,43 2.1,44 7.229}
{0 CHEMBL370086,1 7.171,2 38.3,3 49.4,4 1,5 1.129,6 0.65,7 0.609,8 580.82,9 4.9,10 17,11 81,13 20,14 43,16 83,17 31,20 18,21 13,22 3,24 40,25 10,26 1,28 4,29 5,31 1,32 41,35 6.2,36 0.193,37 16,38 54.5,39 81.025,40 91.434,41 52.648,42 49.329,44 7.886}
{0 CHEMBL370422,1 9.13,2 38.3,3 45.7,4 1.016,5 1.127,6 0.667,7 0.634,8 739.51,9 3.7,10 12,11 81,13 17,14 46,15 2,16 83,17 31,20 19,21 12,22 5,24 37,25 13,26 2,28 3,29 8,32 44,34 2,35 9.9,36 0.205,37 17,38 57,39 82.287,40 91.327,41 54.063,42 51.315,43 2.5,44 8}
{0 CHEMBL370424,1 9.323,2 39,3 43.9,4 1.018,5 1.127,6 0.674,7 0.644,8 764.52,9 4.9,10 16,11 82,13 21,14 49,15 2,16 85,17 32,20 21,21 11,22 5,24 36,25 14,26 2,28 4,29 8,32 46,34 2,35 9.8,36 0.188,37 16,38 62,39 83.505,40 92.41,41 55.307,42 52.81,43 2.4,44 8.222}
{0 CHEMBL371082,1 7.986,2 38.6,3 44.6,4 1.023,5 1.141,6 0.65,7 0.629,8 662.8,9 4.8,10 17,11 83,13 21,14 48,16 85,17 32,20 20,21 12,22 4,23 3,24 37,25 14,26 1,28 4,29 6,31 1,32 46,34 3,35 7.2,36 0.188,37 16,38 60.5,39 84.89,40 94.662,41 53.915,42 52.194,43 3.6,44 7.26}
{0 CHEMBL371182,1 7.113,2 39.1,3 48.3,4 1.006,5 1.13,6 0.64,7 0.61,8 618.8,9 4.6,10 18,11 87,13 21,14 48,16 90,17 34,20 20,21 14,22 3,24 42,25 11,28 4,29 7,32 45,35 8,36 0.178,37 16,38 60,39 87.487,40 98.348,41 55.671,42 53.098,44 7.347}
{0 CHEMBL371256,1 8.971,2 38.1,3 46.4,4 1.014,5 1.128,6 0.665,7 0.629,8 753.54,9 3.6,10 12,11 84,13 17,14 47,15 2,16 86,17 32,20 19,21 13,22 5,24 39,25 13,26 2,28 3,29 8,32 45,34 2,35 9.5,36 0.174,37 15,38 58,39 85.17,40 94.742,41 55.824,42 52.842,43 2.4,44 6.848}
{0 CHEMBL371417,1 7.234,2 36.7,3 49,4 1.005,5 1.134,6 0.641,7 0.606,8 708.97,9 6.1,10 17,11 98,13 22,14 52,16 100,17 36,20 20,21 16,22 5,24 48,25 14,26 1,28 6,29 7,31 1,32 50,35 7.1,36 0.19,37 19,38 65.5,39 98.534,40 111.095,41 62.853,42 59.382,44 8.721}
{0 CHEMBL371522,1 7.444,2 42.6,3 45.4,4 1.008,5 1.122,6 0.658,7 0.633,8 803.98,9 2.8,10 24,11 108,13 31,14 63,16 112,17 46,20 33,21 13,22 7,24 49,25 13,28 3,29 10,32 59,35 9.3,36 0.179,37 20,38 82,39 108.901,40 121.139,41 71.074,42 68.329,44 6.839}
{0 CHEMBL372618,1 7.768,2 42.3,3 43.3,4 1.017,5 1.122,6 0.658,7 0.641,8 807.92,9 2.9,10 24,11 104,13 29,14 65,16 110,17 44,20 31,21 13,22 5,24 45,25 15,28 3,29 12,32 59,35 11.5,36 0.164,37 18,38 82,39 105.789,40 116.727,41 68.461,42 66.705,44 7.959}
{0 CHEMBL373047,1 8.844,2 39.5,3 46.5,4 1.007,5 1.126,6 0.673,7 0.633,8 760.58,9 4.7,10 22,11 86,13 24,14 49,15 2,16 89,17 34,20 20,21 14,22 2,24 40,25 12,26 2,28 4,29 6,32 46,34 2,35 7,36 0.169,37 15,38 62,39 86.618,40 96.822,41 57.921,42 54.434,43 2.3,44 5.301}
{0 CHEMBL373671,1 6.503,2 41.6,3 51.9,4 0.987,5 1.124,6 0.647,7 0.6,8 500.74,9 2.6,10 18,11 77,13 19,14 40,16 80,17 32,20 19,21 13,22 1,24 40,25 5,28 2,29 3,32 37,35 3.9,36 0.163,37 13,38 50,39 75.974,40 86.514,41 49.841,42 46.196,44 5.818}
{0 CHEMBL374329,1 6.257,2 40.4,3 53.9,4 0.983,5 1.126,6 0.639,7 0.588,8 556.86,9 2.2,10 18,11 89,13 19,14 44,16 92,17 36,20 19,21 17,22 1,24 48,25 5,28 2,29 3,32 41,35 3.4,36 0.185,37 17,38 54,39 87.508,40 100.174,41 56.887,42 52.304,44 6.996}
{0 CHEMBL374456,1 6.045,2 40,3 55.3,4 0.977,5 1.128,6 0.638,7 0.581,8 513.84,9 3.5,10 18,11 85,13 19,14 40,16 87,17 34,20 18,21 16,22 1,24 47,25 4,28 3,29 1,32 38,35 1.2,36 0.195,37 17,38 50,39 83.072,40 95.839,41 54.222,42 49.369,44 6.23}
{0 CHEMBL374558,1 6.598,2 36.6,3 52.3,4 0.997,5 1.136,6 0.624,7 0.585,8 1009.44,9 5.2,10 23,11 153,13 29,14 76,16 156,17 56,20 27,21 29,22 6,24 80,25 17,28 8,29 9,32 73,35 5.9,36 0.192,37 30,38 93.5,39 152.57,40 173.818,41 95.547,42 89.569,44 7.58}
{0 CHEMBL375124,1 6.268,2 40.9,3 53.8,4 0.983,5 1.125,6 0.641,7 0.59,8 582.9,9 2.2,10 18,11 93,13 20,14 46,16 96,17 38,20 20,21 18,22 2,24 50,25 5,28 2,29 3,32 43,35 3.2,36 0.156,37 15,38 57,39 91.392,40 104.59,41 59.648,42 54.83,44 8.222}
{0 CHEMBL375125,1 6.625,2 44,3 50.5,4 0.985,5 1.118,6 0.661,7 0.613,8 602.88,9 2.2,10 24,11 91,13 25,14 50,16 96,17 40,20 25,21 15,22 1,24 46,25 5,28 2,29 3,32 45,35 3.3,36 0.135,37 13,38 63,39 89.625,40 101.759,41 60.126,42 55.777,44 6.721}
{0 CHEMBL375169,1 5.999,2 39.8,3 55.7,4 0.977,5 1.128,6 0.636,7 0.578,8 527.87,9 3.4,10 18,11 88,13 19,14 41,16 90,17 35,20 19,21 16,22 1,24 49,25 4,28 3,29 1,32 39,35 1.1,36 0.2,37 18,38 51,39 85.956,40 99.254,41 55.984,42 50.895,44 6.65}
{0 CHEMBL375225,1 5.914,2 39.4,3 56.4,4 0.976,5 1.129,6 0.633,7 0.574,8 555.93,9 3.2,10 18,11 94,13 19,14 43,16 96,17 37,20 19,21 18,22 1,24 53,25 4,28 3,29 1,32 41,35 1.1,36 0.198,37 19,38 53,39 91.723,40 106.084,41 59.507,42 53.949,44 6.539}
{0 CHEMBL375310,1 5.955,2 39.6,3 56,4 0.976,5 1.128,6 0.635,7 0.576,8 541.9,9 3.3,10 18,11 91,13 19,14 42,16 93,17 36,20 19,21 17,22 1,24 51,25 4,28 3,29 1,32 40,35 1.1,36 0.194,37 18,38 52,39 88.839,40 102.669,41 57.745,42 52.422,44 6.241}
{0 CHEMBL375351,1 6.505,2 43.3,3 51.5,4 0.983,5 1.119,6 0.656,7 0.606,8 630.94,9 2.1,10 24,11 97,13 25,14 52,16 102,17 42,20 25,21 17,22 1,24 50,25 5,28 2,29 3,32 47,35 3.1,36 0.147,37 15,38 65,39 95.392,40 108.59,41 63.648,42 58.83,44 6.783}
{0 CHEMBL375526,1 6.045,2 40,3 55.3,4 0.977,5 1.128,6 0.638,7 0.581,8 513.84,9 3.5,10 18,11 85,13 19,14 40,16 87,17 34,20 18,21 16,22 1,24 47,25 4,28 3,29 1,32 38,35 1.2,36 0.195,37 17,38 50,39 83.072,40 95.839,41 54.222,42 49.369,44 6.674}
{0 CHEMBL375835,1 6.079,2 39.1,3 55.2,4 0.979,5 1.13,6 0.635,7 0.579,8 528.86,9 4.6,10 18,11 87,13 19,14 41,16 89,17 34,20 18,21 16,22 1,24 48,25 5,28 4,29 1,32 39,35 1.1,36 0.202,37 18,38 51,39 85.174,40 98.337,41 55.228,42 50.39,44 5.741}
{0 CHEMBL375836,1 6.129,2 39.3,3 54.8,4 0.98,5 1.13,6 0.637,7 0.582,8 514.83,9 4.8,10 18,11 84,13 19,14 40,16 86,17 33,20 17,21 16,22 1,24 46,25 5,28 4,29 1,32 38,35 1.2,36 0.198,37 17,38 50,39 82.29,40 94.922,41 53.467,42 48.863,44 5.342}
{0 CHEMBL375970,1 6.032,2 38.9,3 55.6,4 0.978,5 1.131,6 0.633,7 0.577,8 542.89,9 4.4,10 18,11 90,13 19,14 42,16 92,17 35,20 18,21 17,22 1,24 50,25 5,28 4,29 1,32 40,35 1.1,36 0.196,37 18,38 52,39 88.057,40 101.752,41 56.989,42 51.917,44 5.521}
{0 CHEMBL376250,1 6.655,2 37.9,3 51.6,4 0.996,5 1.133,6 0.631,7 0.592,8 825.17,9 4.8,10 23,11 124,13 27,14 63,16 127,17 47,20 25,21 22,22 4,24 64,25 13,28 6,29 7,32 60,35 5.6,36 0.189,37 24,38 78.5,39 123.526,40 140.496,41 78.296,42 73.409,44 7.951}
{0 CHEMBL381027,1 9.846,2 40.6,3 42,4 1.021,5 1.123,6 0.689,7 0.659,8 679.4,9 4.3,10 17,11 69,13 20,14 43,15 2,16 72,17 28,20 19,21 9,22 3,24 29,25 12,26 2,28 3,29 7,32 40,34 2,35 10.1,36 0.181,37 13,38 54.5,39 70.425,40 77.457,41 47.563,42 45.493,43 2.9,44 5.469}
{0 CHEMBL382274,1 9.775,2 35.4,3 44.6,4 1.027,5 1.133,6 0.662,7 0.634,8 635.35,9 4.6,10 6,11 65,13 11,14 37,15 2,16 66,17 23,20 13,21 10,22 5,24 29,25 13,26 2,28 3,29 8,32 36,34 2,35 12.3,36 0.197,37 13,38 45,39 66.752,40 73.666,41 43.017,42 41.208,43 3.1,44 6.445}
{0 CHEMBL385329,1 5.926,2 36.8,3 56.8,4 0.981,5 1.135,6 0.621,7 0.565,8 562.93,9 4.2,10 12,11 95,13 14,14 43,16 97,17 35,20 14,21 21,22 2,24 54,25 6,28 4,29 2,32 41,35 2.1,36 0.186,37 18,38 51,39 93.152,40 107.792,41 58.967,42 53.685,44 6.695}
{0 CHEMBL387156,1 6.129,2 39.3,3 54.8,4 0.98,5 1.13,6 0.637,7 0.582,8 514.83,9 4.8,10 18,11 84,13 19,14 40,16 86,17 33,20 17,21 16,22 1,24 46,25 5,28 4,29 1,32 38,35 1.2,36 0.198,37 17,38 50,39 82.29,40 94.922,41 53.467,42 48.863,44 6.133}
{0 CHEMBL387314,1 6.272,2 41.7,3 53.4,4 0.98,5 1.123,6 0.648,7 0.594,8 646.01,9 2.9,10 24,11 103,13 26,14 51,16 106,17 43,20 26,21 17,22 2,24 55,25 5,28 3,29 2,32 48,35 1.9,36 0.189,37 20,38 65,39 100.934,40 115.709,41 66.722,42 61.191,44 7.143}
{0 CHEMBL387315,1 6.184,2 41.3,3 54.1,4 0.979,5 1.124,6 0.644,7 0.589,8 674.07,9 2.8,10 24,11 109,13 26,14 53,16 112,17 45,20 26,21 19,22 2,24 59,25 5,28 3,29 2,32 50,35 1.8,36 0.188,37 21,38 67,39 106.701,40 122.539,41 70.245,42 64.244,44 7.041}
{0 CHEMBL387316,1 6.311,2 38.7,3 53.8,4 0.986,5 1.131,6 0.633,7 0.584,8 586.9,9 4.3,10 18,11 93,13 20,14 45,16 95,17 36,20 19,21 17,22 2,24 50,25 7,28 4,29 3,32 43,35 3.2,36 0.2,37 19,38 56,39 91.712,40 105.171,41 58.898,42 54.346,44 6.812}
{0 CHEMBL389083,1 7.578,2 39.2,3 47.4,4 1.004,5 1.124,6 0.665,7 0.624,8 735.02,9 4.1,10 18,11 97,13 22,14 55,16 101,17 38,20 22,21 16,22 4,24 46,25 13,26 2,28 4,29 7,31 2,32 51,35 7.2,36 0.139,37 14,38 68,39 97.407,40 109.018,41 64.489,42 60.526,44 8.398}
{0 CHEMBL394358,1 7.351,2 37.1,3 49.5,4 1.003,5 1.128,6 0.652,7 0.609,8 713.02,9 4.1,10 12,11 97,13 16,14 53,16 101,17 36,20 16,21 20,22 4,24 48,25 13,26 2,28 4,29 7,31 2,32 49,35 7.2,36 0.129,37 13,38 63,39 97.29,40 109.433,41 63.25,42 59.053,44 8.301}
{0 CHEMBL394359,1 7.49,2 39.6,3 47.9,4 1.001,5 1.123,6 0.667,7 0.623,8 719.02,9 4.2,10 18,11 96,13 22,14 54,16 100,17 38,20 22,21 16,22 4,24 46,25 12,26 2,28 4,29 6,31 2,32 50,35 6.3,36 0.13,37 13,38 67,39 96.079,40 107.809,41 64.035,42 59.811,44 8.301}
{0 CHEMBL394360,1 7.579,2 38.9,3 47.4,4 1.003,5 1.125,6 0.666,7 0.624,8 720.01,9 5.3,10 18,11 95,13 22,14 54,16 99,17 37,20 22,21 15,22 4,24 45,25 13,26 2,28 5,29 6,31 2,32 50,35 6.3,36 0.131,37 13,38 67,39 95.298,40 106.892,41 63.279,42 59.306,44 10}
{0 CHEMBL404394,1 7.406,2 47.9,3 43.8,4 0.991,5 1.113,6 0.694,7 0.657,8 355.47,9 6.3,10 22,11 48,13 23,14 30,16 51,17 23,20 20,21 3,22 1,24 21,25 4,28 3,29 1,32 27,35 2.1,36 0.059,37 3,38 42,39 47.585,40 53.441,41 33.324,42 31.52,44 8.398}
{0 CHEMBL410049,1 8.659,2 37,3 47.8,4 1.011,5 1.131,6 0.656,7 0.619,8 796.62,9 4.3,10 12,11 92,13 18,14 49,15 2,16 93,17 34,20 20,21 14,22 6,24 44,25 14,26 2,28 4,29 8,32 48,34 2,35 8.7,36 0.183,37 17,38 61,39 93.039,40 104.071,41 60.353,42 56.917,43 2.2,44 5.824}
{0 CHEMBL410591,1 7.579,2 38.9,3 47.4,4 1.003,5 1.125,6 0.666,7 0.624,8 720.01,9 5.3,10 18,11 95,13 22,14 54,16 99,17 37,20 22,21 15,22 4,24 45,25 13,26 2,28 5,29 6,31 2,32 50,35 6.3,36 0.131,37 13,38 67,39 95.298,40 106.892,41 63.279,42 59.306,44 7.921}
{0 CHEMBL411155,1 7.989,2 41.1,3 44.2,4 1.01,5 1.12,6 0.678,7 0.644,8 758.99,9 4.2,10 18,11 95,13 24,14 58,16 100,17 39,20 25,21 14,22 6,24 42,25 14,26 2,28 4,29 8,31 2,32 53,35 8.4,36 0.12,37 12,38 73,39 95.967,40 106.397,41 64.421,42 61.187,44 8.046}
{0 CHEMBL411384,1 6.407,2 34.4,3 54.3,4 0.999,5 1.14,6 0.609,7 0.57,8 967.4,9 4,10 12,11 151,13 19,14 70,16 152,17 52,20 19,21 33,22 7,24 82,25 17,28 6,29 11,32 69,35 7.3,36 0.217,37 33,38 83,39 150.788,40 172.071,41 91.967,42 86.01,44 7.959}
{0 CHEMBL411559,1 7.49,2 39.6,3 47.9,4 1.001,5 1.123,6 0.667,7 0.623,8 719.02,9 4.2,10 18,11 96,13 22,14 54,16 100,17 38,20 22,21 16,22 4,24 46,25 12,26 2,28 4,29 6,31 2,32 50,35 6.3,36 0.13,37 13,38 67,39 96.079,40 107.809,41 64.035,42 59.811,44 9.699}
{0 CHEMBL411605,1 7.49,2 39.6,3 47.9,4 1.001,5 1.123,6 0.667,7 0.623,8 719.02,9 4.2,10 18,11 96,13 22,14 54,16 100,17 38,20 22,21 16,22 4,24 46,25 12,26 2,28 4,29 6,31 2,32 50,35 6.3,36 0.13,37 13,38 67,39 96.079,40 107.809,41 64.035,42 59.811,44 7.745}
{0 CHEMBL411607,1 7.67,2 39.4,3 46.8,4 1.006,5 1.123,6 0.667,7 0.628,8 720.99,9 4.3,10 18,11 94,13 22,14 54,16 98,17 37,20 22,21 15,22 4,24 44,25 13,26 2,28 4,29 7,31 2,32 50,35 7.4,36 0.133,37 13,38 67,39 94.523,40 105.603,41 62.728,42 58.999,44 7.796}
{0 CHEMBL411608,1 7.67,2 39.4,3 46.8,4 1.006,5 1.123,6 0.667,7 0.628,8 720.99,9 4.3,10 18,11 94,13 22,14 54,16 98,17 37,20 22,21 15,22 4,24 44,25 13,26 2,28 4,29 7,31 2,32 50,35 7.4,36 0.133,37 13,38 67,39 94.523,40 105.603,41 62.728,42 58.999,44 10}
{0 CHEMBL411609,1 7.578,2 39.2,3 47.4,4 1.004,5 1.124,6 0.665,7 0.624,8 735.02,9 4.1,10 18,11 97,13 22,14 55,16 101,17 38,20 22,21 16,22 4,24 46,25 13,26 2,28 4,29 7,31 2,32 51,35 7.2,36 0.139,37 14,38 68,39 97.407,40 109.018,41 64.489,42 60.526,44 7.77}
{0 CHEMBL411610,1 7.581,2 39.8,3 47.3,4 1.002,5 1.123,6 0.67,7 0.627,8 704.99,9 4.3,10 18,11 93,13 22,14 53,16 97,17 37,20 22,21 15,22 4,24 44,25 12,26 2,28 4,29 6,31 2,32 49,35 6.5,36 0.134,37 13,38 66,39 93.196,40 104.394,41 62.273,42 58.285,44 10}
{0 CHEMBL413461,1 6.609,2 36.1,3 52.3,4 0.998,5 1.138,6 0.623,7 0.584,8 1024.46,9 5.8,10 23,11 155,13 29,14 77,16 158,17 56,20 27,21 29,22 6,24 81,25 18,28 9,29 9,32 74,35 5.8,36 0.203,37 32,38 94.5,39 154.672,40 176.317,41 96.552,42 90.591,44 7.975}
{0 CHEMBL414640,1 7.677,2 37.9,3 47.1,4 1.006,5 1.127,6 0.664,7 0.624,8 667.93,9 5.7,10 17,11 87,13 21,14 49,16 90,17 33,20 19,21 14,22 4,24 41,25 13,26 2,28 5,29 6,31 2,32 46,35 6.9,36 0.156,37 14,38 61.5,39 87.53,40 98.062,41 57.756,42 54.252,44 6}
{0 CHEMBL418961,1 6.701,2 35.8,3 51.9,4 1.002,5 1.138,6 0.62,7 0.585,8 542.75,9 4.9,10 11,11 81,13 15,14 40,16 82,17 29,20 14,21 15,22 4,24 42,25 10,28 4,29 6,32 39,35 7.4,36 0.207,37 17,38 49.5,39 81.159,40 92.138,41 50.216,42 47.384,44 4.523}
{0 CHEMBL421386,1 6.113,2 34.5,3 56.3,4 0.992,5 1.139,6 0.607,7 0.56,8 531.82,9 3.4,11 87,13 7,14 38,16 87,17 30,20 11,21 19,22 7,24 49,25 8,28 3,29 5,32 38,35 5.7,36 0.207,37 18,38 45,39 86.265,40 99.092,41 52.802,42 48.755,44 6.959}
{0 CHEMBL424758,1 6.045,2 40,3 55.3,4 0.977,5 1.128,6 0.638,7 0.581,8 513.84,9 3.5,10 18,11 85,13 19,14 40,16 87,17 34,20 18,21 16,22 1,24 47,25 4,28 3,29 1,32 38,35 1.2,36 0.195,37 17,38 50,39 83.072,40 95.839,41 54.222,42 49.369,44 5.63}
{0 CHEMBL424926,1 6.491,2 36.4,3 53.1,4 0.995,5 1.136,6 0.622,7 0.581,8 1051.53,9 4.9,10 23,11 162,13 29,14 79,16 165,17 59,20 27,21 32,22 6,24 86,25 17,28 8,29 9,32 76,35 5.6,36 0.194,37 32,38 96.5,39 161.221,40 184.064,41 100.831,42 94.15,44 6.987}
{0 CHEMBL426945,1 7.278,2 44.2,3 46.2,4 1.001,5 1.118,6 0.665,7 0.633,8 756.96,9 1.9,10 24,11 104,13 30,14 61,16 109,17 46,20 34,21 12,22 6,24 48,25 10,28 2,29 8,32 56,35 7.7,36 0.156,37 17,38 79,39 104.145,40 116.221,41 69.16,42 65.878,44 7.824}
{0 CHEMBL426999,1 9.433,2 40,3 44,4 1.016,5 1.124,6 0.681,7 0.647,8 707.46,9 4,10 17,11 75,13 20,14 45,15 2,16 78,17 30,20 19,21 11,22 3,24 33,25 12,26 2,28 3,29 7,32 42,34 2,35 9.3,36 0.192,37 15,38 56.5,39 76.192,40 84.287,41 51.086,42 48.547,43 2.7,44 5.538}
{0 CHEMBL427946,1 6.68,2 36.7,3 51.9,4 1.001,5 1.135,6 0.623,7 0.587,8 527.73,9 3.8,10 12,11 79,13 15,14 39,16 80,17 29,20 15,21 14,22 3,24 41,25 9,28 3,29 6,32 38,35 7.6,36 0.188,37 15,38 48,39 79.058,40 89.64,41 49.211,42 46.362,44 6.301}
{0 CHEMBL434748,1 6.215,2 38.6,3 54.2,4 0.982,5 1.133,6 0.635,7 0.583,8 515.82,9 6,10 18,11 83,13 19,14 40,16 85,17 32,20 16,21 16,22 1,24 45,25 6,28 5,29 1,32 38,35 1.2,36 0.2,37 17,38 50,39 81.508,40 94.005,41 52.711,42 48.358,44 5.652}
{0 CHEMBL434853,1 7.068,2 41.9,3 47.7,4 0.997,5 1.126,6 0.658,7 0.621,8 607.82,9 5.8,10 24,11 86,13 27,14 48,16 89,17 36,20 26,21 10,22 3,24 41,25 9,28 5,29 4,32 45,35 4.7,36 0.169,37 15,38 63,39 85.723,40 96.803,41 56.552,42 53.449,44 6.237}
{0 CHEMBL435119,1 9.301,2 38.5,3 44.9,4 1.018,5 1.127,6 0.671,7 0.638,8 725.48,9 3.8,10 12,11 78,13 17,14 45,15 2,16 80,17 30,20 19,21 11,22 5,24 35,25 13,26 2,28 3,29 8,32 43,34 2,35 10.3,36 0.2,37 16,38 56,39 79.403,40 87.912,41 52.301,42 49.789,43 2.6,44 8.155}
{0 CHEMBL435740,1 7.966,2 42.2,3 44.4,4 1.008,5 1.116,6 0.682,7 0.646,8 716.94,9 2.2,10 22,11 90,13 26,14 55,16 95,17 38,20 26,21 12,22 4,24 40,25 12,26 2,28 2,29 8,31 2,32 50,35 8.9,36 0.158,37 15,38 70,39 90.763,40 100.401,41 61.409,42 58.145,44 7.824}
{0 CHEMBL436306,1 6.132,2 41.1,3 54.4,4 0.977,5 1.125,6 0.644,7 0.588,8 551.89,9 3.3,10 22,11 90,13 23,14 44,16 93,17 37,20 21,21 16,22 1,24 49,25 4,28 3,29 1,32 41,35 1.1,36 0.183,37 17,38 56,39 87.956,40 101.254,41 57.984,42 52.895,44 6.174}
{0 CHEMBL440965,1 7.798,2 40.4,3 45.5,4 1.006,5 1.122,6 0.674,7 0.637,8 772.04,9 5.1,10 23,11 99,13 27,14 59,16 104,17 40,20 25,21 15,22 4,24 45,25 14,26 2,28 5,29 7,31 2,32 54,35 7.1,36 0.135,37 14,38 74.5,39 99.625,40 111.101,41 66.733,42 63.021,44 8.523}
{0 CHEMBL442632,1 7.547,2 40.2,3 46.3,4 1.006,5 1.125,6 0.663,7 0.628,8 618.82,9 4.9,10 18,11 82,13 21,14 48,16 86,17 33,20 21,21 12,22 3,24 38,25 11,26 1,28 4,29 6,31 1,32 44,35 7.3,36 0.116,37 10,38 60,39 82.469,40 92.228,41 54.341,42 51.517,44 7.538}
{0 CHEMBL443541,1 7.739,2 37.2,3 50,4 1.002,5 1.133,6 0.646,7 0.605,8 603.62,9 5.1,10 12,11 78,13 15,14 41,15 1,16 80,17 29,20 14,21 15,22 3,24 39,25 10,26 1,28 4,29 5,32 39,34 1,35 6.4,36 0.163,37 13,38 50,39 78.178,40 88.355,41 50.353,42 47.167,43 1.3,44 7.602}
{0 CHEMBL444759,1 7.38,2 41,3 47,4 1.001,5 1.124,6 0.664,7 0.626,8 738,9 5,10 24,11 100,13 27,14 58,16 105,17 41,20 26,21 15,22 3,24 47,25 12,26 1,28 5,29 6,31 1,32 53,35 6,36 0.124,37 13,38 73,39 100.105,40 112.387,41 66.393,42 62.646,44 7.678}
{0 CHEMBL448257,1 7.547,2 40.2,3 46.3,4 1.006,5 1.125,6 0.663,7 0.628,8 618.82,9 4.9,10 18,11 82,13 21,14 48,16 86,17 33,20 21,21 12,22 3,24 38,25 11,26 1,28 4,29 6,31 1,32 44,35 7.3,36 0.116,37 10,38 60,39 82.469,40 92.228,41 54.341,42 51.517,44 6.9}
{0 CHEMBL448365,1 7.652,2 40.7,3 45.7,4 1.009,5 1.123,6 0.664,7 0.632,8 619.8,9 3.7,10 18,11 81,13 21,14 48,16 85,17 33,20 21,21 12,22 3,24 37,25 11,26 1,28 3,29 7,31 1,32 44,35 8.6,36 0.118,37 10,38 60,39 81.694,40 90.939,41 53.79,42 51.21,44 8}
{0 CHEMBL448631,1 7.546,2 40.5,3 46.4,4 1.007,5 1.123,6 0.661,7 0.628,8 633.83,9 3.6,10 18,11 84,13 21,14 49,16 88,17 34,20 21,21 13,22 3,24 39,25 11,26 1,28 3,29 7,31 1,32 45,35 8.3,36 0.125,37 11,38 61,39 84.578,40 94.354,41 55.551,42 52.737,44 8}
{0 CHEMBL448977,1 7.546,2 40.5,3 46.4,4 1.007,5 1.123,6 0.661,7 0.628,8 633.83,9 3.6,10 18,11 84,13 21,14 49,16 88,17 34,20 21,21 13,22 3,24 39,25 11,26 1,28 3,29 7,31 1,32 45,35 8.3,36 0.125,37 11,38 61,39 84.578,40 94.354,41 55.551,42 52.737,44 8.046}
{0 CHEMBL449918,1 7.18,2 39.4,3 48.9,4 1,5 1.126,6 0.653,7 0.613,8 674.94,9 4.3,10 18,11 94,13 21,14 52,16 98,17 37,20 21,21 16,22 3,24 46,25 11,26 1,28 4,29 6,31 1,32 48,35 6.4,36 0.122,37 12,38 64,39 94.003,40 105.889,41 61.387,42 57.624,44 8.155}
{0 CHEMBL452345,1 7.546,2 40.5,3 46.4,4 1.007,5 1.123,6 0.661,7 0.628,8 633.83,9 3.6,10 18,11 84,13 21,14 49,16 88,17 34,20 21,21 13,22 3,24 39,25 11,26 1,28 3,29 7,31 1,32 45,35 8.3,36 0.125,37 11,38 61,39 84.578,40 94.354,41 55.551,42 52.737,44 8.398}
{0 CHEMBL452725,1 7.38,2 41,3 47,4 1.001,5 1.124,6 0.664,7 0.626,8 738,9 5,10 24,11 100,13 27,14 58,16 105,17 41,20 26,21 15,22 3,24 47,25 12,26 1,28 5,29 6,31 1,32 53,35 6,36 0.124,37 13,38 73,39 100.105,40 112.387,41 66.393,42 62.646,44 8.222}
{0 CHEMBL453415,1 7.444,2 41,3 47,4 1.003,5 1.122,6 0.664,7 0.627,8 617.83,9 3.6,10 18,11 83,13 21,14 48,16 87,17 34,20 21,21 13,22 3,24 39,25 10,26 1,28 3,29 6,31 1,32 44,35 7.2,36 0.115,37 10,38 60,39 83.25,40 93.145,41 55.097,42 52.022,44 7.377}
{0 CHEMBL453959,1 7.546,2 40.5,3 46.4,4 1.007,5 1.123,6 0.661,7 0.628,8 633.83,9 3.6,10 18,11 84,13 21,14 49,16 88,17 34,20 21,21 13,22 3,24 39,25 11,26 1,28 3,29 7,31 1,32 45,35 8.3,36 0.125,37 11,38 61,39 84.578,40 94.354,41 55.551,42 52.737,44 6.32}
{0 CHEMBL466535,1 7.351,2 39.8,3 47.7,4 1.003,5 1.126,6 0.658,7 0.62,8 646.88,9 4.5,10 18,11 88,13 21,14 50,16 92,17 35,20 21,21 14,22 3,24 42,25 11,26 1,28 4,29 6,31 1,32 46,35 6.8,36 0.109,37 10,38 62,39 88.236,40 99.058,41 57.864,42 54.571,44 7.638}
{0 CHEMBL499762,1 7.556,2 40.7,3 46.5,4 1.008,5 1.127,6 0.66,7 0.627,8 649.85,9 3.5,10 18,11 86,13 21,14 50,16 90,17 35,20 21,21 14,22 3,23 1,24 40,25 11,26 1,28 3,29 6,31 1,32 46,34 1,35 7,36 0.111,37 10,38 62,39 86.647,40 96.9,41 56.796,42 53.933,43 1.2,44 7.721}
{0 CHEMBL499956,1 7.547,2 40.2,3 46.3,4 1.006,5 1.125,6 0.663,7 0.628,8 618.82,9 4.9,10 18,11 82,13 21,14 48,16 86,17 33,20 21,21 12,22 3,24 38,25 11,26 1,28 4,29 6,31 1,32 44,35 7.3,36 0.116,37 10,38 60,39 82.469,40 92.228,41 54.341,42 51.517,44 7.553}
{0 CHEMBL500010,1 7.912,2 40.2,3 43.9,4 1.015,5 1.125,6 0.664,7 0.639,8 648.8,9 4.9,10 18,11 82,13 23,14 50,16 86,17 33,20 21,21 12,22 5,24 36,25 13,26 1,28 4,29 8,31 1,32 46,35 9.8,36 0.128,37 11,38 64,39 83.24,40 92.232,41 54.489,42 52.42,44 7.602}
{0 CHEMBL501972,1 7.263,2 39.6,3 48.4,4 1.001,5 1.126,6 0.655,7 0.616,8 660.91,9 4.4,10 18,11 91,13 21,14 51,16 95,17 36,20 21,21 15,22 3,24 44,25 11,26 1,28 4,29 6,31 1,32 47,35 6.6,36 0.116,37 11,38 63,39 91.119,40 102.474,41 59.625,42 56.097,44 7.602}
{0 CHEMBL502445,1 7.03,2 39,3 50,4 0.998,5 1.127,6 0.649,7 0.607,8 703,9 4,10 18,11 100,13 21,14 54,16 104,17 39,20 21,21 18,22 3,24 50,25 11,26 1,28 4,29 6,31 1,32 50,35 6,36 0.135,37 14,38 66,39 99.77,40 112.719,41 64.91,42 60.678,44 7.523}
{0 CHEMBL502985,1 7.652,2 40.7,3 45.7,4 1.009,5 1.123,6 0.664,7 0.632,8 619.8,9 3.7,10 18,11 81,13 21,14 48,16 85,17 33,20 21,21 12,22 3,24 37,25 11,26 1,28 3,29 7,31 1,32 44,35 8.6,36 0.118,37 10,38 60,39 81.694,40 90.939,41 53.79,42 51.21,44 6.951}
{0 CHEMBL503181,1 7.447,2 40.2,3 47.1,4 1.005,5 1.124,6 0.659,7 0.624,8 647.86,9 3.4,10 18,11 87,13 21,14 50,16 91,17 35,20 21,21 14,22 3,24 41,25 11,26 1,28 3,29 7,31 1,32 46,35 8,36 0.11,37 10,38 62,39 87.461,40 97.77,41 57.313,42 54.264,44 8.301}
{0 CHEMBL503590,1 7.544,2 39.8,3 46.6,4 1.009,5 1.125,6 0.656,7 0.625,8 663.86,9 3.4,10 18,11 88,13 21,14 51,16 92,17 35,20 21,21 14,22 3,24 41,25 12,26 1,28 3,29 8,31 1,32 47,35 9.1,36 0.13,37 12,38 63,39 88.789,40 98.979,41 57.767,42 54.979,44 6.107}
{0 CHEMBL504596,1 7.18,2 39.4,3 48.9,4 1,5 1.126,6 0.653,7 0.613,8 674.94,9 4.3,10 18,11 94,13 21,14 52,16 98,17 37,20 21,21 16,22 3,24 46,25 11,26 1,28 4,29 6,31 1,32 48,35 6.4,36 0.112,37 11,38 64,39 94.003,40 105.889,41 61.387,42 57.624,44 7.678}
{0 CHEMBL506575,1 7.546,2 40.5,3 46.4,4 1.007,5 1.123,6 0.661,7 0.628,8 633.83,9 3.6,10 18,11 84,13 21,14 49,16 88,17 34,20 21,21 13,22 3,24 39,25 11,26 1,28 3,29 7,31 1,32 45,35 8.3,36 0.125,37 11,38 61,39 84.578,40 94.354,41 55.551,42 52.737,44 6.815}
{0 CHEMBL506609,1 7.546,2 40.5,3 46.4,4 1.007,5 1.123,6 0.661,7 0.628,8 633.83,9 3.6,10 18,11 84,13 21,14 49,16 88,17 34,20 21,21 13,22 3,24 39,25 11,26 1,28 3,29 7,31 1,32 45,35 8.3,36 0.125,37 11,38 61,39 84.578,40 94.354,41 55.551,42 52.737,44 6.879}
{0 CHEMBL507473,1 7.912,2 40.2,3 43.9,4 1.015,5 1.125,6 0.664,7 0.639,8 648.8,9 4.9,10 18,11 82,13 23,14 50,16 86,17 33,20 21,21 12,22 5,24 36,25 13,26 1,28 4,29 8,31 1,32 46,35 9.8,36 0.128,37 11,38 64,39 83.24,40 92.232,41 54.489,42 52.42,44 7.26}
{0 CHEMBL507484,1 6.961,2 38.8,3 50.5,4 0.997,5 1.128,6 0.647,7 0.604,8 717.03,9 3.9,10 18,11 103,13 21,14 55,16 107,17 40,20 21,21 19,22 3,24 52,25 11,26 1,28 4,29 6,31 1,32 51,35 5.8,36 0.14,37 15,38 67,39 102.654,40 116.134,41 66.671,42 62.205,44 7.585}
{0 CHEMBL508023,1 7.912,2 40.2,3 43.9,4 1.015,5 1.125,6 0.664,7 0.639,8 648.8,9 4.9,10 18,11 82,13 23,14 50,16 86,17 33,20 21,21 12,22 5,24 36,25 13,26 1,28 4,29 8,31 1,32 46,35 9.8,36 0.128,37 11,38 64,39 83.24,40 92.232,41 54.489,42 52.42,44 7.42}
{0 CHEMBL508116,1 7.444,2 41,3 47,4 1.003,5 1.122,6 0.664,7 0.627,8 617.83,9 3.6,10 18,11 83,13 21,14 48,16 87,17 34,20 21,21 13,22 3,24 39,25 10,26 1,28 3,29 6,31 1,32 44,35 7.2,36 0.115,37 10,38 60,39 83.25,40 93.145,41 55.097,42 52.022,44 7.26}
{0 CHEMBL508668,1 7.38,2 41,3 47,4 1.001,5 1.124,6 0.664,7 0.626,8 738,9 5,10 24,11 100,13 27,14 58,16 105,17 41,20 26,21 15,22 3,24 47,25 12,26 1,28 5,29 6,31 1,32 53,35 6,36 0.124,37 13,38 73,39 100.105,40 112.387,41 66.393,42 62.646,44 8}
{0 CHEMBL509164,1 7.444,2 41,3 47,4 1.003,5 1.122,6 0.664,7 0.627,8 617.83,9 3.6,10 18,11 83,13 21,14 48,16 87,17 34,20 21,21 13,22 3,24 39,25 10,26 1,28 3,29 6,31 1,32 44,35 7.2,36 0.115,37 10,38 60,39 83.25,40 93.145,41 55.097,42 52.022,44 6.839}
{0 CHEMBL509191,1 7.997,2 41.3,3 43.8,4 1.017,5 1.13,6 0.665,7 0.641,8 639.78,9 3.8,10 18,11 80,13 21,14 49,16 84,17 33,20 21,21 12,22 3,23 2,24 35,25 12,26 1,28 3,29 6,31 1,32 45,34 2,35 7.5,36 0.119,37 10,38 61,39 81.392,40 90.409,41 53.211,42 51.262,43 2.5,44 7.854}
{0 CHEMBL509323,1 7.652,2 40.7,3 45.7,4 1.009,5 1.123,6 0.664,7 0.632,8 619.8,9 3.7,10 18,11 81,13 21,14 48,16 85,17 33,20 21,21 12,22 3,24 37,25 11,26 1,28 3,29 7,31 1,32 44,35 8.6,36 0.118,37 10,38 60,39 81.694,40 90.939,41 53.79,42 51.21,44 8}
{0 CHEMBL509473,1 7.02,2 39.8,3 50,4 0.997,5 1.125,6 0.652,7 0.609,8 687.98,9 3.1,10 18,11 98,13 21,14 53,16 102,17 39,20 21,21 18,22 3,24 49,25 10,26 1,28 3,29 6,31 1,32 49,35 6.1,36 0.118,37 12,38 65,39 97.668,40 110.221,41 63.904,42 59.656,44 7.638}
{0 CHEMBL510300,1 8.408,2 41.3,3 43.8,4 1.013,5 1.12,6 0.688,7 0.652,8 672.68,9 3.8,10 18,11 80,13 21,14 49,16 84,17 33,18 2,20 21,21 12,22 3,24 35,25 12,26 3,28 3,29 6,31 1,32 45,34 2,35 7.5,36 0.119,37 10,38 61,39 81.014,40 89.618,41 55.051,42 52.151,43 2.5,44 7.409}
{0 CHEMBL511879,1 10.639,2 43.3,3 36.7,4 1.017,5 1.124,6 0.729,7 0.698,8 319.18,9 13.3,10 11,11 30,13 13,14 21,15 1,16 32,17 13,20 12,21 1,22 2,24 11,25 6,26 1,28 4,29 1,32 19,34 1,35 3.3,36 0.031,37 1,38 28.5,39 30.498,40 33.705,41 21.875,42 20.933,43 3.3,44 4.228}
{0 CHEMBL538145,1 6.495,2 35.7,3 53.2,4 0.997,5 1.138,6 0.619,7 0.579,8 1110.61,9 5.3,10 22,11 171,13 29,14 83,16 174,17 61,20 26,21 35,22 7,24 91,25 19,28 9,29 10,32 80,35 5.8,36 0.213,37 37,38 101,39 170.417,40 194.602,41 105.814,42 98.939,44 5.018}
{0 CHEMBL541232,1 8.765,2 45.7,3 40,4 1.021,5 1.123,6 0.698,7 0.675,8 613.52,9 2.9,10 24,11 70,13 26,14 45,16 73,17 32,18 2,20 26,21 6,22 2,23 2,24 28,25 10,26 2,28 2,29 4,32 42,34 4,35 5.7,36 0.151,37 11,38 59,39 71.44,40 78.63,41 48.841,42 47.226,43 5.7,44 4.602}
{0 CHEMBL555902,1 8.146,2 44.7,3 42.1,4 1.015,5 1.121,6 0.68,7 0.658,8 619.13,9 2.6,10 24,11 76,13 26,14 48,16 80,17 34,18 1,20 26,21 8,22 2,23 1,24 32,25 10,26 1,28 2,29 6,32 44,34 2,35 7.9,36 0.138,37 11,38 62,39 77.141,40 85.18,41 51.716,42 49.971,43 2.6,44 4.929}
{0 CHEMBL556236,1 5.591,2 32.6,3 60.5,4 0.984,5 1.142,6 0.591,7 0.536,8 480.82,9 2.3,11 86,13 2,14 35,16 87,17 28,20 2,21 26,22 2,24 52,25 6,28 2,29 4,32 34,35 4.7,36 0.149,37 13,38 37,39 84.603,40 98.214,41 50.864,42 46.072,44 4.602}
{0 CHEMBL556509,1 7.092,2 41.1,3 47.9,4 1.001,5 1.126,6 0.65,7 0.617,8 517.68,9 4.1,10 18,11 73,13 20,14 41,16 76,17 30,20 19,21 11,22 2,24 35,25 8,28 3,29 5,32 38,35 6.8,36 0.145,37 11,38 52,39 73.08,40 82.185,41 47.472,42 45.067,44 4.898}
{0 CHEMBL559339,1 6.537,2 36,3 52.8,4 0.997,5 1.138,6 0.622,7 0.582,8 1052.52,9 5.6,10 23,11 161,13 29,14 79,16 164,17 58,20 27,21 31,22 6,24 85,25 18,28 9,29 9,32 76,35 5.6,36 0.201,37 33,38 96.5,39 160.439,40 183.147,41 100.075,42 93.644,44 6.229}
{0 CHEMBL560343,1 6.237,2 38.6,3 54.5,4 0.987,5 1.129,6 0.629,7 0.58,8 548.84,9 2.3,10 12,11 88,13 14,14 43,16 91,17 34,20 14,21 20,22 2,24 48,25 6,28 2,29 4,32 40,35 4.5,36 0.143,37 13,38 51,39 86.836,40 99.384,41 55.342,42 51.018,44 5.408}
{0 CHEMBL563456,1 6.411,2 35.8,3 53.7,4 0.994,5 1.138,6 0.62,7 0.577,8 1038.54,9 5.6,10 22,11 162,13 28,14 78,16 165,17 58,20 25,21 33,22 6,24 87,25 17,28 9,29 8,32 75,35 4.9,36 0.2,37 33,38 95,39 160.995,40 184.353,41 100.382,42 93.456,44 5.821}
{0 CHEMBL564804,1 6.588,2 36.8,3 52.6,4 0.999,5 1.133,6 0.621,7 0.583,8 500.7,9 2.6,10 12,11 76,13 14,14 37,16 77,17 28,20 14,21 14,22 2,24 40,25 8,28 2,29 6,32 36,35 7.9,36 0.169,37 13,38 45,39 75.956,40 86.142,41 47.205,42 44.341,44 4.602}
{0 CHEMBL575115,1 7.347,2 40.7,3 47.7,4 1.002,5 1.123,6 0.661,7 0.623,8 631.86,9 3.5,10 18,11 86,13 21,14 49,16 90,17 35,20 21,21 14,22 3,24 41,25 10,26 1,28 3,29 6,31 1,32 45,35 7,36 0.111,37 10,38 61,39 86.134,40 96.56,41 56.858,42 53.549,44 4.699}
{0 CHEMBL575149,1 7.257,2 40.4,3 48.3,4 1,5 1.123,6 0.659,7 0.619,8 645.89,9 3.4,10 18,11 89,13 21,14 50,16 93,17 36,20 21,21 15,22 3,24 43,25 10,26 1,28 3,29 6,31 1,32 46,35 6.7,36 0.118,37 11,38 62,39 89.018,40 99.975,41 58.62,42 55.076,44 5.854}
{0 CHEMBL575150,1 7.257,2 40.4,3 48.3,4 1,5 1.123,6 0.659,7 0.619,8 645.89,9 3.4,10 18,11 89,13 21,14 50,16 93,17 36,20 21,21 15,22 3,24 43,25 10,26 1,28 3,29 6,31 1,32 46,35 6.7,36 0.118,37 11,38 62,39 89.018,40 99.975,41 58.62,42 55.076,44 6.357}
{0 CHEMBL583993,1 7.257,2 40.4,3 48.3,4 1,5 1.123,6 0.659,7 0.619,8 645.89,9 3.4,10 18,11 89,13 21,14 50,16 93,17 36,20 21,21 15,22 3,24 43,25 10,26 1,28 3,29 6,31 1,32 46,35 6.7,36 0.118,37 11,38 62,39 89.018,40 99.975,41 58.62,42 55.076,44 5.131}
{0 CHEMBL584189,1 7.347,2 40.7,3 47.7,4 1.002,5 1.123,6 0.661,7 0.623,8 631.86,9 3.5,10 18,11 86,13 21,14 49,16 90,17 35,20 21,21 14,22 3,24 41,25 10,26 1,28 3,29 6,31 1,32 45,35 7,36 0.111,37 10,38 61,39 86.134,40 96.56,41 56.858,42 53.549,44 4.699}
{0 CHEMBL584190,1 7.257,2 40.4,3 48.3,4 1,5 1.123,6 0.659,7 0.619,8 645.89,9 3.4,10 18,11 89,13 21,14 50,16 93,17 36,20 21,21 15,22 3,24 43,25 10,26 1,28 3,29 6,31 1,32 46,35 6.7,36 0.118,37 11,38 62,39 89.018,40 99.975,41 58.62,42 55.076,44 5.119}
{0 CHEMBL584191,1 7.347,2 40.7,3 47.7,4 1.002,5 1.123,6 0.661,7 0.623,8 631.86,9 3.5,10 18,11 86,13 21,14 49,16 90,17 35,20 21,21 14,22 3,24 41,25 10,26 1,28 3,29 6,31 1,32 45,35 7,36 0.111,37 10,38 61,39 86.134,40 96.56,41 56.858,42 53.549,44 6.081}
{0 CHEMBL584192,1 7.347,2 40.7,3 47.7,4 1.002,5 1.123,6 0.661,7 0.623,8 631.86,9 3.5,10 18,11 86,13 21,14 49,16 90,17 35,20 21,21 14,22 3,24 41,25 10,26 1,28 3,29 6,31 1,32 45,35 7,36 0.111,37 10,38 61,39 86.134,40 96.56,41 56.858,42 53.549,44 5.77}
{0 CHEMBL584193,1 7.056,2 41.2,3 48.2,4 1.001,5 1.125,6 0.65,7 0.616,8 599.79,9 3.5,10 18,11 85,13 21,14 48,16 89,17 35,20 21,21 14,22 3,24 41,25 9,28 3,29 6,32 44,35 7.1,36 0.124,37 11,38 60,39 85.058,40 95.64,41 55.211,42 52.362,44 4.699}
{0 CHEMBL73919,1 7.034,2 39,3 48.8,4 1.003,5 1.131,6 0.64,7 0.608,8 576.76,9 4.9,10 17,11 82,13 21,14 44,16 84,17 32,20 20,21 12,22 4,24 40,25 10,28 4,29 6,32 42,35 7.3,36 0.202,37 17,38 56.5,39 82.276,40 92.723,41 52.455,42 49.857,44 4.523}
{0 CHEMBL74562,1 6.607,2 36.6,3 52.4,4 0.999,5 1.135,6 0.622,7 0.584,8 541.76,9 3.7,10 12,11 82,13 15,14 40,16 83,17 30,20 15,21 15,22 3,24 43,25 9,28 3,29 6,32 39,35 7.3,36 0.193,37 16,38 49,39 81.941,40 93.055,41 50.972,42 47.889,44 6.658}
{0 CHEMBL74943,1 6.347,2 37.1,3 53.9,4 0.991,5 1.134,6 0.625,7 0.579,8 564.85,9 4.5,10 12,11 89,13 15,14 43,16 91,17 33,20 15,21 18,22 3,24 48,25 8,28 4,29 4,32 41,35 4.5,36 0.176,37 16,38 52,39 88.156,40 100.965,41 55.592,42 51.534,44 6.658}
{0 CHEMBL74974,1 6.688,2 39.3,3 51.2,4 0.995,5 1.129,6 0.637,7 0.597,8 561.79,9 3.6,10 17,11 84,13 20,14 43,16 86,17 33,20 19,21 14,22 3,24 43,25 8,28 3,29 5,32 41,35 6,36 0.186,37 16,38 54.5,39 83.614,40 94.846,41 53.518,42 50.174,44 6.959}
{0 CHEMBL75057,1 6.688,2 39.3,3 51.2,4 0.995,5 1.129,6 0.637,7 0.597,8 561.79,9 3.6,10 17,11 84,13 20,14 43,16 86,17 33,20 19,21 14,22 3,24 43,25 8,28 3,29 5,32 41,35 6,36 0.186,37 16,38 54.5,39 83.614,40 94.846,41 53.518,42 50.174,44 4.921}
{0 CHEMBL75156,1 7.095,2 42.7,3 47.6,4 0.998,5 1.122,6 0.658,7 0.623,8 581.77,9 3.7,10 23,11 82,13 26,14 46,16 85,17 35,20 25,21 10,22 3,24 39,25 8,28 3,29 5,32 43,35 6.1,36 0.176,37 15,38 60.5,39 81.847,40 92.016,41 53.995,42 51.121,44 4.824}
{0 CHEMBL75554,1 6.641,2 38.8,3 51.5,4 0.994,5 1.131,6 0.637,7 0.595,8 683.98,9 4.9,10 18,11 103,13 22,14 53,16 106,17 40,20 22,21 18,22 4,24 53,25 10,28 5,29 5,32 50,35 4.9,36 0.17,37 18,38 66,39 102.352,40 116.503,41 65.575,42 61.324,44 6.222}
{0 CHEMBL77282,1 6.359,2 36.1,3 54.2,4 0.994,5 1.136,6 0.618,7 0.575,8 527.78,9 3.6,10 11,11 83,13 14,14 39,16 84,17 30,20 13,21 17,22 3,24 45,25 8,28 3,29 5,32 38,35 6,36 0.19,37 16,38 47.5,39 82.498,40 94.261,41 51.279,42 47.701,44 5.252}
{0 CHEMBL77681,1 6.762,2 39.5,3 50.6,4 0.997,5 1.129,6 0.639,7 0.601,8 547.76,9 3.7,10 17,11 81,13 20,14 42,16 83,17 32,20 19,21 13,22 3,24 41,25 8,28 3,29 5,32 40,35 6.2,36 0.181,37 15,38 53.5,39 80.73,40 91.431,41 51.756,42 48.647,44 5.237}
{0 CHEMBL93497,1 6.576,2 39.8,3 51.8,4 0.991,5 1.128,6 0.639,7 0.596,8 545.79,9 3.6,10 17,11 83,13 20,14 42,16 85,17 33,20 19,21 14,22 3,24 43,25 7,28 3,29 4,32 40,35 4.8,36 0.176,37 15,38 53.5,39 82.287,40 93.637,41 53.063,42 49.459,44 7.301}
{0 CHEMBL93551,1 6.188,2 33.7,3 55.8,4 0.993,5 1.142,6 0.606,7 0.561,8 587.9,9 5.3,10 6,11 95,13 10,14 43,16 96,17 32,20 10,21 22,22 4,24 53,25 10,28 5,29 5,32 42,35 5.3,36 0.177,37 17,38 50,39 94.352,40 108.503,41 57.575,42 53.324,44 6.387}
{0 CHEMBL94351,1 6.094,2 33.7,3 56.6,4 0.993,5 1.141,6 0.603,7 0.557,8 505.78,9 3.6,10 6,11 83,13 9,14 36,16 83,17 28,20 9,21 19,22 3,24 47,25 8,28 3,29 5,32 36,35 6,36 0.193,37 16,38 42,39 82.381,40 94.676,41 50.04,42 46.228,44 6.658}
{0 CHEMBL94646,1 6.282,2 36.4,3 54.5,4 0.99,5 1.136,6 0.62,7 0.574,8 552.84,9 4.5,10 12,11 88,13 15,14 41,16 89,17 32,20 15,21 17,22 3,24 48,25 8,28 4,29 4,32 40,35 4.5,36 0.191,37 17,38 50,39 87.156,40 99.965,41 54.592,42 50.534,44 6.357}
{0 CHEMBL95374,1 6.147,2 33.8,3 56.3,4 0.994,5 1.141,6 0.603,7 0.559,8 491.75,9 3.8,10 6,11 80,13 9,14 35,16 80,17 27,20 9,21 18,22 3,24 45,25 8,28 3,29 5,32 35,35 6.3,36 0.188,37 15,38 41,39 79.498,40 91.261,41 48.279,42 44.701,44 6.301}
{0 CHEMBL96943,1 6.43,2 37.5,3 53.4,4 0.993,5 1.133,6 0.625,7 0.582,8 565.83,9 3.4,10 6,11 88,13 13,14 42,16 89,17 33,20 17,21 16,22 7,24 47,25 8,28 3,29 5,32 41,35 5.7,36 0.202,37 18,38 52,39 87.381,40 99.676,41 55.04,42 51.228,44 6.745}
{0 CHEMBL97013,1 6.241,2 36.6,3 54.9,4 0.99,5 1.135,6 0.62,7 0.573,8 511.78,9 3.7,10 11,11 82,13 14,14 38,16 83,17 30,20 13,21 17,22 3,24 45,25 7,28 3,29 4,32 37,35 4.9,36 0.181,37 15,38 46.5,39 81.17,40 93.052,41 50.824,42 46.986,44 7.046}
{0 CHEMBL97072,1 6.624,2 38.6,3 51.8,4 0.995,5 1.131,6 0.633,7 0.592,8 549.78,9 3.6,10 12,11 83,13 17,14 41,16 84,17 32,20 19,21 13,22 5,24 43,25 8,28 3,29 5,32 40,35 6,36 0.202,37 17,38 52,39 82.614,40 93.846,41 52.518,42 49.174,44 6.252}
{0 CHEMBL97805,1 6.491,2 37,3 53.1,4 0.995,5 1.134,6 0.624,7 0.582,8 525.76,9 3.7,10 12,11 81,13 15,14 39,16 82,17 30,20 15,21 15,22 3,24 43,25 8,28 3,29 5,32 38,35 6.2,36 0.183,37 15,38 48,39 80.614,40 91.846,41 50.518,42 47.174,44 6.229}
{0 CHEMBL98043,1 6.575,2 35.8,3 52.8,4 1,5 1.136,6 0.618,7 0.58,8 696.98,9 3.8,10 12,11 106,13 17,14 51,16 107,17 38,20 17,21 21,22 5,24 56,25 12,28 4,29 8,32 50,35 7.5,36 0.196,37 21,38 62,39 105.999,40 120.464,41 65.455,42 61.501,44 6.91}
{0 CHEMBL98384,1 6.688,2 39.3,3 51.2,4 0.995,5 1.129,6 0.637,7 0.597,8 561.79,9 3.6,10 17,11 84,13 20,14 43,16 86,17 33,20 19,21 14,22 3,24 43,25 8,28 3,29 5,32 41,35 6,36 0.186,37 16,38 54.5,39 83.614,40 94.846,41 53.518,42 50.174,44 6.959}
