{
  "data_features": {
    "feature": [
      {
        "data_type": "nominal",
        "index": "0",
        "is_ignore": "false",
        "is_row_identifier": "true",
        "is_target": "false",
        "name": "molecule_id",
        "nominal_value": [
          "CHEMBL100081",
          "CHEMBL100100",
          "CHEMBL100134",
          "CHEMBL100146",
          "CHEMBL100273",
          "CHEMBL100280",
          "CHEMBL100512",
          "CHEMBL100564",
          "CHEMBL100570",
          "CHEMBL100584",
          "CHEMBL100754",
          "CHEMBL100777",
          "CHEMBL100805",
          "CHEMBL100950",
          "CHEMBL101121",
          "CHEMBL101177",
          "CHEMBL101210",
          "CHEMBL101413",
          "CHEMBL101612",
          "CHEMBL101789",
          "CHEMBL10180",
          "CHEMBL101864",
          "CHEMBL10193",
          "CHEMBL101981",
          "CHEMBL102057",
          "CHEMBL102305",
          "CHEMBL102415",
          "CHEMBL102438",
          "CHEMBL102441",
          "CHEMBL102459",
          "CHEMBL102499",
          "CHEMBL10257",
          "CHEMBL10266",
          "CHEMBL102698",
          "CHEMBL102785",
          "CHEMBL102798",
          "CHEMBL10296",
          "CHEMBL103279",
          "CHEMBL10335",
          "CHEMBL103418",
          "CHEMBL103442",
          "CHEMBL103563",
          "CHEMBL103665",
          "CHEMBL103737",
          "CHEMBL103755",
          "CHEMBL103957",
          "CHEMBL104021",
          "CHEMBL104022",
          "CHEMBL10431",
          "CHEMBL104446",
          "CHEMBL10454",
          "CHEMBL104599",
          "CHEMBL10469",
          "CHEMBL10492",
          "CHEMBL105142",
          "CHEMBL105279",
          "CHEMBL105311",
          "CHEMBL105422",
          "CHEMBL105535",
          "CHEMBL10590",
          "CHEMBL105962",
          "CHEMBL106016",
          "CHEMBL106444",
          "CHEMBL10646",
          "CHEMBL10655",
          "CHEMBL10671",
          "CHEMBL10672",
          "CHEMBL10673",
          "CHEMBL10674",
          "CHEMBL10760",
          "CHEMBL10761",
          "CHEMBL1077203",
          "CHEMBL1078279",
          "CHEMBL1078281",
          "CHEMBL1078396",
          "CHEMBL10792",
          "CHEMBL10806",
          "CHEMBL10809",
          "CHEMBL10822",
          "CHEMBL1082317",
          "CHEMBL1082318",
          "CHEMBL1082319",
          "CHEMBL1082381",
          "CHEMBL108275",
          "CHEMBL108412",
          "CHEMBL1084238",
          "CHEMBL1084509",
          "CHEMBL1084510",
          "CHEMBL10848",
          "CHEMBL10851",
          "CHEMBL1085257",
          "CHEMBL108737",
          "CHEMBL10881",
          "CHEMBL108842",
          "CHEMBL10885",
          "CHEMBL1088878",
          "CHEMBL1089842",
          "CHEMBL1089843",
          "CHEMBL1090035",
          "CHEMBL1090283",
          "CHEMBL1090284",
          "CHEMBL1090647",
          "CHEMBL10908",
          "CHEMBL1092104",
          "CHEMBL109214",
          "CHEMBL109239",
          "CHEMBL109246",
          "CHEMBL109267",
          "CHEMBL109326",
          "CHEMBL10935",
          "CHEMBL109353",
          "CHEMBL109358",
          "CHEMBL1093689",
          "CHEMBL1093690",
          "CHEMBL109438",
          "CHEMBL10952",
          "CHEMBL10953",
          "CHEMBL109579",
          "CHEMBL109596",
          "CHEMBL109670",
          "CHEMBL109671",
          "CHEMBL109706",
          "CHEMBL109770",
          "CHEMBL109775",
          "CHEMBL109806",
          "CHEMBL109829",
          "CHEMBL109833",
          "CHEMBL109861",
          "CHEMBL109910",
          "CHEMBL11005",
          "CHEMBL110075",
          "CHEMBL110211",
          "CHEMBL110253",
          "CHEMBL110312",
          "CHEMBL110546",
          "CHEMBL110576",
          "CHEMBL110591",
          "CHEMBL110667",
          "CHEMBL110696",
          "CHEMBL110713",
          "CHEMBL110901",
          "CHEMBL110970",
          "CHEMBL110991",
          "CHEMBL110994",
          "CHEMBL110997",
          "CHEMBL111017",
          "CHEMBL111068",
          "CHEMBL111104",
          "CHEMBL111179",
          "CHEMBL111257",
          "CHEMBL111262",
          "CHEMBL111450",
          "CHEMBL111475",
          "CHEMBL111601",
          "CHEMBL111678",
          "CHEMBL111736",
          "CHEMBL111798",
          "CHEMBL111856",
          "CHEMBL111862",
          "CHEMBL11188",
          "CHEMBL111975",
          "CHEMBL112100",
          "CHEMBL112147",
          "CHEMBL112180",
          "CHEMBL112232",
          "CHEMBL112374",
          "CHEMBL112470",
          "CHEMBL112508",
          "CHEMBL112609",
          "CHEMBL112803",
          "CHEMBL112864",
          "CHEMBL11306",
          "CHEMBL113234",
          "CHEMBL113322",
          "CHEMBL113362",
          "CHEMBL113460",
          "CHEMBL113500",
          "CHEMBL113705",
          "CHEMBL113764",
          "CHEMBL113778",
          "CHEMBL113894",
          "CHEMBL114094",
          "CHEMBL114116",
          "CHEMBL114148",
          "CHEMBL114158",
          "CHEMBL114272",
          "CHEMBL114357",
          "CHEMBL114378",
          "CHEMBL114427",
          "CHEMBL114458",
          "CHEMBL114528",
          "CHEMBL114657",
          "CHEMBL114665",
          "CHEMBL114706",
          "CHEMBL114804",
          "CHEMBL114815",
          "CHEMBL114831",
          "CHEMBL114878",
          "CHEMBL114884",
          "CHEMBL114906",
          "CHEMBL114944",
          "CHEMBL115046",
          "CHEMBL115082",
          "CHEMBL115168",
          "CHEMBL115189",
          "CHEMBL115211",
          "CHEMBL115223",
          "CHEMBL115263",
          "CHEMBL115283",
          "CHEMBL115326",
          "CHEMBL115348",
          "CHEMBL115653",
          "CHEMBL115666",
          "CHEMBL115674",
          "CHEMBL115712",
          "CHEMBL115727",
          "CHEMBL115774",
          "CHEMBL115877",
          "CHEMBL1160623",
          "CHEMBL1160624",
          "CHEMBL1160627",
          "CHEMBL1160628",
          "CHEMBL116067",
          "CHEMBL1160685",
          "CHEMBL1160686",
          "CHEMBL116219",
          "CHEMBL116237",
          "CHEMBL116287",
          "CHEMBL1162966",
          "CHEMBL116318",
          "CHEMBL1163444",
          "CHEMBL1163454",
          "CHEMBL1163455",
          "CHEMBL116348",
          "CHEMBL1163867",
          "CHEMBL1163869",
          "CHEMBL1164630",
          "CHEMBL1164826",
          "CHEMBL116507",
          "CHEMBL1165106",
          "CHEMBL1165150",
          "CHEMBL1165152",
          "CHEMBL1165241",
          "CHEMBL1165574",
          "CHEMBL1165627",
          "CHEMBL116676",
          "CHEMBL116757",
          "CHEMBL116904",
          "CHEMBL1169492",
          "CHEMBL116972",
          "CHEMBL117220",
          "CHEMBL117225",
          "CHEMBL117296",
          "CHEMBL117375",
          "CHEMBL117720",
          "CHEMBL118744",
          "CHEMBL118848",
          "CHEMBL120049",
          "CHEMBL120305",
          "CHEMBL1204013",
          "CHEMBL120934",
          "CHEMBL121501",
          "CHEMBL121559",
          "CHEMBL121592",
          "CHEMBL121729",
          "CHEMBL121916",
          "CHEMBL122109",
          "CHEMBL122591",
          "CHEMBL122651",
          "CHEMBL122711",
          "CHEMBL122719",
          "CHEMBL122831",
          "CHEMBL122836",
          "CHEMBL122868",
          "CHEMBL122925",
          "CHEMBL122950",
          "CHEMBL1229868",
          "CHEMBL123041",
          "CHEMBL123064",
          "CHEMBL123105",
          "CHEMBL123167",
          "CHEMBL1232074",
          "CHEMBL123233",
          "CHEMBL123320",
          "CHEMBL1233772",
          "CHEMBL123382",
          "CHEMBL123404",
          "CHEMBL1234370",
          "CHEMBL123443",
          "CHEMBL123463",
          "CHEMBL1234724",
          "CHEMBL123499",
          "CHEMBL123503",
          "CHEMBL123563",
          "CHEMBL123571",
          "CHEMBL123615",
          "CHEMBL123627",
          "CHEMBL123775",
          "CHEMBL123967",
          "CHEMBL124026",
          "CHEMBL124100",
          "CHEMBL124237",
          "CHEMBL124265",
          "CHEMBL124514",
          "CHEMBL124558",
          "CHEMBL124623",
          "CHEMBL124680",
          "CHEMBL124681",
          "CHEMBL125068",
          "CHEMBL125104",
          "CHEMBL125138",
          "CHEMBL125281",
          "CHEMBL125302",
          "CHEMBL125384",
          "CHEMBL125553",
          "CHEMBL125598",
          "CHEMBL125601",
          "CHEMBL125672",
          "CHEMBL125755",
          "CHEMBL125901",
          "CHEMBL126004",
          "CHEMBL126044",
          "CHEMBL126122",
          "CHEMBL126380",
          "CHEMBL126388",
          "CHEMBL126461",
          "CHEMBL126711",
          "CHEMBL126712",
          "CHEMBL126923",
          "CHEMBL126977",
          "CHEMBL1269994",
          "CHEMBL127035",
          "CHEMBL127093",
          "CHEMBL127138",
          "CHEMBL127161",
          "CHEMBL127168",
          "CHEMBL127559",
          "CHEMBL127787",
          "CHEMBL127867",
          "CHEMBL128108",
          "CHEMBL128372",
          "CHEMBL128375",
          "CHEMBL128406",
          "CHEMBL1287851",
          "CHEMBL129561",
          "CHEMBL130164",
          "CHEMBL1305393",
          "CHEMBL131291",
          "CHEMBL131333",
          "CHEMBL131654",
          "CHEMBL132053",
          "CHEMBL132443",
          "CHEMBL132452",
          "CHEMBL132762",
          "CHEMBL132816",
          "CHEMBL132928",
          "CHEMBL133028",
          "CHEMBL133148",
          "CHEMBL133199",
          "CHEMBL133259",
          "CHEMBL133303",
          "CHEMBL133314",
          "CHEMBL133369",
          "CHEMBL133376",
          "CHEMBL134640",
          "CHEMBL134782",
          "CHEMBL134849",
          "CHEMBL134908",
          "CHEMBL135034",
          "CHEMBL135075",
          "CHEMBL135177",
          "CHEMBL135216",
          "CHEMBL135251",
          "CHEMBL135448",
          "CHEMBL135499",
          "CHEMBL135590",
          "CHEMBL135640",
          "CHEMBL135641",
          "CHEMBL135696",
          "CHEMBL135766",
          "CHEMBL135783",
          "CHEMBL135857",
          "CHEMBL135886",
          "CHEMBL135931",
          "CHEMBL135962",
          "CHEMBL135983",
          "CHEMBL136021",
          "CHEMBL136353",
          "CHEMBL137013",
          "CHEMBL137065",
          "CHEMBL1371684",
          "CHEMBL137297",
          "CHEMBL137315",
          "CHEMBL137323",
          "CHEMBL137365",
          "CHEMBL137383",
          "CHEMBL137406",
          "CHEMBL137468",
          "CHEMBL137646",
          "CHEMBL137703",
          "CHEMBL137732",
          "CHEMBL138594",
          "CHEMBL139609",
          "CHEMBL139884",
          "CHEMBL139886",
          "CHEMBL140004",
          "CHEMBL140152",
          "CHEMBL140511",
          "CHEMBL140568",
          "CHEMBL140569",
          "CHEMBL140575",
          "CHEMBL140720",
          "CHEMBL140788",
          "CHEMBL140970",
          "CHEMBL141080",
          "CHEMBL141451",
          "CHEMBL143451",
          "CHEMBL144049",
          "CHEMBL144081",
          "CHEMBL144176",
          "CHEMBL144293",
          "CHEMBL144313",
          "CHEMBL144320",
          "CHEMBL144430",
          "CHEMBL144525",
          "CHEMBL144548",
          "CHEMBL144568",
          "CHEMBL144611",
          "CHEMBL144843",
          "CHEMBL145",
          "CHEMBL145175",
          "CHEMBL145641",
          "CHEMBL145930",
          "CHEMBL145999",
          "CHEMBL146256",
          "CHEMBL146289",
          "CHEMBL146718",
          "CHEMBL146725",
          "CHEMBL146896",
          "CHEMBL146951",
          "CHEMBL147004",
          "CHEMBL147005",
          "CHEMBL147051",
          "CHEMBL147107",
          "CHEMBL147261",
          "CHEMBL147489",
          "CHEMBL147494",
          "CHEMBL147561",
          "CHEMBL147629",
          "CHEMBL147738",
          "CHEMBL147804",
          "CHEMBL147844",
          "CHEMBL147881",
          "CHEMBL147882",
          "CHEMBL147903",
          "CHEMBL147910",
          "CHEMBL148081",
          "CHEMBL148118",
          "CHEMBL148120",
          "CHEMBL148136",
          "CHEMBL148169",
          "CHEMBL148171",
          "CHEMBL148178",
          "CHEMBL148212",
          "CHEMBL148213",
          "CHEMBL148214",
          "CHEMBL148331",
          "CHEMBL148406",
          "CHEMBL149431",
          "CHEMBL149977",
          "CHEMBL149983",
          "CHEMBL150027",
          "CHEMBL150077",
          "CHEMBL150242",
          "CHEMBL150342",
          "CHEMBL150386",
          "CHEMBL150483",
          "CHEMBL150628",
          "CHEMBL150655",
          "CHEMBL150745",
          "CHEMBL151024",
          "CHEMBL151047",
          "CHEMBL151133",
          "CHEMBL151235",
          "CHEMBL151249",
          "CHEMBL151331",
          "CHEMBL151399",
          "CHEMBL151539",
          "CHEMBL1515648",
          "CHEMBL151591",
          "CHEMBL151718",
          "CHEMBL151975",
          "CHEMBL151996",
          "CHEMBL153469",
          "CHEMBL154438",
          "CHEMBL154706",
          "CHEMBL154828",
          "CHEMBL154999",
          "CHEMBL155134",
          "CHEMBL155874",
          "CHEMBL15763",
          "CHEMBL15796",
          "CHEMBL158366",
          "CHEMBL158571",
          "CHEMBL158622",
          "CHEMBL158625",
          "CHEMBL158696",
          "CHEMBL158739",
          "CHEMBL158823",
          "CHEMBL159033",
          "CHEMBL159141",
          "CHEMBL159159",
          "CHEMBL15962",
          "CHEMBL15964",
          "CHEMBL159645",
          "CHEMBL160153",
          "CHEMBL16087",
          "CHEMBL16099",
          "CHEMBL16115",
          "CHEMBL16118",
          "CHEMBL161224",
          "CHEMBL1615186",
          "CHEMBL1615187",
          "CHEMBL161536",
          "CHEMBL16154",
          "CHEMBL161562",
          "CHEMBL161572",
          "CHEMBL161838",
          "CHEMBL162072",
          "CHEMBL162128",
          "CHEMBL16213",
          "CHEMBL1627009",
          "CHEMBL1632637",
          "CHEMBL1632638",
          "CHEMBL1632639",
          "CHEMBL1632640",
          "CHEMBL1632641",
          "CHEMBL1632642",
          "CHEMBL16398",
          "CHEMBL16487",
          "CHEMBL16505",
          "CHEMBL1651846",
          "CHEMBL16519",
          "CHEMBL16520",
          "CHEMBL16554",
          "CHEMBL16595",
          "CHEMBL16630",
          "CHEMBL16650",
          "CHEMBL166564",
          "CHEMBL167232",
          "CHEMBL167233",
          "CHEMBL167278",
          "CHEMBL167302",
          "CHEMBL167705",
          "CHEMBL168150",
          "CHEMBL1683443",
          "CHEMBL1683444",
          "CHEMBL1683445",
          "CHEMBL1683449",
          "CHEMBL1683450",
          "CHEMBL1683451",
          "CHEMBL1683452",
          "CHEMBL1683453",
          "CHEMBL1683454",
          "CHEMBL1683455",
          "CHEMBL1683456",
          "CHEMBL1683457",
          "CHEMBL1683458",
          "CHEMBL1683459",
          "CHEMBL1683461",
          "CHEMBL1683462",
          "CHEMBL1683463",
          "CHEMBL1683464",
          "CHEMBL1683465",
          "CHEMBL168601",
          "CHEMBL168802",
          "CHEMBL169084",
          "CHEMBL16933",
          "CHEMBL169996",
          "CHEMBL170315",
          "CHEMBL170429",
          "CHEMBL17082",
          "CHEMBL171292",
          "CHEMBL171962",
          "CHEMBL171986",
          "CHEMBL172181",
          "CHEMBL172249",
          "CHEMBL172415",
          "CHEMBL172548",
          "CHEMBL172588",
          "CHEMBL172722",
          "CHEMBL172857",
          "CHEMBL172885",
          "CHEMBL172886",
          "CHEMBL172912",
          "CHEMBL173027",
          "CHEMBL173075",
          "CHEMBL173207",
          "CHEMBL173208",
          "CHEMBL173235",
          "CHEMBL173316",
          "CHEMBL173326",
          "CHEMBL173539",
          "CHEMBL173686",
          "CHEMBL173744",
          "CHEMBL173754",
          "CHEMBL173846",
          "CHEMBL174014",
          "CHEMBL174037",
          "CHEMBL174315",
          "CHEMBL1744401",
          "CHEMBL1744402",
          "CHEMBL1744403",
          "CHEMBL1744404",
          "CHEMBL1744405",
          "CHEMBL1744406",
          "CHEMBL1744407",
          "CHEMBL1744410",
          "CHEMBL1744412",
          "CHEMBL1744413",
          "CHEMBL1744414",
          "CHEMBL174641",
          "CHEMBL175113",
          "CHEMBL175164",
          "CHEMBL175165",
          "CHEMBL175282",
          "CHEMBL1760318",
          "CHEMBL1760322",
          "CHEMBL1760324",
          "CHEMBL176319",
          "CHEMBL176467",
          "CHEMBL176517",
          "CHEMBL176602",
          "CHEMBL176612",
          "CHEMBL1766899",
          "CHEMBL1766900",
          "CHEMBL1766901",
          "CHEMBL1766902",
          "CHEMBL1766903",
          "CHEMBL1766904",
          "CHEMBL1766905",
          "CHEMBL1766906",
          "CHEMBL1766907",
          "CHEMBL1766908",
          "CHEMBL1766909",
          "CHEMBL1766913",
          "CHEMBL1766914",
          "CHEMBL1766915",
          "CHEMBL1766916",
          "CHEMBL1766917",
          "CHEMBL1766918",
          "CHEMBL1766919",
          "CHEMBL1766920",
          "CHEMBL1766921",
          "CHEMBL1766922",
          "CHEMBL1767003",
          "CHEMBL1767004",
          "CHEMBL1767005",
          "CHEMBL1767006",
          "CHEMBL1767007",
          "CHEMBL1767008",
          "CHEMBL1767009",
          "CHEMBL1767010",
          "CHEMBL1767011",
          "CHEMBL1767012",
          "CHEMBL1767013",
          "CHEMBL1767014",
          "CHEMBL1767015",
          "CHEMBL1767016",
          "CHEMBL1767017",
          "CHEMBL176832",
          "CHEMBL176876",
          "CHEMBL176911",
          "CHEMBL1770629",
          "CHEMBL1770649",
          "CHEMBL1770700",
          "CHEMBL177072",
          "CHEMBL177077",
          "CHEMBL1770826",
          "CHEMBL1771212",
          "CHEMBL1771213",
          "CHEMBL1771214",
          "CHEMBL1771215",
          "CHEMBL1771216",
          "CHEMBL1771217",
          "CHEMBL1771218",
          "CHEMBL1771219",
          "CHEMBL1771220",
          "CHEMBL1771221",
          "CHEMBL1771222",
          "CHEMBL1771223",
          "CHEMBL177740",
          "CHEMBL1779630",
          "CHEMBL178163",
          "CHEMBL1784338",
          "CHEMBL1784339",
          "CHEMBL1784340",
          "CHEMBL1784341",
          "CHEMBL1784342",
          "CHEMBL1784343",
          "CHEMBL1784344",
          "CHEMBL1784345",
          "CHEMBL1784346",
          "CHEMBL1784347",
          "CHEMBL1784348",
          "CHEMBL1784349",
          "CHEMBL1784350",
          "CHEMBL1784351",
          "CHEMBL1784352",
          "CHEMBL1784353",
          "CHEMBL1784354",
          "CHEMBL1784356",
          "CHEMBL1784358",
          "CHEMBL1784359",
          "CHEMBL1784360",
          "CHEMBL1784361",
          "CHEMBL1784362",
          "CHEMBL1784363",
          "CHEMBL1784364",
          "CHEMBL1784365",
          "CHEMBL1784366",
          "CHEMBL1784367",
          "CHEMBL1784368",
          "CHEMBL178509",
          "CHEMBL178732",
          "CHEMBL1788203",
          "CHEMBL178929",
          "CHEMBL179288",
          "CHEMBL1795351",
          "CHEMBL179552",
          "CHEMBL1795857",
          "CHEMBL1795858",
          "CHEMBL1795859",
          "CHEMBL1795860",
          "CHEMBL1795861",
          "CHEMBL1795862",
          "CHEMBL1800089",
          "CHEMBL180047",
          "CHEMBL1801044",
          "CHEMBL1801045",
          "CHEMBL1801046",
          "CHEMBL1801047",
          "CHEMBL1801048",
          "CHEMBL1801049",
          "CHEMBL1801050",
          "CHEMBL1801051",
          "CHEMBL1801052",
          "CHEMBL1801053",
          "CHEMBL1801054",
          "CHEMBL1801055",
          "CHEMBL1801056",
          "CHEMBL1801057",
          "CHEMBL180130",
          "CHEMBL1801393",
          "CHEMBL1801394",
          "CHEMBL1801395",
          "CHEMBL1801396",
          "CHEMBL1801397",
          "CHEMBL1801398",
          "CHEMBL1801399",
          "CHEMBL1801412",
          "CHEMBL1801413",
          "CHEMBL1801414",
          "CHEMBL1801415",
          "CHEMBL1801416",
          "CHEMBL1801417",
          "CHEMBL1801418",
          "CHEMBL1801419",
          "CHEMBL1801420",
          "CHEMBL1801421",
          "CHEMBL1801422",
          "CHEMBL1801423",
          "CHEMBL1801424",
          "CHEMBL1801425",
          "CHEMBL1801426",
          "CHEMBL1801427",
          "CHEMBL1801428",
          "CHEMBL1801429",
          "CHEMBL1801430",
          "CHEMBL1801431",
          "CHEMBL180181",
          "CHEMBL180275",
          "CHEMBL180333",
          "CHEMBL180410",
          "CHEMBL180484",
          "CHEMBL180616",
          "CHEMBL180891",
          "CHEMBL181208",
          "CHEMBL181244",
          "CHEMBL181328",
          "CHEMBL181365",
          "CHEMBL181807",
          "CHEMBL182273",
          "CHEMBL182306",
          "CHEMBL182730",
          "CHEMBL182880",
          "CHEMBL1830129",
          "CHEMBL1830130",
          "CHEMBL1830131",
          "CHEMBL1830141",
          "CHEMBL1830143",
          "CHEMBL183132",
          "CHEMBL183228",
          "CHEMBL183404",
          "CHEMBL183410",
          "CHEMBL183431",
          "CHEMBL183474",
          "CHEMBL183732",
          "CHEMBL183735",
          "CHEMBL183783",
          "CHEMBL183791",
          "CHEMBL183828",
          "CHEMBL183868",
          "CHEMBL183886",
          "CHEMBL183924",
          "CHEMBL183935",
          "CHEMBL183995",
          "CHEMBL184007",
          "CHEMBL184020",
          "CHEMBL184062",
          "CHEMBL184064",
          "CHEMBL184065",
          "CHEMBL184148",
          "CHEMBL184168",
          "CHEMBL184190",
          "CHEMBL184200",
          "CHEMBL184265",
          "CHEMBL184266",
          "CHEMBL184302",
          "CHEMBL184472",
          "CHEMBL184501",
          "CHEMBL184522",
          "CHEMBL184553",
          "CHEMBL184731",
          "CHEMBL184782",
          "CHEMBL184885",
          "CHEMBL184889",
          "CHEMBL184942",
          "CHEMBL184943",
          "CHEMBL184975",
          "CHEMBL185158",
          "CHEMBL185159",
          "CHEMBL185160",
          "CHEMBL185168",
          "CHEMBL185279",
          "CHEMBL185321",
          "CHEMBL185375",
          "CHEMBL185397",
          "CHEMBL185521",
          "CHEMBL185587",
          "CHEMBL18614",
          "CHEMBL18649",
          "CHEMBL186500",
          "CHEMBL186559",
          "CHEMBL186663",
          "CHEMBL18667",
          "CHEMBL186743",
          "CHEMBL187079",
          "CHEMBL187092",
          "CHEMBL187141",
          "CHEMBL187245",
          "CHEMBL187265",
          "CHEMBL187474",
          "CHEMBL187523",
          "CHEMBL187808",
          "CHEMBL187852",
          "CHEMBL18895",
          "CHEMBL189052",
          "CHEMBL189156",
          "CHEMBL189216",
          "CHEMBL18943",
          "CHEMBL189591",
          "CHEMBL189975",
          "CHEMBL19005",
          "CHEMBL190215",
          "CHEMBL190415",
          "CHEMBL190441",
          "CHEMBL190506",
          "CHEMBL190563",
          "CHEMBL190686",
          "CHEMBL190936",
          "CHEMBL191030",
          "CHEMBL191076",
          "CHEMBL191359",
          "CHEMBL191360",
          "CHEMBL1916050",
          "CHEMBL1916054",
          "CHEMBL1916207",
          "CHEMBL1916210",
          "CHEMBL19179",
          "CHEMBL192204",
          "CHEMBL1927184",
          "CHEMBL192773",
          "CHEMBL19278",
          "CHEMBL19279",
          "CHEMBL193084",
          "CHEMBL193316",
          "CHEMBL1933865",
          "CHEMBL1933882",
          "CHEMBL19371",
          "CHEMBL193945",
          "CHEMBL1939844",
          "CHEMBL1939845",
          "CHEMBL1939846",
          "CHEMBL1939876",
          "CHEMBL1940308",
          "CHEMBL1940315",
          "CHEMBL194237",
          "CHEMBL194243",
          "CHEMBL194377",
          "CHEMBL194430",
          "CHEMBL194570",
          "CHEMBL194627",
          "CHEMBL195010",
          "CHEMBL1956115",
          "CHEMBL1957602",
          "CHEMBL1957603",
          "CHEMBL1957604",
          "CHEMBL1957605",
          "CHEMBL19583",
          "CHEMBL195948",
          "CHEMBL196092",
          "CHEMBL19611",
          "CHEMBL19623",
          "CHEMBL196460",
          "CHEMBL196647",
          "CHEMBL197632",
          "CHEMBL197685",
          "CHEMBL197729",
          "CHEMBL197842",
          "CHEMBL197908",
          "CHEMBL197931",
          "CHEMBL198039",
          "CHEMBL198048",
          "CHEMBL198055",
          "CHEMBL198100",
          "CHEMBL1981977",
          "CHEMBL198227",
          "CHEMBL198262",
          "CHEMBL198369",
          "CHEMBL198377",
          "CHEMBL198393",
          "CHEMBL19843",
          "CHEMBL198543",
          "CHEMBL19855",
          "CHEMBL198634",
          "CHEMBL198662",
          "CHEMBL198664",
          "CHEMBL19870",
          "CHEMBL19876",
          "CHEMBL198778",
          "CHEMBL198988",
          "CHEMBL199120",
          "CHEMBL199149",
          "CHEMBL199156",
          "CHEMBL199241",
          "CHEMBL19932",
          "CHEMBL1998736",
          "CHEMBL199917",
          "CHEMBL2",
          "CHEMBL200274",
          "CHEMBL20043",
          "CHEMBL2010824",
          "CHEMBL2012836",
          "CHEMBL2012837",
          "CHEMBL2012838",
          "CHEMBL20154",
          "CHEMBL20159",
          "CHEMBL20160",
          "CHEMBL20256",
          "CHEMBL202806",
          "CHEMBL202839",
          "CHEMBL20287",
          "CHEMBL202899",
          "CHEMBL202932",
          "CHEMBL203160",
          "CHEMBL203886",
          "CHEMBL203972",
          "CHEMBL204048",
          "CHEMBL204100",
          "CHEMBL204357",
          "CHEMBL204495",
          "CHEMBL204549",
          "CHEMBL204593",
          "CHEMBL2047536",
          "CHEMBL2047537",
          "CHEMBL2048502",
          "CHEMBL2048505",
          "CHEMBL2048506",
          "CHEMBL2048511",
          "CHEMBL2048512",
          "CHEMBL2051974",
          "CHEMBL205290",
          "CHEMBL205523",
          "CHEMBL205900",
          "CHEMBL205998",
          "CHEMBL206144",
          "CHEMBL206155",
          "CHEMBL206254",
          "CHEMBL206298",
          "CHEMBL206481",
          "CHEMBL206688",
          "CHEMBL206739",
          "CHEMBL206815",
          "CHEMBL206875",
          "CHEMBL206993",
          "CHEMBL207018",
          "CHEMBL207075",
          "CHEMBL207180",
          "CHEMBL207305",
          "CHEMBL207415",
          "CHEMBL207468",
          "CHEMBL207683",
          "CHEMBL207709",
          "CHEMBL207726",
          "CHEMBL207729",
          "CHEMBL207756",
          "CHEMBL207776",
          "CHEMBL207999",
          "CHEMBL208009",
          "CHEMBL208022",
          "CHEMBL208172",
          "CHEMBL208181",
          "CHEMBL208841",
          "CHEMBL2092878",
          "CHEMBL2096738",
          "CHEMBL2096739",
          "CHEMBL2096740",
          "CHEMBL2096852",
          "CHEMBL2096853",
          "CHEMBL2096854",
          "CHEMBL2096855",
          "CHEMBL209970",
          "CHEMBL210133",
          "CHEMBL210441",
          "CHEMBL210517",
          "CHEMBL2111687",
          "CHEMBL2111753",
          "CHEMBL2111754",
          "CHEMBL2111965",
          "CHEMBL2112477",
          "CHEMBL211274",
          "CHEMBL2112796",
          "CHEMBL21141",
          "CHEMBL2114138",
          "CHEMBL2114153",
          "CHEMBL211487",
          "CHEMBL2115165",
          "CHEMBL2115216",
          "CHEMBL211726",
          "CHEMBL211770",
          "CHEMBL212205",
          "CHEMBL212481",
          "CHEMBL2153737",
          "CHEMBL2153738",
          "CHEMBL218586",
          "CHEMBL219104",
          "CHEMBL219105",
          "CHEMBL2204087",
          "CHEMBL2204802",
          "CHEMBL220501",
          "CHEMBL220975",
          "CHEMBL221120",
          "CHEMBL221677",
          "CHEMBL221698",
          "CHEMBL221717",
          "CHEMBL221857",
          "CHEMBL221883",
          "CHEMBL222282",
          "CHEMBL222303",
          "CHEMBL222309",
          "CHEMBL222594",
          "CHEMBL222714",
          "CHEMBL222854",
          "CHEMBL222934",
          "CHEMBL222935",
          "CHEMBL222936",
          "CHEMBL222992",
          "CHEMBL223831",
          "CHEMBL223888",
          "CHEMBL226630",
          "CHEMBL226853",
          "CHEMBL227484",
          "CHEMBL227501",
          "CHEMBL227598",
          "CHEMBL227824",
          "CHEMBL228187",
          "CHEMBL228188",
          "CHEMBL228267",
          "CHEMBL229070",
          "CHEMBL229844",
          "CHEMBL229866",
          "CHEMBL232086",
          "CHEMBL2326363",
          "CHEMBL2326364",
          "CHEMBL2326365",
          "CHEMBL2331574",
          "CHEMBL2333261",
          "CHEMBL2333262",
          "CHEMBL2333263",
          "CHEMBL2333264",
          "CHEMBL2333265",
          "CHEMBL2333266",
          "CHEMBL2333267",
          "CHEMBL2333268",
          "CHEMBL2333269",
          "CHEMBL2333270",
          "CHEMBL2333271",
          "CHEMBL2333272",
          "CHEMBL2333273",
          "CHEMBL2333274",
          "CHEMBL2333275",
          "CHEMBL2333276",
          "CHEMBL2333277",
          "CHEMBL2333278",
          "CHEMBL2333279",
          "CHEMBL2333280",
          "CHEMBL2333281",
          "CHEMBL2333282",
          "CHEMBL2333283",
          "CHEMBL2333284",
          "CHEMBL2333285",
          "CHEMBL2333286",
          "CHEMBL2333287",
          "CHEMBL2333288",
          "CHEMBL233629",
          "CHEMBL2336335",
          "CHEMBL2336336",
          "CHEMBL2336337",
          "CHEMBL2336338",
          "CHEMBL2336339",
          "CHEMBL2336340",
          "CHEMBL2336341",
          "CHEMBL2336342",
          "CHEMBL2336343",
          "CHEMBL2336344",
          "CHEMBL2336345",
          "CHEMBL2336346",
          "CHEMBL2336347",
          "CHEMBL2336348",
          "CHEMBL2336349",
          "CHEMBL2336350",
          "CHEMBL2336351",
          "CHEMBL2336352",
          "CHEMBL2336353",
          "CHEMBL2336354",
          "CHEMBL2336355",
          "CHEMBL2336356",
          "CHEMBL2336357",
          "CHEMBL2336358",
          "CHEMBL2336359",
          "CHEMBL2336360",
          "CHEMBL2336361",
          "CHEMBL2336362",
          "CHEMBL2336363",
          "CHEMBL2336364",
          "CHEMBL2336365",
          "CHEMBL2336366",
          "CHEMBL2336779",
          "CHEMBL2336780",
          "CHEMBL2336781",
          "CHEMBL2336782",
          "CHEMBL2336783",
          "CHEMBL2336784",
          "CHEMBL2336785",
          "CHEMBL2336786",
          "CHEMBL2336787",
          "CHEMBL2336788",
          "CHEMBL2336789",
          "CHEMBL2337690",
          "CHEMBL2337691",
          "CHEMBL2337696",
          "CHEMBL2337697",
          "CHEMBL2337698",
          "CHEMBL233842",
          "CHEMBL233843",
          "CHEMBL233844",
          "CHEMBL234032",
          "CHEMBL234033",
          "CHEMBL234034",
          "CHEMBL234199",
          "CHEMBL234350",
          "CHEMBL234529",
          "CHEMBL234530",
          "CHEMBL234735",
          "CHEMBL235997",
          "CHEMBL236446",
          "CHEMBL237078",
          "CHEMBL23725",
          "CHEMBL241048",
          "CHEMBL241405",
          "CHEMBL24290",
          "CHEMBL24347",
          "CHEMBL24398",
          "CHEMBL24447",
          "CHEMBL245382",
          "CHEMBL245383",
          "CHEMBL245384",
          "CHEMBL245581",
          "CHEMBL245582",
          "CHEMBL24573",
          "CHEMBL245774",
          "CHEMBL245776",
          "CHEMBL245974",
          "CHEMBL246171",
          "CHEMBL24628",
          "CHEMBL246376",
          "CHEMBL246563",
          "CHEMBL246576",
          "CHEMBL246577",
          "CHEMBL24681",
          "CHEMBL24741",
          "CHEMBL24761",
          "CHEMBL248737",
          "CHEMBL249049",
          "CHEMBL249050",
          "CHEMBL249242",
          "CHEMBL249245",
          "CHEMBL249246",
          "CHEMBL249449",
          "CHEMBL249838",
          "CHEMBL249839",
          "CHEMBL249847",
          "CHEMBL250058",
          "CHEMBL250069",
          "CHEMBL250266",
          "CHEMBL250455",
          "CHEMBL250456",
          "CHEMBL250457",
          "CHEMBL250891",
          "CHEMBL250893",
          "CHEMBL251253",
          "CHEMBL251424",
          "CHEMBL251426",
          "CHEMBL251458",
          "CHEMBL251481",
          "CHEMBL251482",
          "CHEMBL251685",
          "CHEMBL251686",
          "CHEMBL251687",
          "CHEMBL251820",
          "CHEMBL251821",
          "CHEMBL251848",
          "CHEMBL251865",
          "CHEMBL251866",
          "CHEMBL251867",
          "CHEMBL251868",
          "CHEMBL251884",
          "CHEMBL251902",
          "CHEMBL251917",
          "CHEMBL251937",
          "CHEMBL251994",
          "CHEMBL252020",
          "CHEMBL252021",
          "CHEMBL252022",
          "CHEMBL252024",
          "CHEMBL252079",
          "CHEMBL252081",
          "CHEMBL252246",
          "CHEMBL25227",
          "CHEMBL252278",
          "CHEMBL252326",
          "CHEMBL252422",
          "CHEMBL252442",
          "CHEMBL252470",
          "CHEMBL252480",
          "CHEMBL252481",
          "CHEMBL252514",
          "CHEMBL252523",
          "CHEMBL252612",
          "CHEMBL252627",
          "CHEMBL252677",
          "CHEMBL252678",
          "CHEMBL252718",
          "CHEMBL252826",
          "CHEMBL252827",
          "CHEMBL252876",
          "CHEMBL252877",
          "CHEMBL252965",
          "CHEMBL253019",
          "CHEMBL253020",
          "CHEMBL253021",
          "CHEMBL253032",
          "CHEMBL253033",
          "CHEMBL253035",
          "CHEMBL253075",
          "CHEMBL253076",
          "CHEMBL253172",
          "CHEMBL253188",
          "CHEMBL253230",
          "CHEMBL253242",
          "CHEMBL253256",
          "CHEMBL253275",
          "CHEMBL253276",
          "CHEMBL253332",
          "CHEMBL253372",
          "CHEMBL253373",
          "CHEMBL253374",
          "CHEMBL253375",
          "CHEMBL253450",
          "CHEMBL25347",
          "CHEMBL253605",
          "CHEMBL253652",
          "CHEMBL253665",
          "CHEMBL253680",
          "CHEMBL253801",
          "CHEMBL253820",
          "CHEMBL253823",
          "CHEMBL253835",
          "CHEMBL253920",
          "CHEMBL254006",
          "CHEMBL254038",
          "CHEMBL254039",
          "CHEMBL254238",
          "CHEMBL254239",
          "CHEMBL254240",
          "CHEMBL254293",
          "CHEMBL254295",
          "CHEMBL254400",
          "CHEMBL254401",
          "CHEMBL254402",
          "CHEMBL254406",
          "CHEMBL254448",
          "CHEMBL254492",
          "CHEMBL254506",
          "CHEMBL254510",
          "CHEMBL254608",
          "CHEMBL254627",
          "CHEMBL254657",
          "CHEMBL254722",
          "CHEMBL254819",
          "CHEMBL254821",
          "CHEMBL254837",
          "CHEMBL254838",
          "CHEMBL255051",
          "CHEMBL255374",
          "CHEMBL256018",
          "CHEMBL256157",
          "CHEMBL256187",
          "CHEMBL256245",
          "CHEMBL256598",
          "CHEMBL256621",
          "CHEMBL256681",
          "CHEMBL256805",
          "CHEMBL257088",
          "CHEMBL257480",
          "CHEMBL257531",
          "CHEMBL257532",
          "CHEMBL25788",
          "CHEMBL258300",
          "CHEMBL258301",
          "CHEMBL261932",
          "CHEMBL262397",
          "CHEMBL262676",
          "CHEMBL262758",
          "CHEMBL263054",
          "CHEMBL263459",
          "CHEMBL263501",
          "CHEMBL264053",
          "CHEMBL264455",
          "CHEMBL264859",
          "CHEMBL265097",
          "CHEMBL265216",
          "CHEMBL265583",
          "CHEMBL265769",
          "CHEMBL266245",
          "CHEMBL266292",
          "CHEMBL266335",
          "CHEMBL267178",
          "CHEMBL267536",
          "CHEMBL267939",
          "CHEMBL268050",
          "CHEMBL268114",
          "CHEMBL26824",
          "CHEMBL268377",
          "CHEMBL268381",
          "CHEMBL268680",
          "CHEMBL268882",
          "CHEMBL269019",
          "CHEMBL26913",
          "CHEMBL270010",
          "CHEMBL270023",
          "CHEMBL270083",
          "CHEMBL270229",
          "CHEMBL270230",
          "CHEMBL270296",
          "CHEMBL270606",
          "CHEMBL270800",
          "CHEMBL270819",
          "CHEMBL270868",
          "CHEMBL271234",
          "CHEMBL271235",
          "CHEMBL271866",
          "CHEMBL271867",
          "CHEMBL27213",
          "CHEMBL272341",
          "CHEMBL272763",
          "CHEMBL27282",
          "CHEMBL272984",
          "CHEMBL27325",
          "CHEMBL273764",
          "CHEMBL27408",
          "CHEMBL274174",
          "CHEMBL27439",
          "CHEMBL274700",
          "CHEMBL274881",
          "CHEMBL274997",
          "CHEMBL275053",
          "CHEMBL275130",
          "CHEMBL275345",
          "CHEMBL275362",
          "CHEMBL275654",
          "CHEMBL275700",
          "CHEMBL275754",
          "CHEMBL276016",
          "CHEMBL276119",
          "CHEMBL27647",
          "CHEMBL276588",
          "CHEMBL277658",
          "CHEMBL277972",
          "CHEMBL278050",
          "CHEMBL278060",
          "CHEMBL278366",
          "CHEMBL278368",
          "CHEMBL278872",
          "CHEMBL278927",
          "CHEMBL279078",
          "CHEMBL279176",
          "CHEMBL279482",
          "CHEMBL27965",
          "CHEMBL279785",
          "CHEMBL279786",
          "CHEMBL279964",
          "CHEMBL280017",
          "CHEMBL280271",
          "CHEMBL28039",
          "CHEMBL280824",
          "CHEMBL280919",
          "CHEMBL280931",
          "CHEMBL280946",
          "CHEMBL281310",
          "CHEMBL281371",
          "CHEMBL28139",
          "CHEMBL281409",
          "CHEMBL28141",
          "CHEMBL28159",
          "CHEMBL28170",
          "CHEMBL281795",
          "CHEMBL281920",
          "CHEMBL282004",
          "CHEMBL282146",
          "CHEMBL282466",
          "CHEMBL282581",
          "CHEMBL282584",
          "CHEMBL28299",
          "CHEMBL283026",
          "CHEMBL283064",
          "CHEMBL283427",
          "CHEMBL283429",
          "CHEMBL28350",
          "CHEMBL28351",
          "CHEMBL28358",
          "CHEMBL283580",
          "CHEMBL28360",
          "CHEMBL28389",
          "CHEMBL283912",
          "CHEMBL284422",
          "CHEMBL284465",
          "CHEMBL284876",
          "CHEMBL285112",
          "CHEMBL285296",
          "CHEMBL285418",
          "CHEMBL285546",
          "CHEMBL286254",
          "CHEMBL286295",
          "CHEMBL28646",
          "CHEMBL286698",
          "CHEMBL286772",
          "CHEMBL286788",
          "CHEMBL286848",
          "CHEMBL286904",
          "CHEMBL287632",
          "CHEMBL287820",
          "CHEMBL287823",
          "CHEMBL287871",
          "CHEMBL287974",
          "CHEMBL288015",
          "CHEMBL288067",
          "CHEMBL288072",
          "CHEMBL288099",
          "CHEMBL28815",
          "CHEMBL288385",
          "CHEMBL288649",
          "CHEMBL288664",
          "CHEMBL288670",
          "CHEMBL288671",
          "CHEMBL288843",
          "CHEMBL288896",
          "CHEMBL289003",
          "CHEMBL289202",
          "CHEMBL289222",
          "CHEMBL289411",
          "CHEMBL28942",
          "CHEMBL289513",
          "CHEMBL289604",
          "CHEMBL289842",
          "CHEMBL289857",
          "CHEMBL29007",
          "CHEMBL290140",
          "CHEMBL290377",
          "CHEMBL290631",
          "CHEMBL290704",
          "CHEMBL290857",
          "CHEMBL290948",
          "CHEMBL290952",
          "CHEMBL291133",
          "CHEMBL291264",
          "CHEMBL291490",
          "CHEMBL291542",
          "CHEMBL291695",
          "CHEMBL291714",
          "CHEMBL291799",
          "CHEMBL291884",
          "CHEMBL291994",
          "CHEMBL29211",
          "CHEMBL292115",
          "CHEMBL292160",
          "CHEMBL29217",
          "CHEMBL292313",
          "CHEMBL292431",
          "CHEMBL292465",
          "CHEMBL292545",
          "CHEMBL292546",
          "CHEMBL292657",
          "CHEMBL293003",
          "CHEMBL293017",
          "CHEMBL293018",
          "CHEMBL293019",
          "CHEMBL293074",
          "CHEMBL293130",
          "CHEMBL293305",
          "CHEMBL293357",
          "CHEMBL293358",
          "CHEMBL293382",
          "CHEMBL293411",
          "CHEMBL293481",
          "CHEMBL293503",
          "CHEMBL293504",
          "CHEMBL293528",
          "CHEMBL293774",
          "CHEMBL294066",
          "CHEMBL294088",
          "CHEMBL294405",
          "CHEMBL294618",
          "CHEMBL294997",
          "CHEMBL29505",
          "CHEMBL295058",
          "CHEMBL295066",
          "CHEMBL295193",
          "CHEMBL295257",
          "CHEMBL295260",
          "CHEMBL295305",
          "CHEMBL295392",
          "CHEMBL295526",
          "CHEMBL295653",
          "CHEMBL295660",
          "CHEMBL295700",
          "CHEMBL295710",
          "CHEMBL295798",
          "CHEMBL295818",
          "CHEMBL295871",
          "CHEMBL295950",
          "CHEMBL296002",
          "CHEMBL296142",
          "CHEMBL296196",
          "CHEMBL296487",
          "CHEMBL296874",
          "CHEMBL296894",
          "CHEMBL296911",
          "CHEMBL297355",
          "CHEMBL297488",
          "CHEMBL297670",
          "CHEMBL297749",
          "CHEMBL297792",
          "CHEMBL297959",
          "CHEMBL297995",
          "CHEMBL29801",
          "CHEMBL298033",
          "CHEMBL298167",
          "CHEMBL298258",
          "CHEMBL298443",
          "CHEMBL298585",
          "CHEMBL298606",
          "CHEMBL298635",
          "CHEMBL298747",
          "CHEMBL298822",
          "CHEMBL298846",
          "CHEMBL298884",
          "CHEMBL29897",
          "CHEMBL299023",
          "CHEMBL299091",
          "CHEMBL299141",
          "CHEMBL299265",
          "CHEMBL299600",
          "CHEMBL29976",
          "CHEMBL299796",
          "CHEMBL299812",
          "CHEMBL29986",
          "CHEMBL299883",
          "CHEMBL299997",
          "CHEMBL300153",
          "CHEMBL30034",
          "CHEMBL300362",
          "CHEMBL300375",
          "CHEMBL300394",
          "CHEMBL30055",
          "CHEMBL300697",
          "CHEMBL300707",
          "CHEMBL300771",
          "CHEMBL300807",
          "CHEMBL300875",
          "CHEMBL300888",
          "CHEMBL300902",
          "CHEMBL301085",
          "CHEMBL301157",
          "CHEMBL301177",
          "CHEMBL301221",
          "CHEMBL301303",
          "CHEMBL30134",
          "CHEMBL301413",
          "CHEMBL301469",
          "CHEMBL301565",
          "CHEMBL301600",
          "CHEMBL301786",
          "CHEMBL301977",
          "CHEMBL302002",
          "CHEMBL302227",
          "CHEMBL302455",
          "CHEMBL302489",
          "CHEMBL302941",
          "CHEMBL303286",
          "CHEMBL303298",
          "CHEMBL303370",
          "CHEMBL303510",
          "CHEMBL303666",
          "CHEMBL303756",
          "CHEMBL303983",
          "CHEMBL304221",
          "CHEMBL304243",
          "CHEMBL304281",
          "CHEMBL304295",
          "CHEMBL304730",
          "CHEMBL305024",
          "CHEMBL305160",
          "CHEMBL305163",
          "CHEMBL305373",
          "CHEMBL305722",
          "CHEMBL306033",
          "CHEMBL306050",
          "CHEMBL306090",
          "CHEMBL306158",
          "CHEMBL306177",
          "CHEMBL306256",
          "CHEMBL306276",
          "CHEMBL306301",
          "CHEMBL306577",
          "CHEMBL306585",
          "CHEMBL306608",
          "CHEMBL306617",
          "CHEMBL306635",
          "CHEMBL306674",
          "CHEMBL306723",
          "CHEMBL306724",
          "CHEMBL306726",
          "CHEMBL306779",
          "CHEMBL306947",
          "CHEMBL306985",
          "CHEMBL307027",
          "CHEMBL307057",
          "CHEMBL307079",
          "CHEMBL307168",
          "CHEMBL307182",
          "CHEMBL307207",
          "CHEMBL307211",
          "CHEMBL307252",
          "CHEMBL307320",
          "CHEMBL307365",
          "CHEMBL307372",
          "CHEMBL307413",
          "CHEMBL307494",
          "CHEMBL307773",
          "CHEMBL30782",
          "CHEMBL307915",
          "CHEMBL30804",
          "CHEMBL308264",
          "CHEMBL308277",
          "CHEMBL308305",
          "CHEMBL308333",
          "CHEMBL308511",
          "CHEMBL308523",
          "CHEMBL308533",
          "CHEMBL308799",
          "CHEMBL309053",
          "CHEMBL309067",
          "CHEMBL309247",
          "CHEMBL309311",
          "CHEMBL309329",
          "CHEMBL309416",
          "CHEMBL309465",
          "CHEMBL309492",
          "CHEMBL309530",
          "CHEMBL309599",
          "CHEMBL309794",
          "CHEMBL30980",
          "CHEMBL310008",
          "CHEMBL310037",
          "CHEMBL310057",
          "CHEMBL310118",
          "CHEMBL310270",
          "CHEMBL310338",
          "CHEMBL310340",
          "CHEMBL310342",
          "CHEMBL310438",
          "CHEMBL310472",
          "CHEMBL310587",
          "CHEMBL310608",
          "CHEMBL310649",
          "CHEMBL310655",
          "CHEMBL310684",
          "CHEMBL310688",
          "CHEMBL310767",
          "CHEMBL310823",
          "CHEMBL310834",
          "CHEMBL311004",
          "CHEMBL311097",
          "CHEMBL311141",
          "CHEMBL311266",
          "CHEMBL311304",
          "CHEMBL311324",
          "CHEMBL311336",
          "CHEMBL311357",
          "CHEMBL311367",
          "CHEMBL311368",
          "CHEMBL311393",
          "CHEMBL311397",
          "CHEMBL311436",
          "CHEMBL311509",
          "CHEMBL311618",
          "CHEMBL31164",
          "CHEMBL311768",
          "CHEMBL311840",
          "CHEMBL311932",
          "CHEMBL311966",
          "CHEMBL312076",
          "CHEMBL312100",
          "CHEMBL312429",
          "CHEMBL312432",
          "CHEMBL312585",
          "CHEMBL312649",
          "CHEMBL312770",
          "CHEMBL31294",
          "CHEMBL313140",
          "CHEMBL313168",
          "CHEMBL313199",
          "CHEMBL313207",
          "CHEMBL313307",
          "CHEMBL313340",
          "CHEMBL313356",
          "CHEMBL313472",
          "CHEMBL313483",
          "CHEMBL313689",
          "CHEMBL313776",
          "CHEMBL313802",
          "CHEMBL313883",
          "CHEMBL313896",
          "CHEMBL314051",
          "CHEMBL314251",
          "CHEMBL315114",
          "CHEMBL315319",
          "CHEMBL315493",
          "CHEMBL315495",
          "CHEMBL315688",
          "CHEMBL315898",
          "CHEMBL316169",
          "CHEMBL316298",
          "CHEMBL316320",
          "CHEMBL316394",
          "CHEMBL316489",
          "CHEMBL316550",
          "CHEMBL316676",
          "CHEMBL316725",
          "CHEMBL316822",
          "CHEMBL316928",
          "CHEMBL316954",
          "CHEMBL316978",
          "CHEMBL316997",
          "CHEMBL317132",
          "CHEMBL317307",
          "CHEMBL317508",
          "CHEMBL317624",
          "CHEMBL317649",
          "CHEMBL31776",
          "CHEMBL317889",
          "CHEMBL318005",
          "CHEMBL318023",
          "CHEMBL318190",
          "CHEMBL318252",
          "CHEMBL318299",
          "CHEMBL318455",
          "CHEMBL318484",
          "CHEMBL318664",
          "CHEMBL318716",
          "CHEMBL318795",
          "CHEMBL318860",
          "CHEMBL318922",
          "CHEMBL319055",
          "CHEMBL319075",
          "CHEMBL31928",
          "CHEMBL319341",
          "CHEMBL319808",
          "CHEMBL319887",
          "CHEMBL319902",
          "CHEMBL319942",
          "CHEMBL320045",
          "CHEMBL320383",
          "CHEMBL320402",
          "CHEMBL320442",
          "CHEMBL320782",
          "CHEMBL320798",
          "CHEMBL320968",
          "CHEMBL321005",
          "CHEMBL321055",
          "CHEMBL321120",
          "CHEMBL321180",
          "CHEMBL321213",
          "CHEMBL321257",
          "CHEMBL321556",
          "CHEMBL321602",
          "CHEMBL321613",
          "CHEMBL321633",
          "CHEMBL322050",
          "CHEMBL322138",
          "CHEMBL322142",
          "CHEMBL322412",
          "CHEMBL322433",
          "CHEMBL322476",
          "CHEMBL322540",
          "CHEMBL322795",
          "CHEMBL32285",
          "CHEMBL322888",
          "CHEMBL32310",
          "CHEMBL323148",
          "CHEMBL323228",
          "CHEMBL32325",
          "CHEMBL323285",
          "CHEMBL323371",
          "CHEMBL323575",
          "CHEMBL323612",
          "CHEMBL323874",
          "CHEMBL323917",
          "CHEMBL323929",
          "CHEMBL324004",
          "CHEMBL324006",
          "CHEMBL324023",
          "CHEMBL324140",
          "CHEMBL324205",
          "CHEMBL324295",
          "CHEMBL324369",
          "CHEMBL324549",
          "CHEMBL324550",
          "CHEMBL324555",
          "CHEMBL324564",
          "CHEMBL324578",
          "CHEMBL324615",
          "CHEMBL324664",
          "CHEMBL324691",
          "CHEMBL324806",
          "CHEMBL324842",
          "CHEMBL324874",
          "CHEMBL324947",
          "CHEMBL325007",
          "CHEMBL325015",
          "CHEMBL325048",
          "CHEMBL325150",
          "CHEMBL325163",
          "CHEMBL325214",
          "CHEMBL325421",
          "CHEMBL325552",
          "CHEMBL325574",
          "CHEMBL325608",
          "CHEMBL325678",
          "CHEMBL325749",
          "CHEMBL325835",
          "CHEMBL325903",
          "CHEMBL325940",
          "CHEMBL32596",
          "CHEMBL326018",
          "CHEMBL326148",
          "CHEMBL326212",
          "CHEMBL326221",
          "CHEMBL32631",
          "CHEMBL326369",
          "CHEMBL326489",
          "CHEMBL326586",
          "CHEMBL326795",
          "CHEMBL326814",
          "CHEMBL32685",
          "CHEMBL326985",
          "CHEMBL327002",
          "CHEMBL32730",
          "CHEMBL327442",
          "CHEMBL327462",
          "CHEMBL327472",
          "CHEMBL327578",
          "CHEMBL327621",
          "CHEMBL327780",
          "CHEMBL328090",
          "CHEMBL328092",
          "CHEMBL328162",
          "CHEMBL328243",
          "CHEMBL328255",
          "CHEMBL328346",
          "CHEMBL328381",
          "CHEMBL32839",
          "CHEMBL328390",
          "CHEMBL328496",
          "CHEMBL328751",
          "CHEMBL328903",
          "CHEMBL328917",
          "CHEMBL328930",
          "CHEMBL328996",
          "CHEMBL329043",
          "CHEMBL329124",
          "CHEMBL329150",
          "CHEMBL329232",
          "CHEMBL329287",
          "CHEMBL329298",
          "CHEMBL329302",
          "CHEMBL329313",
          "CHEMBL329391",
          "CHEMBL329558",
          "CHEMBL329617",
          "CHEMBL329659",
          "CHEMBL329689",
          "CHEMBL329784",
          "CHEMBL330040",
          "CHEMBL330067",
          "CHEMBL330078",
          "CHEMBL330588",
          "CHEMBL330625",
          "CHEMBL330727",
          "CHEMBL330728",
          "CHEMBL330729",
          "CHEMBL330857",
          "CHEMBL330950",
          "CHEMBL331095",
          "CHEMBL331114",
          "CHEMBL331308",
          "CHEMBL331311",
          "CHEMBL331342",
          "CHEMBL331355",
          "CHEMBL331364",
          "CHEMBL331669",
          "CHEMBL331834",
          "CHEMBL332120",
          "CHEMBL332134",
          "CHEMBL332145",
          "CHEMBL332250",
          "CHEMBL332302",
          "CHEMBL332362",
          "CHEMBL332406",
          "CHEMBL332429",
          "CHEMBL332439",
          "CHEMBL332755",
          "CHEMBL332858",
          "CHEMBL332891",
          "CHEMBL33306",
          "CHEMBL333122",
          "CHEMBL333248",
          "CHEMBL333532",
          "CHEMBL333567",
          "CHEMBL333586",
          "CHEMBL333729",
          "CHEMBL333831",
          "CHEMBL333896",
          "CHEMBL334107",
          "CHEMBL33418",
          "CHEMBL334403",
          "CHEMBL334446",
          "CHEMBL334468",
          "CHEMBL334567",
          "CHEMBL33471",
          "CHEMBL334837",
          "CHEMBL334909",
          "CHEMBL335009",
          "CHEMBL335177",
          "CHEMBL335283",
          "CHEMBL335719",
          "CHEMBL336419",
          "CHEMBL336425",
          "CHEMBL336786",
          "CHEMBL336832",
          "CHEMBL336900",
          "CHEMBL337042",
          "CHEMBL337045",
          "CHEMBL337071",
          "CHEMBL337196",
          "CHEMBL337512",
          "CHEMBL337594",
          "CHEMBL337849",
          "CHEMBL337946",
          "CHEMBL337986",
          "CHEMBL338007",
          "CHEMBL338077",
          "CHEMBL338223",
          "CHEMBL338231",
          "CHEMBL338453",
          "CHEMBL338502",
          "CHEMBL338877",
          "CHEMBL339137",
          "CHEMBL33915",
          "CHEMBL339191",
          "CHEMBL339219",
          "CHEMBL339294",
          "CHEMBL339315",
          "CHEMBL339375",
          "CHEMBL339380",
          "CHEMBL339381",
          "CHEMBL339574",
          "CHEMBL339588",
          "CHEMBL339610",
          "CHEMBL339704",
          "CHEMBL33977",
          "CHEMBL33980",
          "CHEMBL339903",
          "CHEMBL340345",
          "CHEMBL340455",
          "CHEMBL340461",
          "CHEMBL340771",
          "CHEMBL34085",
          "CHEMBL340923",
          "CHEMBL341249",
          "CHEMBL341380",
          "CHEMBL341570",
          "CHEMBL341702",
          "CHEMBL341817",
          "CHEMBL342005",
          "CHEMBL342100",
          "CHEMBL342102",
          "CHEMBL342172",
          "CHEMBL342210",
          "CHEMBL342248",
          "CHEMBL342548",
          "CHEMBL342570",
          "CHEMBL342687",
          "CHEMBL342713",
          "CHEMBL342732",
          "CHEMBL342870",
          "CHEMBL343082",
          "CHEMBL343129",
          "CHEMBL343216",
          "CHEMBL343220",
          "CHEMBL343378",
          "CHEMBL343414",
          "CHEMBL34353",
          "CHEMBL343548",
          "CHEMBL343653",
          "CHEMBL343718",
          "CHEMBL343721",
          "CHEMBL343855",
          "CHEMBL343860",
          "CHEMBL343911",
          "CHEMBL344060",
          "CHEMBL34411",
          "CHEMBL34418",
          "CHEMBL344453",
          "CHEMBL344545",
          "CHEMBL344633",
          "CHEMBL344634",
          "CHEMBL344714",
          "CHEMBL344759",
          "CHEMBL344778",
          "CHEMBL344828",
          "CHEMBL344843",
          "CHEMBL344999",
          "CHEMBL345054",
          "CHEMBL345200",
          "CHEMBL345244",
          "CHEMBL345597",
          "CHEMBL345640",
          "CHEMBL346256",
          "CHEMBL346442",
          "CHEMBL346575",
          "CHEMBL34660",
          "CHEMBL346624",
          "CHEMBL34666",
          "CHEMBL347021",
          "CHEMBL347209",
          "CHEMBL347249",
          "CHEMBL347440",
          "CHEMBL347883",
          "CHEMBL34808",
          "CHEMBL348210",
          "CHEMBL348755",
          "CHEMBL348784",
          "CHEMBL348826",
          "CHEMBL349397",
          "CHEMBL349800",
          "CHEMBL350140",
          "CHEMBL35059",
          "CHEMBL350789",
          "CHEMBL351344",
          "CHEMBL351887",
          "CHEMBL351888",
          "CHEMBL351968",
          "CHEMBL352066",
          "CHEMBL352068",
          "CHEMBL352231",
          "CHEMBL352232",
          "CHEMBL352609",
          "CHEMBL353382",
          "CHEMBL353383",
          "CHEMBL353479",
          "CHEMBL35348",
          "CHEMBL353536",
          "CHEMBL35433",
          "CHEMBL35476",
          "CHEMBL355418",
          "CHEMBL355745",
          "CHEMBL355752",
          "CHEMBL355754",
          "CHEMBL355797",
          "CHEMBL356011",
          "CHEMBL35602",
          "CHEMBL35606",
          "CHEMBL356079",
          "CHEMBL356124",
          "CHEMBL356471",
          "CHEMBL356504",
          "CHEMBL356520",
          "CHEMBL356837",
          "CHEMBL356975",
          "CHEMBL357050",
          "CHEMBL35707",
          "CHEMBL357233",
          "CHEMBL357675",
          "CHEMBL357728",
          "CHEMBL357796",
          "CHEMBL357871",
          "CHEMBL357904",
          "CHEMBL357934",
          "CHEMBL358061",
          "CHEMBL358064",
          "CHEMBL358149",
          "CHEMBL358182",
          "CHEMBL358405",
          "CHEMBL358539",
          "CHEMBL358812",
          "CHEMBL358962",
          "CHEMBL359251",
          "CHEMBL359424",
          "CHEMBL359502",
          "CHEMBL359569",
          "CHEMBL359625",
          "CHEMBL359716",
          "CHEMBL35989",
          "CHEMBL359920",
          "CHEMBL359969",
          "CHEMBL360175",
          "CHEMBL360193",
          "CHEMBL36021",
          "CHEMBL360257",
          "CHEMBL360628",
          "CHEMBL360704",
          "CHEMBL360854",
          "CHEMBL361034",
          "CHEMBL361376",
          "CHEMBL361527",
          "CHEMBL361809",
          "CHEMBL36191",
          "CHEMBL361959",
          "CHEMBL362099",
          "CHEMBL362100",
          "CHEMBL362535",
          "CHEMBL362651",
          "CHEMBL362797",
          "CHEMBL36309",
          "CHEMBL363126",
          "CHEMBL363261",
          "CHEMBL363451",
          "CHEMBL363719",
          "CHEMBL363732",
          "CHEMBL363758",
          "CHEMBL363968",
          "CHEMBL364574",
          "CHEMBL364589",
          "CHEMBL364643",
          "CHEMBL364783",
          "CHEMBL364875",
          "CHEMBL365031",
          "CHEMBL365167",
          "CHEMBL365247",
          "CHEMBL365283",
          "CHEMBL365386",
          "CHEMBL365658",
          "CHEMBL365892",
          "CHEMBL365905",
          "CHEMBL366010",
          "CHEMBL366111",
          "CHEMBL36615",
          "CHEMBL366257",
          "CHEMBL366478",
          "CHEMBL366759",
          "CHEMBL366956",
          "CHEMBL367420",
          "CHEMBL367524",
          "CHEMBL367675",
          "CHEMBL367710",
          "CHEMBL367748",
          "CHEMBL368079",
          "CHEMBL368205",
          "CHEMBL368857",
          "CHEMBL368946",
          "CHEMBL368972",
          "CHEMBL369115",
          "CHEMBL369302",
          "CHEMBL369574",
          "CHEMBL36999",
          "CHEMBL370129",
          "CHEMBL370312",
          "CHEMBL370416",
          "CHEMBL370825",
          "CHEMBL370842",
          "CHEMBL371101",
          "CHEMBL371199",
          "CHEMBL37147",
          "CHEMBL371643",
          "CHEMBL371715",
          "CHEMBL371781",
          "CHEMBL372261",
          "CHEMBL372377",
          "CHEMBL372405",
          "CHEMBL372659",
          "CHEMBL372878",
          "CHEMBL372908",
          "CHEMBL373154",
          "CHEMBL373261",
          "CHEMBL373285",
          "CHEMBL373311",
          "CHEMBL373438",
          "CHEMBL373532",
          "CHEMBL373694",
          "CHEMBL373831",
          "CHEMBL373853",
          "CHEMBL374114",
          "CHEMBL374377",
          "CHEMBL374953",
          "CHEMBL375013",
          "CHEMBL375319",
          "CHEMBL375418",
          "CHEMBL376314",
          "CHEMBL376557",
          "CHEMBL377272",
          "CHEMBL377317",
          "CHEMBL377862",
          "CHEMBL37788",
          "CHEMBL37837",
          "CHEMBL379287",
          "CHEMBL379469",
          "CHEMBL380049",
          "CHEMBL380343",
          "CHEMBL380439",
          "CHEMBL380895",
          "CHEMBL38106",
          "CHEMBL381163",
          "CHEMBL381173",
          "CHEMBL381189",
          "CHEMBL381224",
          "CHEMBL381505",
          "CHEMBL381554",
          "CHEMBL381631",
          "CHEMBL38180",
          "CHEMBL381953",
          "CHEMBL382352",
          "CHEMBL382535",
          "CHEMBL382585",
          "CHEMBL382705",
          "CHEMBL382975",
          "CHEMBL38299",
          "CHEMBL383028",
          "CHEMBL383079",
          "CHEMBL38352",
          "CHEMBL383560",
          "CHEMBL383801",
          "CHEMBL384665",
          "CHEMBL385312",
          "CHEMBL38571",
          "CHEMBL38629",
          "CHEMBL387079",
          "CHEMBL387202",
          "CHEMBL388124",
          "CHEMBL38851",
          "CHEMBL38868",
          "CHEMBL38900",
          "CHEMBL389020",
          "CHEMBL389691",
          "CHEMBL391362",
          "CHEMBL391509",
          "CHEMBL392172",
          "CHEMBL392312",
          "CHEMBL393444",
          "CHEMBL393445",
          "CHEMBL393863",
          "CHEMBL39392",
          "CHEMBL39566",
          "CHEMBL39580",
          "CHEMBL39601",
          "CHEMBL39726",
          "CHEMBL398271",
          "CHEMBL398331",
          "CHEMBL398350",
          "CHEMBL398351",
          "CHEMBL398450",
          "CHEMBL398641",
          "CHEMBL398703",
          "CHEMBL398743",
          "CHEMBL398838",
          "CHEMBL398892",
          "CHEMBL399070",
          "CHEMBL399101",
          "CHEMBL399102",
          "CHEMBL399155",
          "CHEMBL39921",
          "CHEMBL399304",
          "CHEMBL399319",
          "CHEMBL399351",
          "CHEMBL399565",
          "CHEMBL399566",
          "CHEMBL399684",
          "CHEMBL399685",
          "CHEMBL399952",
          "CHEMBL400002",
          "CHEMBL400163",
          "CHEMBL400192",
          "CHEMBL400193",
          "CHEMBL400292",
          "CHEMBL400314",
          "CHEMBL400346",
          "CHEMBL400528",
          "CHEMBL400784",
          "CHEMBL400785",
          "CHEMBL400967",
          "CHEMBL400992",
          "CHEMBL401146",
          "CHEMBL401263",
          "CHEMBL401404",
          "CHEMBL40143",
          "CHEMBL401445",
          "CHEMBL401453",
          "CHEMBL401454",
          "CHEMBL401471",
          "CHEMBL40151",
          "CHEMBL401821",
          "CHEMBL401824",
          "CHEMBL401870",
          "CHEMBL401979",
          "CHEMBL40237",
          "CHEMBL402393",
          "CHEMBL402436",
          "CHEMBL402639",
          "CHEMBL402745",
          "CHEMBL402746",
          "CHEMBL402750",
          "CHEMBL402954",
          "CHEMBL403089",
          "CHEMBL403110",
          "CHEMBL403185",
          "CHEMBL403186",
          "CHEMBL403340",
          "CHEMBL40335",
          "CHEMBL403380",
          "CHEMBL403401",
          "CHEMBL40351",
          "CHEMBL404010",
          "CHEMBL404132",
          "CHEMBL404162",
          "CHEMBL404270",
          "CHEMBL404382",
          "CHEMBL404409",
          "CHEMBL404673",
          "CHEMBL404882",
          "CHEMBL404893",
          "CHEMBL405600",
          "CHEMBL40589",
          "CHEMBL40613",
          "CHEMBL406131",
          "CHEMBL406939",
          "CHEMBL407443",
          "CHEMBL40746",
          "CHEMBL40790",
          "CHEMBL408366",
          "CHEMBL408682",
          "CHEMBL409536",
          "CHEMBL410259",
          "CHEMBL410418",
          "CHEMBL41102",
          "CHEMBL41150",
          "CHEMBL411519",
          "CHEMBL411851",
          "CHEMBL412567",
          "CHEMBL412910",
          "CHEMBL41324",
          "CHEMBL413270",
          "CHEMBL41408",
          "CHEMBL414597",
          "CHEMBL414852",
          "CHEMBL41497",
          "CHEMBL415074",
          "CHEMBL415482",
          "CHEMBL415949",
          "CHEMBL416095",
          "CHEMBL416255",
          "CHEMBL416304",
          "CHEMBL416306",
          "CHEMBL416421",
          "CHEMBL416510",
          "CHEMBL416857",
          "CHEMBL417061",
          "CHEMBL417144",
          "CHEMBL417200",
          "CHEMBL417210",
          "CHEMBL417212",
          "CHEMBL417383",
          "CHEMBL417411",
          "CHEMBL417537",
          "CHEMBL417574",
          "CHEMBL417697",
          "CHEMBL417749",
          "CHEMBL417757",
          "CHEMBL417977",
          "CHEMBL418053",
          "CHEMBL418063",
          "CHEMBL418103",
          "CHEMBL41821",
          "CHEMBL418291",
          "CHEMBL418292",
          "CHEMBL418312",
          "CHEMBL418437",
          "CHEMBL418442",
          "CHEMBL418443",
          "CHEMBL418472",
          "CHEMBL418476",
          "CHEMBL418631",
          "CHEMBL418639",
          "CHEMBL418655",
          "CHEMBL418725",
          "CHEMBL418737",
          "CHEMBL41928",
          "CHEMBL419301",
          "CHEMBL419315",
          "CHEMBL419395",
          "CHEMBL41943",
          "CHEMBL419430",
          "CHEMBL419503",
          "CHEMBL419607",
          "CHEMBL419648",
          "CHEMBL419750",
          "CHEMBL419751",
          "CHEMBL419868",
          "CHEMBL419995",
          "CHEMBL420077",
          "CHEMBL420376",
          "CHEMBL42040",
          "CHEMBL420487",
          "CHEMBL420657",
          "CHEMBL42067",
          "CHEMBL420674",
          "CHEMBL420758",
          "CHEMBL420786",
          "CHEMBL421",
          "CHEMBL421009",
          "CHEMBL421029",
          "CHEMBL42104",
          "CHEMBL42114",
          "CHEMBL421161",
          "CHEMBL421295",
          "CHEMBL421372",
          "CHEMBL421481",
          "CHEMBL42152",
          "CHEMBL421644",
          "CHEMBL421699",
          "CHEMBL421766",
          "CHEMBL421932",
          "CHEMBL421966",
          "CHEMBL422058",
          "CHEMBL422250",
          "CHEMBL422251",
          "CHEMBL422266",
          "CHEMBL422574",
          "CHEMBL422799",
          "CHEMBL422821",
          "CHEMBL422848",
          "CHEMBL422970",
          "CHEMBL423015",
          "CHEMBL42311",
          "CHEMBL423572",
          "CHEMBL423686",
          "CHEMBL42378",
          "CHEMBL423876",
          "CHEMBL423906",
          "CHEMBL42420",
          "CHEMBL424239",
          "CHEMBL424251",
          "CHEMBL424311",
          "CHEMBL424407",
          "CHEMBL42449",
          "CHEMBL42481",
          "CHEMBL425020",
          "CHEMBL42521",
          "CHEMBL425316",
          "CHEMBL42537",
          "CHEMBL425415",
          "CHEMBL425783",
          "CHEMBL426388",
          "CHEMBL426434",
          "CHEMBL426729",
          "CHEMBL426975",
          "CHEMBL427366",
          "CHEMBL42739",
          "CHEMBL427616",
          "CHEMBL42771",
          "CHEMBL428233",
          "CHEMBL429336",
          "CHEMBL42938",
          "CHEMBL429444",
          "CHEMBL42958",
          "CHEMBL429589",
          "CHEMBL429669",
          "CHEMBL42970",
          "CHEMBL429927",
          "CHEMBL43011",
          "CHEMBL43026",
          "CHEMBL43050",
          "CHEMBL430524",
          "CHEMBL43063",
          "CHEMBL430664",
          "CHEMBL430704",
          "CHEMBL430838",
          "CHEMBL43087",
          "CHEMBL431057",
          "CHEMBL43113",
          "CHEMBL431130",
          "CHEMBL431210",
          "CHEMBL431221",
          "CHEMBL431408",
          "CHEMBL43147",
          "CHEMBL43148",
          "CHEMBL43152",
          "CHEMBL431570",
          "CHEMBL431601",
          "CHEMBL431680",
          "CHEMBL431926",
          "CHEMBL431988",
          "CHEMBL43206",
          "CHEMBL432079",
          "CHEMBL432223",
          "CHEMBL432299",
          "CHEMBL432307",
          "CHEMBL432333",
          "CHEMBL432346",
          "CHEMBL432397",
          "CHEMBL432532",
          "CHEMBL43256",
          "CHEMBL432583",
          "CHEMBL432642",
          "CHEMBL43276",
          "CHEMBL432778",
          "CHEMBL432834",
          "CHEMBL432842",
          "CHEMBL432882",
          "CHEMBL432990",
          "CHEMBL432991",
          "CHEMBL433063",
          "CHEMBL433171",
          "CHEMBL433250",
          "CHEMBL433262",
          "CHEMBL433314",
          "CHEMBL433354",
          "CHEMBL43338",
          "CHEMBL433381",
          "CHEMBL433415",
          "CHEMBL433426",
          "CHEMBL433479",
          "CHEMBL433816",
          "CHEMBL433902",
          "CHEMBL433981",
          "CHEMBL43403",
          "CHEMBL43411",
          "CHEMBL434187",
          "CHEMBL434348",
          "CHEMBL43447",
          "CHEMBL434505",
          "CHEMBL434567",
          "CHEMBL434624",
          "CHEMBL43479",
          "CHEMBL435102",
          "CHEMBL435206",
          "CHEMBL435271",
          "CHEMBL435399",
          "CHEMBL435462",
          "CHEMBL43587",
          "CHEMBL436049",
          "CHEMBL436205",
          "CHEMBL436277",
          "CHEMBL436324",
          "CHEMBL43644",
          "CHEMBL436569",
          "CHEMBL436580",
          "CHEMBL436623",
          "CHEMBL43667",
          "CHEMBL436950",
          "CHEMBL43704",
          "CHEMBL437407",
          "CHEMBL437499",
          "CHEMBL43806",
          "CHEMBL438261",
          "CHEMBL438519",
          "CHEMBL438528",
          "CHEMBL43854",
          "CHEMBL438692",
          "CHEMBL43879",
          "CHEMBL438964",
          "CHEMBL439012",
          "CHEMBL439066",
          "CHEMBL439330",
          "CHEMBL439405",
          "CHEMBL439408",
          "CHEMBL439931",
          "CHEMBL439983",
          "CHEMBL440178",
          "CHEMBL440355",
          "CHEMBL44045",
          "CHEMBL440498",
          "CHEMBL440527",
          "CHEMBL44062",
          "CHEMBL440712",
          "CHEMBL440714",
          "CHEMBL440921",
          "CHEMBL440945",
          "CHEMBL44103",
          "CHEMBL441084",
          "CHEMBL441177",
          "CHEMBL44138",
          "CHEMBL441432",
          "CHEMBL441455",
          "CHEMBL441662",
          "CHEMBL441901",
          "CHEMBL44225",
          "CHEMBL442421",
          "CHEMBL442432",
          "CHEMBL44250",
          "CHEMBL443261",
          "CHEMBL44383",
          "CHEMBL44415",
          "CHEMBL44455",
          "CHEMBL445140",
          "CHEMBL445717",
          "CHEMBL445894",
          "CHEMBL445939",
          "CHEMBL446457",
          "CHEMBL446694",
          "CHEMBL446697",
          "CHEMBL44691",
          "CHEMBL447787",
          "CHEMBL44898",
          "CHEMBL44903",
          "CHEMBL449092",
          "CHEMBL44931",
          "CHEMBL45010",
          "CHEMBL450327",
          "CHEMBL45035",
          "CHEMBL45040",
          "CHEMBL450479",
          "CHEMBL450721",
          "CHEMBL450875",
          "CHEMBL45133",
          "CHEMBL451552",
          "CHEMBL45208",
          "CHEMBL452083",
          "CHEMBL452947",
          "CHEMBL45357",
          "CHEMBL45483",
          "CHEMBL45577",
          "CHEMBL45631",
          "CHEMBL45676",
          "CHEMBL456774",
          "CHEMBL45882",
          "CHEMBL46030",
          "CHEMBL460725",
          "CHEMBL46083",
          "CHEMBL460899",
          "CHEMBL46183",
          "CHEMBL463395",
          "CHEMBL464305",
          "CHEMBL466024",
          "CHEMBL466045",
          "CHEMBL466052",
          "CHEMBL466059",
          "CHEMBL466060",
          "CHEMBL466118",
          "CHEMBL466208",
          "CHEMBL466237",
          "CHEMBL466249",
          "CHEMBL466445",
          "CHEMBL466460",
          "CHEMBL466461",
          "CHEMBL466625",
          "CHEMBL466656",
          "CHEMBL466657",
          "CHEMBL466663",
          "CHEMBL466664",
          "CHEMBL467262",
          "CHEMBL467459",
          "CHEMBL467460",
          "CHEMBL467482",
          "CHEMBL467687",
          "CHEMBL46787",
          "CHEMBL467891",
          "CHEMBL46804",
          "CHEMBL468095",
          "CHEMBL468096",
          "CHEMBL46818",
          "CHEMBL46830",
          "CHEMBL468708",
          "CHEMBL468722",
          "CHEMBL468731",
          "CHEMBL468737",
          "CHEMBL468738",
          "CHEMBL468739",
          "CHEMBL469138",
          "CHEMBL46915",
          "CHEMBL46963",
          "CHEMBL47054",
          "CHEMBL47076",
          "CHEMBL470830",
          "CHEMBL47133",
          "CHEMBL471536",
          "CHEMBL471537",
          "CHEMBL47254",
          "CHEMBL472899",
          "CHEMBL473326",
          "CHEMBL474523",
          "CHEMBL474723",
          "CHEMBL474924",
          "CHEMBL474925",
          "CHEMBL47546",
          "CHEMBL47627",
          "CHEMBL47728",
          "CHEMBL47842",
          "CHEMBL47907",
          "CHEMBL48043",
          "CHEMBL481",
          "CHEMBL48121",
          "CHEMBL48226",
          "CHEMBL48256",
          "CHEMBL48258",
          "CHEMBL48415",
          "CHEMBL484261",
          "CHEMBL484262",
          "CHEMBL48474",
          "CHEMBL485492",
          "CHEMBL48786",
          "CHEMBL488617",
          "CHEMBL489603",
          "CHEMBL48969",
          "CHEMBL49095",
          "CHEMBL49107",
          "CHEMBL491287",
          "CHEMBL49163",
          "CHEMBL491643",
          "CHEMBL492383",
          "CHEMBL492384",
          "CHEMBL492599",
          "CHEMBL493177",
          "CHEMBL493178",
          "CHEMBL493179",
          "CHEMBL493989",
          "CHEMBL494167",
          "CHEMBL49446",
          "CHEMBL494823",
          "CHEMBL494824",
          "CHEMBL495502",
          "CHEMBL495797",
          "CHEMBL496212",
          "CHEMBL496527",
          "CHEMBL496628",
          "CHEMBL496829",
          "CHEMBL496942",
          "CHEMBL497026",
          "CHEMBL49705",
          "CHEMBL497222",
          "CHEMBL497472",
          "CHEMBL497908",
          "CHEMBL497985",
          "CHEMBL49833",
          "CHEMBL498651",
          "CHEMBL498915",
          "CHEMBL499159",
          "CHEMBL499426",
          "CHEMBL499629",
          "CHEMBL499630",
          "CHEMBL499905",
          "CHEMBL500678",
          "CHEMBL500897",
          "CHEMBL500938",
          "CHEMBL501474",
          "CHEMBL501745",
          "CHEMBL502079",
          "CHEMBL50209",
          "CHEMBL50228",
          "CHEMBL502674",
          "CHEMBL503041",
          "CHEMBL503231",
          "CHEMBL503848",
          "CHEMBL50555",
          "CHEMBL506241",
          "CHEMBL507420",
          "CHEMBL508335",
          "CHEMBL509182",
          "CHEMBL509270",
          "CHEMBL509346",
          "CHEMBL51013",
          "CHEMBL510694",
          "CHEMBL511203",
          "CHEMBL511433",
          "CHEMBL511729",
          "CHEMBL512061",
          "CHEMBL512237",
          "CHEMBL512243",
          "CHEMBL512275",
          "CHEMBL512613",
          "CHEMBL513645",
          "CHEMBL513655",
          "CHEMBL513822",
          "CHEMBL513823",
          "CHEMBL514138",
          "CHEMBL514336",
          "CHEMBL515083",
          "CHEMBL515390",
          "CHEMBL51557",
          "CHEMBL515913",
          "CHEMBL515980",
          "CHEMBL516206",
          "CHEMBL51638",
          "CHEMBL51658",
          "CHEMBL51735",
          "CHEMBL51862",
          "CHEMBL51966",
          "CHEMBL51996",
          "CHEMBL52058",
          "CHEMBL52107",
          "CHEMBL52116",
          "CHEMBL52129",
          "CHEMBL521719",
          "CHEMBL522422",
          "CHEMBL523034",
          "CHEMBL523076",
          "CHEMBL523915",
          "CHEMBL523956",
          "CHEMBL523999",
          "CHEMBL52423",
          "CHEMBL525273",
          "CHEMBL52531",
          "CHEMBL52532",
          "CHEMBL525442",
          "CHEMBL525923",
          "CHEMBL526106",
          "CHEMBL526566",
          "CHEMBL52659",
          "CHEMBL527018",
          "CHEMBL52808",
          "CHEMBL52815",
          "CHEMBL52893",
          "CHEMBL52994",
          "CHEMBL53009",
          "CHEMBL53044",
          "CHEMBL53051",
          "CHEMBL53055",
          "CHEMBL53091",
          "CHEMBL53094",
          "CHEMBL53116",
          "CHEMBL53123",
          "CHEMBL53233",
          "CHEMBL53250",
          "CHEMBL53457",
          "CHEMBL53643",
          "CHEMBL538028",
          "CHEMBL53840",
          "CHEMBL53847",
          "CHEMBL538862",
          "CHEMBL539171",
          "CHEMBL53949",
          "CHEMBL539683",
          "CHEMBL539787",
          "CHEMBL539930",
          "CHEMBL54021",
          "CHEMBL54054",
          "CHEMBL540952",
          "CHEMBL54176",
          "CHEMBL542068",
          "CHEMBL542088",
          "CHEMBL54292",
          "CHEMBL54406",
          "CHEMBL54436",
          "CHEMBL54483",
          "CHEMBL54501",
          "CHEMBL54535",
          "CHEMBL54566",
          "CHEMBL545716",
          "CHEMBL54617",
          "CHEMBL54621",
          "CHEMBL54663",
          "CHEMBL54697",
          "CHEMBL54904",
          "CHEMBL54915",
          "CHEMBL54965",
          "CHEMBL54981",
          "CHEMBL550038",
          "CHEMBL550081",
          "CHEMBL550148",
          "CHEMBL550350",
          "CHEMBL550548",
          "CHEMBL550628",
          "CHEMBL55107",
          "CHEMBL55110",
          "CHEMBL55154",
          "CHEMBL55236",
          "CHEMBL55310",
          "CHEMBL55521",
          "CHEMBL55522",
          "CHEMBL55561",
          "CHEMBL55744",
          "CHEMBL55843",
          "CHEMBL55907",
          "CHEMBL55931",
          "CHEMBL55984",
          "CHEMBL56025",
          "CHEMBL56065",
          "CHEMBL560837",
          "CHEMBL561036",
          "CHEMBL561038",
          "CHEMBL561039",
          "CHEMBL561625",
          "CHEMBL561630",
          "CHEMBL56192",
          "CHEMBL56289",
          "CHEMBL563026",
          "CHEMBL56367",
          "CHEMBL563679",
          "CHEMBL56498",
          "CHEMBL566233",
          "CHEMBL566511",
          "CHEMBL566512",
          "CHEMBL56753",
          "CHEMBL567893",
          "CHEMBL567940",
          "CHEMBL56821",
          "CHEMBL568346",
          "CHEMBL56837",
          "CHEMBL569388",
          "CHEMBL56951",
          "CHEMBL57056",
          "CHEMBL572045",
          "CHEMBL572091",
          "CHEMBL572302",
          "CHEMBL572780",
          "CHEMBL572926",
          "CHEMBL572947",
          "CHEMBL572979",
          "CHEMBL572980",
          "CHEMBL572982",
          "CHEMBL573714",
          "CHEMBL573715",
          "CHEMBL573934",
          "CHEMBL573935",
          "CHEMBL573936",
          "CHEMBL574370",
          "CHEMBL574445",
          "CHEMBL574589",
          "CHEMBL574605",
          "CHEMBL574666",
          "CHEMBL575320",
          "CHEMBL57551",
          "CHEMBL575881",
          "CHEMBL575895",
          "CHEMBL575896",
          "CHEMBL575946",
          "CHEMBL575947",
          "CHEMBL57644",
          "CHEMBL579067",
          "CHEMBL579068",
          "CHEMBL583588",
          "CHEMBL583771",
          "CHEMBL584116",
          "CHEMBL584120",
          "CHEMBL584122",
          "CHEMBL584147",
          "CHEMBL584334",
          "CHEMBL584365",
          "CHEMBL584559",
          "CHEMBL585299",
          "CHEMBL585376",
          "CHEMBL58546",
          "CHEMBL58553",
          "CHEMBL58577",
          "CHEMBL585886",
          "CHEMBL586042",
          "CHEMBL58834",
          "CHEMBL58945",
          "CHEMBL58997",
          "CHEMBL59023",
          "CHEMBL590343",
          "CHEMBL59104",
          "CHEMBL591774",
          "CHEMBL59185",
          "CHEMBL59248",
          "CHEMBL59337",
          "CHEMBL59338",
          "CHEMBL59423",
          "CHEMBL59472",
          "CHEMBL59496",
          "CHEMBL59684",
          "CHEMBL59692",
          "CHEMBL59722",
          "CHEMBL59861",
          "CHEMBL59886",
          "CHEMBL59968",
          "CHEMBL60163",
          "CHEMBL60179",
          "CHEMBL60183",
          "CHEMBL60195",
          "CHEMBL60250",
          "CHEMBL602949",
          "CHEMBL603656",
          "CHEMBL60373",
          "CHEMBL605201",
          "CHEMBL60536",
          "CHEMBL60546",
          "CHEMBL60567",
          "CHEMBL605764",
          "CHEMBL608523",
          "CHEMBL60951",
          "CHEMBL61017",
          "CHEMBL61193",
          "CHEMBL61354",
          "CHEMBL61538",
          "CHEMBL61577",
          "CHEMBL61610",
          "CHEMBL61679",
          "CHEMBL61873",
          "CHEMBL62007",
          "CHEMBL62056",
          "CHEMBL62089",
          "CHEMBL62156",
          "CHEMBL62186",
          "CHEMBL62245",
          "CHEMBL62259",
          "CHEMBL62436",
          "CHEMBL62455",
          "CHEMBL62709",
          "CHEMBL62740",
          "CHEMBL62964",
          "CHEMBL63272",
          "CHEMBL64013",
          "CHEMBL64069",
          "CHEMBL64262",
          "CHEMBL64281",
          "CHEMBL64390",
          "CHEMBL64571",
          "CHEMBL64586",
          "CHEMBL64689",
          "CHEMBL64739",
          "CHEMBL64912",
          "CHEMBL64981",
          "CHEMBL65159",
          "CHEMBL65439",
          "CHEMBL65493",
          "CHEMBL65578",
          "CHEMBL65579",
          "CHEMBL6572",
          "CHEMBL66098",
          "CHEMBL66134",
          "CHEMBL66181",
          "CHEMBL66532",
          "CHEMBL66589",
          "CHEMBL66970",
          "CHEMBL67291",
          "CHEMBL67498",
          "CHEMBL68196",
          "CHEMBL68212",
          "CHEMBL68271",
          "CHEMBL68427",
          "CHEMBL68542",
          "CHEMBL68553",
          "CHEMBL68667",
          "CHEMBL68812",
          "CHEMBL69194",
          "CHEMBL69268",
          "CHEMBL69323",
          "CHEMBL69418",
          "CHEMBL69596",
          "CHEMBL69726",
          "CHEMBL6973",
          "CHEMBL69803",
          "CHEMBL70176",
          "CHEMBL707",
          "CHEMBL70957",
          "CHEMBL71007",
          "CHEMBL7108",
          "CHEMBL71120",
          "CHEMBL71309",
          "CHEMBL71436",
          "CHEMBL71573",
          "CHEMBL71645",
          "CHEMBL71686",
          "CHEMBL71725",
          "CHEMBL72511",
          "CHEMBL73652",
          "CHEMBL73803",
          "CHEMBL73866",
          "CHEMBL7390",
          "CHEMBL73928",
          "CHEMBL74040",
          "CHEMBL74151",
          "CHEMBL74308",
          "CHEMBL74365",
          "CHEMBL74812",
          "CHEMBL74954",
          "CHEMBL74977",
          "CHEMBL75046",
          "CHEMBL75094",
          "CHEMBL75114",
          "CHEMBL75139",
          "CHEMBL75148",
          "CHEMBL75154",
          "CHEMBL75164",
          "CHEMBL75189",
          "CHEMBL75302",
          "CHEMBL75393",
          "CHEMBL75403",
          "CHEMBL75419",
          "CHEMBL75433",
          "CHEMBL75437",
          "CHEMBL75464",
          "CHEMBL75487",
          "CHEMBL75529",
          "CHEMBL75567",
          "CHEMBL75618",
          "CHEMBL75641",
          "CHEMBL75702",
          "CHEMBL75735",
          "CHEMBL75925",
          "CHEMBL76038",
          "CHEMBL76043",
          "CHEMBL76137",
          "CHEMBL76158",
          "CHEMBL76222",
          "CHEMBL76297",
          "CHEMBL76356",
          "CHEMBL76488",
          "CHEMBL76519",
          "CHEMBL76606",
          "CHEMBL76619",
          "CHEMBL76673",
          "CHEMBL76674",
          "CHEMBL76757",
          "CHEMBL76836",
          "CHEMBL76847",
          "CHEMBL76856",
          "CHEMBL76869",
          "CHEMBL76878",
          "CHEMBL76888",
          "CHEMBL76970",
          "CHEMBL76974",
          "CHEMBL77013",
          "CHEMBL77057",
          "CHEMBL77125",
          "CHEMBL77128",
          "CHEMBL77163",
          "CHEMBL77176",
          "CHEMBL77237",
          "CHEMBL77258",
          "CHEMBL77425",
          "CHEMBL77461",
          "CHEMBL7756",
          "CHEMBL77567",
          "CHEMBL77630",
          "CHEMBL77659",
          "CHEMBL77663",
          "CHEMBL77666",
          "CHEMBL77667",
          "CHEMBL77754",
          "CHEMBL77808",
          "CHEMBL77874",
          "CHEMBL77907",
          "CHEMBL77923",
          "CHEMBL77946",
          "CHEMBL77956",
          "CHEMBL77972",
          "CHEMBL77995",
          "CHEMBL78001",
          "CHEMBL78027",
          "CHEMBL78031",
          "CHEMBL78047",
          "CHEMBL78052",
          "CHEMBL78066",
          "CHEMBL78081",
          "CHEMBL78102",
          "CHEMBL78111",
          "CHEMBL78145",
          "CHEMBL78213",
          "CHEMBL78255",
          "CHEMBL78299",
          "CHEMBL78335",
          "CHEMBL78337",
          "CHEMBL78369",
          "CHEMBL78478",
          "CHEMBL78508",
          "CHEMBL78549",
          "CHEMBL78598",
          "CHEMBL78611",
          "CHEMBL78709",
          "CHEMBL78798",
          "CHEMBL78826",
          "CHEMBL78909",
          "CHEMBL78919",
          "CHEMBL78934",
          "CHEMBL78962",
          "CHEMBL79111",
          "CHEMBL79267",
          "CHEMBL79433",
          "CHEMBL79712",
          "CHEMBL79906",
          "CHEMBL80102",
          "CHEMBL80146",
          "CHEMBL80183",
          "CHEMBL80248",
          "CHEMBL80272",
          "CHEMBL80300",
          "CHEMBL80321",
          "CHEMBL80322",
          "CHEMBL80361",
          "CHEMBL80378",
          "CHEMBL80401",
          "CHEMBL80413",
          "CHEMBL80453",
          "CHEMBL80486",
          "CHEMBL80496",
          "CHEMBL80732",
          "CHEMBL80798",
          "CHEMBL80814",
          "CHEMBL80911",
          "CHEMBL80969",
          "CHEMBL81014",
          "CHEMBL81113",
          "CHEMBL81264",
          "CHEMBL81270",
          "CHEMBL81672",
          "CHEMBL81763",
          "CHEMBL82113",
          "CHEMBL82169",
          "CHEMBL8256",
          "CHEMBL82868",
          "CHEMBL83209",
          "CHEMBL83282",
          "CHEMBL83368",
          "CHEMBL83508",
          "CHEMBL83616",
          "CHEMBL83955",
          "CHEMBL84031",
          "CHEMBL8432",
          "CHEMBL8447",
          "CHEMBL84576",
          "CHEMBL8466",
          "CHEMBL8474",
          "CHEMBL8494",
          "CHEMBL8496",
          "CHEMBL84969",
          "CHEMBL85026",
          "CHEMBL85374",
          "CHEMBL8553",
          "CHEMBL85766",
          "CHEMBL85806",
          "CHEMBL85933",
          "CHEMBL85987",
          "CHEMBL86468",
          "CHEMBL86483",
          "CHEMBL86488",
          "CHEMBL8655",
          "CHEMBL86797",
          "CHEMBL8702",
          "CHEMBL87046",
          "CHEMBL87113",
          "CHEMBL87229",
          "CHEMBL87377",
          "CHEMBL87460",
          "CHEMBL87775",
          "CHEMBL87781",
          "CHEMBL87786",
          "CHEMBL87990",
          "CHEMBL88112",
          "CHEMBL88220",
          "CHEMBL88300",
          "CHEMBL88302",
          "CHEMBL88400",
          "CHEMBL88427",
          "CHEMBL88520",
          "CHEMBL88530",
          "CHEMBL88559",
          "CHEMBL88655",
          "CHEMBL88718",
          "CHEMBL88872",
          "CHEMBL88878",
          "CHEMBL88892",
          "CHEMBL88905",
          "CHEMBL88983",
          "CHEMBL89057",
          "CHEMBL89314",
          "CHEMBL8943",
          "CHEMBL90211",
          "CHEMBL90321",
          "CHEMBL90337",
          "CHEMBL90487",
          "CHEMBL90743",
          "CHEMBL90762",
          "CHEMBL90806",
          "CHEMBL9086",
          "CHEMBL90908",
          "CHEMBL90978",
          "CHEMBL91039",
          "CHEMBL91054",
          "CHEMBL91055",
          "CHEMBL91124",
          "CHEMBL91434",
          "CHEMBL91636",
          "CHEMBL91655",
          "CHEMBL91661",
          "CHEMBL92077",
          "CHEMBL92078",
          "CHEMBL92254",
          "CHEMBL92327",
          "CHEMBL92385",
          "CHEMBL92453",
          "CHEMBL92600",
          "CHEMBL92608",
          "CHEMBL92762",
          "CHEMBL92767",
          "CHEMBL92778",
          "CHEMBL92828",
          "CHEMBL92847",
          "CHEMBL92899",
          "CHEMBL92923",
          "CHEMBL92927",
          "CHEMBL93067",
          "CHEMBL93231",
          "CHEMBL93235",
          "CHEMBL93395",
          "CHEMBL93583",
          "CHEMBL93620",
          "CHEMBL93687",
          "CHEMBL93695",
          "CHEMBL93720",
          "CHEMBL93742",
          "CHEMBL93791",
          "CHEMBL93890",
          "CHEMBL94114",
          "CHEMBL94155",
          "CHEMBL94248",
          "CHEMBL94324",
          "CHEMBL94346",
          "CHEMBL94348",
          "CHEMBL94357",
          "CHEMBL94363",
          "CHEMBL94368",
          "CHEMBL94467",
          "CHEMBL94518",
          "CHEMBL94643",
          "CHEMBL94823",
          "CHEMBL94828",
          "CHEMBL94872",
          "CHEMBL94948",
          "CHEMBL95068",
          "CHEMBL95165",
          "CHEMBL95170",
          "CHEMBL95237",
          "CHEMBL95262",
          "CHEMBL95305",
          "CHEMBL95460",
          "CHEMBL95483",
          "CHEMBL95486",
          "CHEMBL95614",
          "CHEMBL95693",
          "CHEMBL95708",
          "CHEMBL95718",
          "CHEMBL95763",
          "CHEMBL95807",
          "CHEMBL96018",
          "CHEMBL96049",
          "CHEMBL96277",
          "CHEMBL96310",
          "CHEMBL96396",
          "CHEMBL96417",
          "CHEMBL96419",
          "CHEMBL96438",
          "CHEMBL96636",
          "CHEMBL96637",
          "CHEMBL96654",
          "CHEMBL96771",
          "CHEMBL96853",
          "CHEMBL96881",
          "CHEMBL97034",
          "CHEMBL97057",
          "CHEMBL97382",
          "CHEMBL97388",
          "CHEMBL97389",
          "CHEMBL97478",
          "CHEMBL97510",
          "CHEMBL97612",
          "CHEMBL97614",
          "CHEMBL97709",
          "CHEMBL97762",
          "CHEMBL97788",
          "CHEMBL97790",
          "CHEMBL97838",
          "CHEMBL97898",
          "CHEMBL97908",
          "CHEMBL97936",
          "CHEMBL97951",
          "CHEMBL97962",
          "CHEMBL98017",
          "CHEMBL98044",
          "CHEMBL98061",
          "CHEMBL98233",
          "CHEMBL98304",
          "CHEMBL98328",
          "CHEMBL98770",
          "CHEMBL98917",
          "CHEMBL99072",
          "CHEMBL99103",
          "CHEMBL99109",
          "CHEMBL99120",
          "CHEMBL99148",
          "CHEMBL99189",
          "CHEMBL99283",
          "CHEMBL99318",
          "CHEMBL99547",
          "CHEMBL99733",
          "CHEMBL99745",
          "CHEMBL99981"
        ],
        "number_of_missing_values": "0"
      },
      {
        "data_type": "numeric",
        "index": "1",
        "is_ignore": "false",
        "is_row_identifier": "false",
        "is_target": "false",
        "name": "nHM",
        "number_of_missing_values": "0"
      },
      {
        "data_type": "numeric",
        "index": "2",
        "is_ignore": "false",
        "is_row_identifier": "false",
        "is_target": "false",
        "name": "Si",
        "number_of_missing_values": "0"
      },
      {
        "data_type": "numeric",
        "index": "3",
        "is_ignore": "false",
        "is_row_identifier": "false",
        "is_target": "false",
        "name": "nAT",
        "number_of_missing_values": "0"
      },
      {
        "data_type": "numeric",
        "index": "4",
        "is_ignore": "false",
        "is_row_identifier": "false",
        "is_target": "false",
        "name": "nBT",
        "number_of_missing_values": "0"
      },
      {
        "data_type": "numeric",
        "index": "5",
        "is_ignore": "false",
        "is_row_identifier": "false",
        "is_target": "false",
        "name": "Mp",
        "number_of_missing_values": "0"
      },
      {
        "data_type": "numeric",
        "index": "6",
        "is_ignore": "false",
        "is_row_identifier": "false",
        "is_target": "false",
        "name": "C.",
        "number_of_missing_values": "0"
      },
      {
        "data_type": "numeric",
        "index": "7",
        "is_ignore": "false",
        "is_row_identifier": "false",
        "is_target": "false",
        "name": "nCsp2",
        "number_of_missing_values": "0"
      },
      {
        "data_type": "numeric",
        "index": "8",
        "is_ignore": "false",
        "is_row_identifier": "false",
        "is_target": "false",
        "name": "nN",
        "number_of_missing_values": "0"
      },
      {
        "data_type": "numeric",
        "index": "9",
        "is_ignore": "false",
        "is_row_identifier": "false",
        "is_target": "false",
        "name": "SCBO",
        "number_of_missing_values": "0"
      },
      {
        "data_type": "numeric",
        "index": "10",
        "is_ignore": "false",
        "is_row_identifier": "false",
        "is_target": "false",
        "name": "nBM",
        "number_of_missing_values": "0"
      },
      {
        "data_type": "numeric",
        "index": "11",
        "is_ignore": "false",
        "is_row_identifier": "false",
        "is_target": "false",
        "name": "AMW",
        "number_of_missing_values": "0"
      },
      {
        "data_type": "numeric",
        "index": "12",
        "is_ignore": "false",
        "is_row_identifier": "false",
        "is_target": "false",
        "name": "nDB",
        "number_of_missing_values": "0"
      },
      {
        "data_type": "numeric",
        "index": "13",
        "is_ignore": "false",
        "is_row_identifier": "false",
        "is_target": "false",
        "name": "N.",
        "number_of_missing_values": "0"
      },
      {
        "data_type": "numeric",
        "index": "14",
        "is_ignore": "false",
        "is_row_identifier": "false",
        "is_target": "false",
        "name": "Se",
        "number_of_missing_values": "0"
      },
      {
        "data_type": "numeric",
        "index": "15",
        "is_ignore": "false",
        "is_row_identifier": "false",
        "is_target": "false",
        "name": "Sp",
        "number_of_missing_values": "0"
      },
      {
        "data_type": "numeric",
        "index": "16",
        "is_ignore": "false",
        "is_row_identifier": "false",
        "is_target": "false",
        "name": "Mi",
        "number_of_missing_values": "0"
      },
      {
        "data_type": "numeric",
        "index": "17",
        "is_ignore": "false",
        "is_row_identifier": "false",
        "is_target": "false",
        "name": "nC",
        "number_of_missing_values": "0"
      },
      {
        "data_type": "numeric",
        "index": "18",
        "is_ignore": "false",
        "is_row_identifier": "false",
        "is_target": "false",
        "name": "nAB",
        "number_of_missing_values": "0"
      },
      {
        "data_type": "numeric",
        "index": "19",
        "is_ignore": "false",
        "is_row_identifier": "false",
        "is_target": "false",
        "name": "nBO",
        "number_of_missing_values": "0"
      },
      {
        "data_type": "numeric",
        "index": "20",
        "is_ignore": "false",
        "is_row_identifier": "false",
        "is_target": "false",
        "name": "Mv",
        "number_of_missing_values": "0"
      },
      {
        "data_type": "numeric",
        "index": "21",
        "is_ignore": "false",
        "is_row_identifier": "false",
        "is_target": "false",
        "name": "nO",
        "number_of_missing_values": "0"
      },
      {
        "data_type": "numeric",
        "index": "22",
        "is_ignore": "false",
        "is_row_identifier": "false",
        "is_target": "false",
        "name": "nS",
        "number_of_missing_values": "0"
      },
      {
        "data_type": "numeric",
        "index": "23",
        "is_ignore": "false",
        "is_row_identifier": "false",
        "is_target": "false",
        "name": "nSK",
        "number_of_missing_values": "0"
      },
      {
        "data_type": "numeric",
        "index": "24",
        "is_ignore": "false",
        "is_row_identifier": "false",
        "is_target": "false",
        "name": "MW",
        "number_of_missing_values": "0"
      },
      {
        "data_type": "numeric",
        "index": "25",
        "is_ignore": "false",
        "is_row_identifier": "false",
        "is_target": "false",
        "name": "nH",
        "number_of_missing_values": "0"
      },
      {
        "data_type": "numeric",
        "index": "26",
        "is_ignore": "false",
        "is_row_identifier": "false",
        "is_target": "false",
        "name": "RBF",
        "number_of_missing_values": "0"
      },
      {
        "data_type": "numeric",
        "index": "27",
        "is_ignore": "false",
        "is_row_identifier": "false",
        "is_target": "false",
        "name": "H.",
        "number_of_missing_values": "0"
      },
      {
        "data_type": "numeric",
        "index": "28",
        "is_ignore": "false",
        "is_row_identifier": "false",
        "is_target": "false",
        "name": "Sv",
        "number_of_missing_values": "0"
      },
      {
        "data_type": "numeric",
        "index": "29",
        "is_ignore": "false",
        "is_row_identifier": "false",
        "is_target": "false",
        "name": "nHet",
        "number_of_missing_values": "0"
      },
      {
        "data_type": "numeric",
        "index": "30",
        "is_ignore": "false",
        "is_row_identifier": "false",
        "is_target": "false",
        "name": "Me",
        "number_of_missing_values": "0"
      },
      {
        "data_type": "numeric",
        "index": "31",
        "is_ignore": "false",
        "is_row_identifier": "false",
        "is_target": "true",
        "name": "pXC50",
        "number_of_missing_values": "0"
      }
    ]
  }
}