"molecule_id","AMW","C.","H.","Me","Mi","Mp","Mv","MW","N.","nAB","nAT","nB","nBM","nBO","nBR","nBT","nC","nCL","nCsp","nCsp2","nCsp3","nDB","nF","nH","nHet","nHM","nI","nN","nO","nP","nS","nSK","nTB","nX","O.","RBF","RBN","SCBO","Se","Si","Sp","Sv","X.","pXC50"
{1 7.453,2 41.8,3 46.8,4 1,5 1.126,6 0.67,7 0.63,8 588.81,9 5.1,10 21,11 79,13 22,14 48,16 85,17 33,20 18,21 15,22 1,23 1,24 37,25 9,26 1,28 4,29 3,31 1,32 42,34 1,35 3.8,36 0.082,37 7,38 59.5,39 78.999,40 88.94,41 52.915,42 49.756,43 1.3,44 8.886}
{0 CHEMBL1940354,1 7.489,2 40.3,3 48.6,4 0.994,5 1.124,6 0.675,7 0.624,8 539.2,9 5.6,10 17,11 72,13 18,14 41,16 76,17 29,18 1,20 16,21 13,22 1,24 35,25 8,26 2,28 4,29 2,31 1,32 37,34 1,35 2.8,36 0.092,37 7,38 50.5,39 71.6,40 80.919,41 48.62,42 44.959,43 1.4,44 6.444}
{0 CHEMBL1940355,1 7.373,2 41.1,3 49.3,4 0.992,5 1.121,6 0.676,7 0.623,8 538.21,9 4.1,10 17,11 73,13 18,14 41,16 77,17 30,18 1,20 17,21 13,22 1,24 36,25 7,26 2,28 3,29 2,31 1,32 37,34 1,35 2.7,36 0.091,37 7,38 50.5,39 72.381,40 81.836,41 49.375,42 45.464,43 1.4,44 5.422}
{0 CHEMBL1940356,1 7.011,2 40.3,3 50,4 0.99,5 1.125,6 0.663,7 0.613,8 504.76,9 5.6,10 17,11 72,13 18,14 40,16 76,17 29,20 16,21 13,22 1,24 36,25 7,26 1,28 4,29 2,31 1,32 36,35 2.8,36 0.092,37 7,38 49.5,39 71.276,40 80.975,41 47.762,42 44.131,44 6.481}
{0 CHEMBL1940357,1 7.489,2 40.3,3 48.6,4 0.994,5 1.124,6 0.675,7 0.624,8 539.2,9 5.6,10 17,11 72,13 18,14 41,16 76,17 29,18 1,20 16,21 13,22 1,24 35,25 8,26 2,28 4,29 2,31 1,32 37,34 1,35 2.8,36 0.092,37 7,38 50.5,39 71.6,40 80.919,41 48.62,42 44.959,43 1.4,44 5.669}
{0 CHEMBL1940358,1 7.489,2 40.3,3 48.6,4 0.994,5 1.124,6 0.675,7 0.624,8 539.2,9 5.6,10 17,11 72,13 18,14 41,16 76,17 29,18 1,20 16,21 13,22 1,24 35,25 8,26 2,28 4,29 2,31 1,32 37,34 1,35 2.8,36 0.092,37 7,38 50.5,39 71.6,40 80.919,41 48.62,42 44.959,43 1.4,44 4.495}
{0 CHEMBL1940359,1 7.489,2 40.3,3 48.6,4 0.994,5 1.124,6 0.675,7 0.624,8 539.2,9 5.6,10 17,11 72,13 18,14 41,16 76,17 29,18 1,20 16,21 13,22 1,24 35,25 8,26 2,28 4,29 2,31 1,32 37,34 1,35 2.8,36 0.092,37 7,38 50.5,39 71.6,40 80.919,41 48.62,42 44.959,43 1.4,44 5.126}
{0 CHEMBL1940360,1 6.917,2 40,3 50.7,4 0.989,5 1.125,6 0.66,7 0.609,8 518.79,9 5.3,10 17,11 75,13 18,14 41,16 79,17 30,20 16,21 14,22 1,24 38,25 7,26 1,28 4,29 2,31 1,32 37,35 2.7,36 0.089,37 7,38 50.5,39 74.159,40 84.39,41 49.523,42 45.658,44 6.398}
{0 CHEMBL1940361,1 7.637,2 40,3 46.7,4 1.009,5 1.139,6 0.658,7 0.624,8 572.76,9 5.3,10 17,11 75,13 18,14 44,16 79,17 30,20 16,21 14,22 1,23 3,24 35,25 10,26 1,28 4,29 2,31 1,32 40,34 3,35 2.7,36 0.089,37 7,38 53.5,39 75.698,40 85.41,41 49.336,42 46.808,43 4,44 6.699}
{0 CHEMBL1940362,1 7.037,2 39.5,3 50,4 0.993,5 1.126,6 0.658,7 0.61,8 534.79,9 5.3,10 17,11 76,13 18,14 42,16 80,17 30,20 16,21 14,22 1,24 38,25 8,26 1,28 4,29 3,31 1,32 38,35 3.9,36 0.1,37 8,38 51.5,39 75.487,40 85.6,41 49.978,42 46.373,44 5.54}
{0 CHEMBL1940363,1 7.257,2 41.1,3 47.9,4 0.993,5 1.124,6 0.671,7 0.625,8 529.77,9 6.8,10 17,11 73,13 19,14 42,16 77,17 30,19 1,20 16,21 13,22 1,24 35,25 8,26 1,28 5,29 2,31 1,32 38,33 1,35 2.7,36 0.091,37 7,38 53.5,39 72.494,40 82.058,41 49.006,42 45.626,44 5.152}
{0 CHEMBL1940364,1 7.403,2 39.1,3 49.3,4 0.992,5 1.123,6 0.676,7 0.62,8 510.79,9 5.8,10 16,11 69,13 17,14 39,16 73,17 27,20 14,21 13,22 1,24 34,25 8,26 2,28 4,29 2,31 2,32 35,35 2.9,36 0.096,37 7,38 48,39 68.469,40 77.48,41 46.648,42 42.791,44 6.684}
{0 CHEMBL1940365,1 8.546,2 39.1,3 47.8,4 0.996,5 1.121,6 0.696,7 0.635,8 589.68,9 5.8,10 16,11 69,13 17,14 40,15 1,16 73,17 27,20 14,21 13,22 1,24 33,25 9,26 3,28 4,29 2,31 2,32 36,34 1,35 2.9,36 0.096,37 7,38 49,39 68.698,40 77.322,41 48,42 43.817,43 1.4,44 7.319}
{0 CHEMBL1940366,1 8.166,2 38,3 45.1,4 1.016,5 1.141,6 0.669,7 0.633,8 579.78,9 7,10 16,11 71,13 17,14 43,16 75,17 27,20 13,21 14,22 1,23 3,24 32,25 12,26 2,28 5,29 2,31 2,32 39,34 3,35 2.8,36 0.093,37 7,38 52,39 72.109,40 80.997,41 47.466,42 44.963,43 4.2,44 6.939}
{0 CHEMBL1940367,1 7.478,2 41.3,3 48,4 0.991,5 1.119,6 0.685,7 0.631,8 560.85,9 5.3,10 21,11 75,13 22,14 44,16 80,17 31,20 18,21 13,22 1,24 36,25 8,26 2,28 4,29 2,31 2,32 39,35 2.7,36 0.088,37 7,38 55.5,39 74.352,40 83.895,41 51.41,42 47.318,44 7.62}
{0 CHEMBL1940368,1 7.264,2 41.3,3 48,4 0.995,5 1.122,6 0.67,7 0.625,8 544.78,9 5.3,10 21,11 75,13 22,14 44,16 80,17 31,20 18,21 13,22 1,24 36,25 8,26 1,28 4,29 3,31 1,32 39,35 4,36 0.088,37 7,38 55.5,39 74.603,40 84.185,41 50.216,42 46.846,44 7.745}
{0 CHEMBL1940369,1 7.155,2 40.8,3 48.7,4 0.992,5 1.125,6 0.668,7 0.62,8 543.8,9 6.6,10 21,11 76,13 22,14 44,16 81,17 31,20 18,21 13,22 1,24 37,25 8,26 1,28 5,29 2,31 1,32 39,35 2.6,36 0.086,37 7,38 55.5,39 75.378,40 85.474,41 50.768,42 47.152,44 7.699}
{0 CHEMBL1940370,1 7.611,2 40.6,3 47.8,4 0.996,5 1.123,6 0.679,7 0.629,8 525.17,9 5.8,10 17,11 69,13 18,14 40,16 73,17 28,18 1,20 16,21 12,22 1,24 33,25 8,26 2,28 4,29 2,31 1,32 36,34 1,35 2.9,36 0.096,37 7,38 49.5,39 68.716,40 77.504,41 46.858,42 43.432,43 1.4,44 5.631}
{0 CHEMBL1940371,1 7.488,2 41.2,3 48.5,4 0.991,5 1.122,6 0.682,7 0.628,8 509.17,9 5.9,10 17,11 68,13 18,14 39,16 72,17 28,18 1,20 16,21 12,22 1,24 33,25 7,26 2,28 4,29 1,31 1,32 35,34 1,35 1.5,36 0.083,37 6,38 48.5,39 67.389,40 76.295,41 46.404,42 42.717,43 1.5,44 6.336}
{0 CHEMBL1940372,1 7.376,2 40,3 49.3,4 0.993,5 1.124,6 0.672,7 0.62,8 553.23,9 5.3,10 17,11 75,13 18,14 42,16 79,17 30,18 1,20 16,21 14,22 1,24 37,25 8,26 2,28 4,29 2,31 1,32 38,34 1,35 2.7,36 0.089,37 7,38 51.5,39 74.483,40 84.334,41 50.381,42 46.485,43 1.3,44 7.663}
{0 CHEMBL1940525,1 7.551,2 41.1,3 47.9,4 0.995,5 1.122,6 0.68,7 0.63,8 551.21,9 5.5,10 17,11 73,13 18,14 43,16 78,17 30,18 1,20 16,21 14,22 1,24 35,25 8,26 2,28 4,29 2,31 1,32 38,34 1,35 2.7,36 0.09,37 7,38 52.5,39 72.6,40 81.919,41 49.62,42 45.959,43 1.4,44 6.281}
{0 CHEMBL1940526,1 7.437,2 40.8,3 48.7,4 0.993,5 1.123,6 0.676,7 0.625,8 565.24,9 5.3,10 17,11 76,13 18,14 44,16 81,17 31,18 1,20 16,21 15,22 1,24 37,25 8,26 2,28 4,29 2,31 1,32 39,34 1,35 2.6,36 0.086,37 7,38 53.5,39 75.483,40 85.334,41 51.381,42 47.485,43 1.3,44 7.699}
{0 CHEMBL1940527,1 8.648,2 41.2,3 47.1,4 0.994,5 1.12,6 0.702,7 0.643,8 588.06,9 5.9,10 17,11 68,13 18,14 40,15 1,16 72,17 28,18 1,20 16,21 12,22 1,24 32,25 8,26 3,28 4,29 1,31 1,32 36,34 2,35 1.5,36 0.083,37 6,38 49.5,39 67.618,40 76.136,41 47.756,42 43.742,43 2.9,44 5.58}
{0 CHEMBL1940528,1 8.529,2 41.7,3 47.2,4 0.993,5 1.119,6 0.702,7 0.643,8 614.1,9 5.6,10 17,11 72,13 18,14 43,15 1,16 77,17 30,18 1,20 16,21 14,22 1,24 34,25 8,26 3,28 4,29 1,31 1,32 38,34 2,35 1.4,36 0.078,37 6,38 52.5,39 71.501,40 80.551,41 50.518,42 46.269,43 2.8,44 5.657}
{0 CHEMBL1940529,1 8.529,2 41.7,3 47.2,4 0.993,5 1.119,6 0.702,7 0.643,8 614.1,9 5.6,10 17,11 72,13 18,14 43,15 1,16 77,17 30,18 1,20 16,21 14,22 1,24 34,25 8,26 3,28 4,29 1,31 1,32 38,34 2,35 1.4,36 0.078,37 6,38 52.5,39 71.501,40 80.551,41 50.518,42 46.269,43 2.8,44 6.404}
{0 CHEMBL1940530,1 8.529,2 41.7,3 47.2,4 0.993,5 1.119,6 0.702,7 0.643,8 614.1,9 5.6,10 17,11 72,13 18,14 43,15 1,16 77,17 30,18 1,20 16,21 14,22 1,24 34,25 8,26 3,28 4,29 1,31 1,32 38,34 2,35 1.4,36 0.078,37 6,38 52.5,39 71.501,40 80.551,41 50.518,42 46.269,43 2.8,44 6.221}
{0 CHEMBL1940531,1 7.437,2 40.8,3 48.7,4 0.993,5 1.123,6 0.676,7 0.625,8 565.24,9 5.3,10 17,11 76,13 18,14 44,16 81,17 31,18 1,20 16,21 15,22 1,24 37,25 8,26 2,28 4,29 2,31 1,32 39,34 1,35 2.6,36 0.086,37 7,38 53.5,39 75.483,40 85.334,41 51.381,42 47.485,43 1.3,44 5.991}
{0 CHEMBL1940532,1 7.784,2 39.7,3 46.6,4 1.002,5 1.126,6 0.676,7 0.632,8 568.2,9 6.8,10 17,11 73,13 20,14 43,16 77,17 29,18 1,20 16,21 13,22 3,24 34,25 10,26 2,28 5,29 3,31 1,32 39,34 1,35 4.1,36 0.091,37 7,38 54.5,39 73.145,40 82.212,41 49.319,42 46.168,43 1.4,44 5.959}
{0 CHEMBL1940533,1 7.854,2 40.8,3 47.9,4 0.994,5 1.122,6 0.69,7 0.635,8 557.64,9 5.6,10 17,11 71,13 18,14 41,16 75,17 29,18 2,20 16,21 13,22 1,24 34,25 8,26 3,28 4,29 1,31 1,32 37,34 2,35 1.4,36 0.08,37 6,38 50.5,39 70.596,40 79.654,41 49.023,42 45.071,43 2.8,44 5.77}
{0 CHEMBL1940534,1 7.622,2 40.8,3 47.9,4 0.997,5 1.127,6 0.678,7 0.629,8 541.19,9 5.6,10 17,11 71,13 18,14 41,16 75,17 29,18 1,20 16,21 13,22 1,23 1,24 34,25 8,26 2,28 4,29 1,31 1,32 37,34 2,35 1.4,36 0.08,37 6,38 50.5,39 70.785,40 80.05,41 48.103,42 44.627,43 2.8,44 6.495}
{0 CHEMBL1940535,1 7.26,2 40.5,3 50,4 0.989,5 1.123,6 0.675,7 0.619,8 537.23,9 5.4,10 17,11 74,13 18,14 41,16 78,17 30,18 1,20 16,21 14,22 1,24 37,25 7,26 2,28 4,29 1,31 1,32 37,34 1,35 1.4,36 0.077,37 6,38 50.5,39 73.156,40 83.125,41 49.927,42 45.771,43 1.4,44 6.676}
{0 CHEMBL1940536,1 7.164,2 41,3 48.7,4 0.993,5 1.123,6 0.666,7 0.62,8 558.81,9 5.1,10 21,11 78,13 22,14 45,16 83,17 32,20 18,21 14,22 1,24 38,25 8,26 1,28 4,29 3,31 1,32 40,35 3.8,36 0.084,37 7,38 56.5,39 77.487,40 87.6,41 51.978,42 48.373,44 8.379}
{0 CHEMBL1940537,1 7.226,2 41.8,3 48.1,4 0.994,5 1.122,6 0.671,7 0.625,8 570.82,9 5.1,10 21,11 79,13 22,14 47,16 85,17 33,20 18,21 15,22 1,24 38,25 8,26 1,28 4,29 3,31 1,32 41,35 3.8,36 0.082,37 7,38 58.5,39 78.487,40 88.6,41 52.978,42 49.373,44 8.229}
{0 CHEMBL1940538,1 7.061,2 40.5,3 49.4,4 0.991,5 1.125,6 0.665,7 0.616,8 557.83,9 6.3,10 21,11 79,13 22,14 45,16 84,17 32,20 18,21 14,22 1,24 39,25 8,26 1,28 5,29 2,31 1,32 40,35 2.5,36 0.083,37 7,38 56.5,39 78.261,40 88.889,41 52.529,42 48.679,44 8.479}
{0 CHEMBL1940539,1 7.123,2 41.3,3 48.8,4 0.991,5 1.124,6 0.669,7 0.621,8 569.84,9 6.3,10 21,11 80,13 22,14 47,16 86,17 33,20 18,21 15,22 1,24 39,25 8,26 1,28 5,29 2,31 1,32 41,35 2.5,36 0.081,37 7,38 58.5,39 79.261,40 89.889,41 53.529,42 49.679,44 8.741}
{0 CHEMBL1940540,1 7.429,2 41.8,3 48.1,4 0.99,5 1.118,6 0.686,7 0.631,8 586.89,9 5.1,10 21,11 79,13 22,14 47,16 85,17 33,20 18,21 15,22 1,24 38,25 8,26 2,28 4,29 2,31 2,32 41,35 2.5,36 0.082,37 7,38 58.5,39 78.236,40 88.31,41 54.171,42 49.845,44 8.745}
{0 CHEMBL1940541,1 8.078,2 38.7,3 45.3,4 1.013,5 1.139,6 0.67,7 0.633,8 605.82,9 6.7,10 16,11 75,13 17,14 46,16 80,17 29,20 13,21 16,22 1,23 3,24 34,25 12,26 2,28 5,29 2,31 2,32 41,34 3,35 2.7,36 0.088,37 7,38 55,39 75.992,40 85.413,41 50.228,42 47.489,43 4,44 7.854}
{0 CHEMBL1940542,1 8.565,2 38.9,3 47.2,4 0.997,5 1.122,6 0.695,7 0.637,8 616.71,9 6.9,10 16,11 72,13 17,14 43,15 1,16 77,17 28,20 13,21 15,22 1,24 34,25 10,26 3,28 5,29 2,31 2,32 38,34 1,35 2.8,36 0.091,37 7,38 52,39 71.8,40 80.82,41 50.006,42 45.838,43 1.4,44 7.921}
{0 CHEMBL1940543,1 7.132,2 41.5,3 48.8,4 0.992,5 1.122,6 0.668,7 0.621,8 584.85,9 4.9,10 21,11 82,13 22,14 48,16 88,17 34,20 18,21 16,22 1,24 40,25 8,26 1,28 4,29 3,31 1,32 42,35 3.7,36 0.08,37 7,38 59.5,39 81.37,40 92.015,41 54.739,42 50.899,44 8.409}
{0 CHEMBL1940544,1 7.453,2 41.8,3 46.8,4 1,5 1.126,6 0.67,7 0.63,8 588.81,9 5.1,10 21,11 79,13 22,14 48,16 85,17 33,20 18,21 15,22 1,23 1,24 37,25 9,26 1,28 4,29 3,31 1,32 42,34 1,35 3.8,36 0.082,37 7,38 59.5,39 78.999,40 88.94,41 52.915,42 49.756,43 1.3,44 9.383}
{0 CHEMBL1940545,1 7.348,2 41.3,3 47.5,4 0.997,5 1.128,6 0.668,7 0.626,8 587.83,9 6.3,10 21,11 80,13 22,14 48,16 86,17 33,20 18,21 15,22 1,23 1,24 38,25 9,26 1,28 5,29 2,31 1,32 42,34 1,35 2.5,36 0.081,37 7,38 59.5,39 79.774,40 90.228,41 53.466,42 50.063,43 1.3,44 9.279}
