"molecule_id","AMW","C.","H.","Me","Mi","Mp","Mv","MW","N.","nAB","nAT","nB","nBM","nBO","nBR","nBT","nC","nCL","nCsp","nCsp2","nCsp3","nDB","nF","nH","nHet","nHM","nI","nN","nO","nP","nS","nSK","nTB","nX","O.","RBF","RBN","SCBO","Se","Si","Sp","Sv","X.","pXC50"
{1 14.127,2 50,3 25,4 1.047,5 1.099,6 0.799,7 0.783,8 226.03,9 6.3,10 6,11 16,13 8,14 13,15 1,16 17,17 8,20 8,22 2,24 4,25 4,26 1,28 1,29 2,32 12,34 1,35 12.5,38 18,39 16.753,40 17.589,41 12.79,42 12.53,43 6.3,44 4.187}
{0 CHEMBL1190585,1 9.823,2 46.9,3 31.3,4 1.035,5 1.107,6 0.735,7 0.725,8 314.34,9 6.3,10 11,11 32,13 15,14 24,16 34,17 15,20 15,22 4,24 10,25 7,26 1,28 2,29 4,31 1,32 22,35 12.5,36 0.088,37 3,38 33.5,39 33.124,40 35.415,41 23.523,42 23.196,44 4}
{0 CHEMBL127205,1 8.14,2 47.8,3 39.1,4 1.013,5 1.112,6 0.694,7 0.676,8 187.21,9 4.3,10 6,11 23,13 9,14 15,16 24,17 11,20 10,21 1,22 3,24 9,25 3,28 1,29 2,32 14,35 8.7,36 0.042,37 1,38 21,39 23.291,40 25.578,41 15.96,42 15.558,44 4.84}
{0 CHEMBL1605548,1 11.304,2 45,3 40,4 1.01,5 1.111,6 0.743,7 0.693,8 226.08,9 5,10 6,11 20,13 8,14 12,15 1,16 20,17 9,20 9,22 2,24 8,25 3,26 1,28 1,29 1,32 12,34 1,35 5,36 0.1,37 2,38 17,39 20.193,40 22.21,41 14.858,42 13.869,43 5,44 5.481}
{0 CHEMBL1770154,1 9.818,2 51.7,3 31,4 1.025,5 1.104,6 0.753,7 0.738,8 284.71,9 6.9,10 12,11 29,13 15,14 22,16 31,17 15,18 1,20 15,22 3,24 9,25 5,26 1,28 2,29 2,32 20,34 1,35 6.9,36 0.065,37 2,38 31,39 29.716,40 32.02,41 21.824,42 21.407,43 3.4,44 5.828}
{0 CHEMBL1770387,1 11.445,2 50,3 18.8,4 1.097,5 1.152,6 0.707,7 0.767,8 183.12,9 6.3,10 6,11 16,13 8,14 14,16 17,17 8,20 8,22 2,23 2,24 3,25 5,28 1,29 2,32 13,34 2,35 12.5,38 19,39 17.549,40 18.427,41 11.313,42 12.271,43 12.5,44 4.187}
{0 CHEMBL1770388,1 9.944,2 51.6,3 25.8,4 1.048,5 1.106,6 0.728,7 0.748,8 308.26,9 6.5,10 12,11 31,13 16,14 26,16 34,17 16,20 16,22 4,24 8,25 7,28 2,29 5,32 23,35 16.1,36 0.059,37 2,38 36,39 32.491,40 34.289,41 22.568,42 23.197,44 4.523}
{0 CHEMBL1770389,1 9.944,2 51.6,3 25.8,4 1.048,5 1.106,6 0.728,7 0.748,8 308.26,9 6.5,10 12,11 31,13 16,14 26,16 34,17 16,20 16,22 4,24 8,25 7,28 2,29 5,32 23,35 16.1,36 0.059,37 2,38 36,39 32.491,40 34.289,41 22.568,42 23.197,44 4.602}
{0 CHEMBL1770390,1 9.282,2 51.5,3 30.3,4 1.032,5 1.106,6 0.723,7 0.728,8 306.29,9 6.1,10 12,11 33,13 16,14 26,16 36,17 17,20 16,21 1,22 4,24 10,25 6,28 2,29 4,32 23,35 12.1,36 0.056,37 2,38 36,39 34.047,40 36.495,41 23.875,42 24.009,44 4.674}
{0 CHEMBL1770391,1 8.163,2 50,3 38.5,4 1.009,5 1.107,6 0.705,7 0.685,8 424.48,9 3.8,10 18,11 52,13 22,14 36,16 56,17 26,20 22,21 4,22 4,24 20,25 6,28 2,29 4,32 32,35 7.7,36 0.071,37 4,38 49,39 52.465,40 57.571,41 36.682,42 35.643,44 4.679}
{0 CHEMBL1770393,1 9.282,2 51.5,3 30.3,4 1.032,5 1.106,6 0.723,7 0.728,8 306.29,9 6.1,10 12,11 33,13 16,14 26,16 36,17 17,20 16,21 1,22 4,24 10,25 6,28 2,29 4,32 23,35 12.1,36 0.056,37 2,38 36,39 34.047,40 36.495,41 23.875,42 24.009,44 4.745}
{0 CHEMBL1770394,1 9.637,2 47.8,3 34.8,4 1.027,5 1.11,6 0.731,7 0.712,8 221.65,9 4.3,10 6,11 23,13 9,14 16,16 24,17 11,18 1,20 10,21 1,22 3,24 8,25 4,26 1,28 1,29 2,32 15,34 1,35 8.7,36 0.042,37 1,38 22,39 23.615,40 25.522,41 16.818,42 16.386,43 4.3,44 5.824}
{0 CHEMBL1770395,1 9.637,2 47.8,3 34.8,4 1.027,5 1.11,6 0.731,7 0.712,8 221.65,9 4.3,10 6,11 23,13 9,14 16,16 24,17 11,18 1,20 10,21 1,22 3,24 8,25 4,26 1,28 1,29 2,32 15,34 1,35 8.7,36 0.042,37 1,38 22,39 23.615,40 25.522,41 16.818,42 16.386,43 4.3,44 5.4}
{0 CHEMBL1770396,1 8.922,2 47.8,3 34.8,4 1.035,5 1.127,6 0.691,7 0.693,8 205.2,9 4.3,10 6,11 23,13 9,14 16,16 24,17 11,20 10,21 1,22 3,23 1,24 8,25 4,28 1,29 2,32 15,34 1,35 8.7,36 0.042,37 1,38 22,39 23.804,40 25.918,41 15.898,42 15.942,43 4.3,44 4.829}
{0 CHEMBL1770397,1 10.045,2 44.4,3 29.6,4 1.076,5 1.156,6 0.666,7 0.702,8 271.21,9 3.7,10 6,11 27,13 9,14 20,16 28,17 12,20 10,21 2,22 3,23 3,24 8,25 7,28 1,29 3,32 19,34 3,35 11.1,36 0.071,37 2,38 26,39 29.04,40 31.222,41 17.989,42 18.95,43 11.1,44 5.515}
{0 CHEMBL1770398,1 9.637,2 47.8,3 34.8,4 1.027,5 1.11,6 0.731,7 0.712,8 221.65,9 4.3,10 6,11 23,13 9,14 16,16 24,17 11,18 1,20 10,21 1,22 3,24 8,25 4,26 1,28 1,29 2,32 15,34 1,35 8.7,36 0.042,37 1,38 22,39 23.615,40 25.522,41 16.818,42 16.386,43 4.3,44 5.369}
{0 CHEMBL1770399,1 9.818,2 51.7,3 31,4 1.025,5 1.104,6 0.753,7 0.738,8 284.71,9 6.9,10 12,11 29,13 15,14 22,16 31,17 15,18 1,20 15,22 3,24 9,25 5,26 1,28 2,29 2,32 20,34 1,35 6.9,36 0.065,37 2,38 31,39 29.716,40 32.02,41 21.824,42 21.407,43 3.4,44 5.959}
{0 CHEMBL1770400,1 9.818,2 51.7,3 31,4 1.025,5 1.104,6 0.753,7 0.738,8 284.71,9 6.9,10 12,11 29,13 15,14 22,16 31,17 15,18 1,20 15,22 3,24 9,25 5,26 1,28 2,29 2,32 20,34 1,35 6.9,36 0.065,37 2,38 31,39 29.716,40 32.02,41 21.824,42 21.407,43 3.4,44 5.921}
{0 CHEMBL1770401,1 12.538,2 51.7,3 27.6,4 1.033,5 1.099,6 0.799,7 0.774,8 363.6,9 6.9,10 12,11 29,13 15,14 23,15 1,16 31,17 15,18 1,20 15,22 3,24 8,25 6,26 2,28 2,29 2,32 21,34 2,35 6.9,36 0.065,37 2,38 32,39 29.945,40 31.862,41 23.176,42 22.432,43 6.9,44 5.854}
{0 CHEMBL1770517,1 9.538,2 48.5,3 33.3,4 1.028,5 1.11,6 0.728,7 0.717,8 314.74,9 6.1,10 12,11 33,13 15,14 24,16 35,17 16,18 1,20 15,21 1,22 3,24 11,25 6,26 1,28 2,29 3,32 22,34 1,35 9.1,36 0.086,37 3,38 33,39 33.927,40 36.645,41 24.04,42 23.649,43 3,44 5.854}
{0 CHEMBL1770518,1 9.457,2 53.3,3 33.3,4 1.017,5 1.098,6 0.753,7 0.73,8 283.72,9 3.3,10 12,11 30,13 15,14 22,16 32,17 16,18 1,20 16,22 3,24 10,25 4,26 1,28 1,29 2,32 20,34 1,35 6.7,36 0.063,37 2,38 31,39 30.498,40 32.937,41 22.58,42 21.913,43 3.3,44 5.517}
{0 CHEMBL1770519,1 10.605,2 53.3,3 30,4 1.027,5 1.096,6 0.781,7 0.758,8 318.16,9 3.3,10 12,11 30,13 15,14 23,16 32,17 16,18 2,20 16,22 3,24 9,25 5,26 2,28 1,29 2,32 21,34 2,35 6.7,36 0.063,37 2,38 32,39 30.822,40 32.881,41 23.438,42 22.74,43 6.7,44 5.553}
{0 CHEMBL1770520,1 10.605,2 53.3,3 30,4 1.027,5 1.096,6 0.781,7 0.758,8 318.16,9 3.3,10 12,11 30,13 15,14 23,16 32,17 16,18 2,20 16,22 3,24 9,25 5,26 2,28 1,29 2,32 21,34 2,35 6.7,36 0.063,37 2,38 32,39 30.822,40 32.881,41 23.438,42 22.74,43 6.7,44 6.097}
{0 CHEMBL1770521,1 9.228,2 50,3 35.3,4 1.021,5 1.105,6 0.729,7 0.71,8 313.75,9 2.9,10 12,11 34,13 15,14 24,16 36,17 17,18 1,20 16,21 1,22 3,24 12,25 5,26 1,28 1,29 3,32 22,34 1,35 8.8,36 0.083,37 3,38 33,39 34.709,40 37.562,41 24.796,42 24.154,43 2.9,44 6.089}
{0 CHEMBL1770522,1 9.228,2 50,3 35.3,4 1.021,5 1.105,6 0.729,7 0.71,8 313.75,9 2.9,10 12,11 34,13 15,14 24,16 36,17 17,18 1,20 16,21 1,22 3,24 12,25 5,26 1,28 1,29 3,32 22,34 1,35 8.8,36 0.083,37 3,38 33,39 34.709,40 37.562,41 24.796,42 24.154,43 2.9,44 5.959}
{0 CHEMBL1770523,1 9.228,2 50,3 35.3,4 1.021,5 1.105,6 0.729,7 0.71,8 313.75,9 2.9,10 12,11 34,13 15,14 24,16 36,17 17,18 1,20 16,21 1,22 3,24 12,25 5,26 1,28 1,29 3,32 22,34 1,35 8.8,36 0.083,37 3,38 33,39 34.709,40 37.562,41 24.796,42 24.154,43 2.9,44 5.923}
{0 CHEMBL1770524,1 9.336,2 50,3 34.4,4 1.019,5 1.107,6 0.737,7 0.717,8 298.74,9 6.3,10 12,11 32,13 15,14 23,16 34,17 16,18 1,20 16,22 3,24 11,25 5,26 1,28 2,29 2,32 21,34 1,35 6.3,36 0.059,37 2,38 32,39 32.6,40 35.435,41 23.585,42 22.934,43 3.1,44 5.8}
{0 CHEMBL1770525,1 9.336,2 50,3 34.4,4 1.019,5 1.107,6 0.737,7 0.717,8 298.74,9 6.3,10 12,11 32,13 15,14 23,16 34,17 16,18 1,20 16,22 3,24 11,25 5,26 1,28 2,29 2,32 21,34 1,35 6.3,36 0.059,37 2,38 32,39 32.6,40 35.435,41 23.585,42 22.934,43 3.1,44 5.741}
{0 CHEMBL1770526,1 9.336,2 50,3 34.4,4 1.019,5 1.107,6 0.737,7 0.717,8 298.74,9 6.3,10 12,11 32,13 15,14 23,16 34,17 16,18 1,20 15,21 1,22 3,24 11,25 5,26 1,28 2,29 2,32 21,34 1,35 6.3,36 0.059,37 2,38 32,39 32.6,40 35.435,41 23.585,42 22.934,43 3.1,44 5.398}
{0 CHEMBL1770527,1 8.6,2 47.4,3 39.5,4 1.01,5 1.112,6 0.713,7 0.684,8 326.8,9 5.3,10 12,11 38,13 15,14 25,16 40,17 18,18 1,20 15,21 3,22 3,24 15,25 5,26 1,28 2,29 2,32 23,34 1,35 5.3,36 0.075,37 3,38 34,39 38.367,40 42.266,41 27.108,42 25.988,43 2.6,44 5.839}
{0 CHEMBL1770528,1 8.313,2 46.3,3 41.5,4 1.006,5 1.114,6 0.704,7 0.671,8 340.83,9 4.9,10 12,11 41,13 15,14 26,16 43,17 19,18 1,20 15,21 4,22 3,24 17,25 5,26 1,28 2,29 2,32 24,34 1,35 4.9,36 0.093,37 4,38 35,39 41.251,40 45.681,41 28.87,42 27.514,43 2.4,44 5.387}
{0 CHEMBL1770529,1 9.252,2 53.8,3 33.3,4 1.012,5 1.099,6 0.752,7 0.73,8 360.81,9 5.1,10 18,11 39,13 21,14 29,16 42,17 21,18 1,20 21,22 3,24 13,25 5,26 1,28 2,29 2,32 26,34 1,35 5.1,36 0.071,37 3,38 41,39 39.484,40 42.851,41 29.347,42 28.461,43 2.6,44 6.171}
{0 CHEMBL1770530,1 7.935,2 45.8,3 43.8,4 1,5 1.115,6 0.696,7 0.658,8 380.9,9 4.2,10 12,11 48,13 15,14 30,16 51,17 22,18 1,20 15,21 7,22 3,24 21,25 5,26 1,28 2,29 2,32 27,34 1,35 4.2,36 0.078,37 4,38 39,39 48.018,40 53.511,41 33.392,42 31.568,43 2.1,44 5.426}
{0 CHEMBL1770531,1 8.925,2 52.4,3 35.7,4 1.009,5 1.102,6 0.741,7 0.714,8 374.84,9 4.8,10 18,11 42,13 21,14 30,16 45,17 22,18 1,20 21,21 1,22 3,24 15,25 5,26 1,28 2,29 2,32 27,34 1,35 4.8,36 0.089,37 4,38 42,39 42.367,40 46.266,41 31.108,42 29.988,43 2.4,44 6.387}
{0 CHEMBL1770532,1 8.642,2 51.1,3 37.8,4 1.006,5 1.104,6 0.73,7 0.7,8 388.87,9 4.4,10 18,11 45,13 21,14 31,16 48,17 23,18 1,20 21,21 2,22 3,24 17,25 5,26 1,28 2,29 2,32 28,34 1,35 4.4,36 0.104,37 5,38 43,39 45.251,40 49.681,41 32.87,42 31.514,43 2.2,44 5.681}
{0 CHEMBL1770533,1 8.394,2 50,3 39.6,4 1.003,5 1.106,6 0.721,7 0.688,8 402.9,9 4.2,10 18,11 48,13 21,14 32,16 51,17 24,18 1,20 21,21 3,22 3,24 19,25 5,26 1,28 2,29 2,32 29,34 1,35 4.2,36 0.118,37 6,38 44,39 48.134,40 53.096,41 34.631,42 33.041,43 2.1,44 5.886}
{0 CHEMBL1770534,1 9.123,2 46.2,3 35.9,4 1.023,5 1.117,6 0.713,7 0.697,8 355.8,9 7.7,10 12,11 39,13 16,14 27,16 41,17 18,18 1,20 16,21 2,22 4,24 14,25 7,26 1,28 3,29 3,32 25,34 1,35 7.7,36 0.049,37 2,38 37,39 39.913,40 43.558,41 27.807,42 27.197,43 2.6,44 5.148}
{0 CHEMBL1770535,1 9.389,2 47.4,3 34.2,4 1.03,5 1.112,6 0.717,7 0.708,8 356.78,9 5.3,10 12,11 38,13 16,14 27,16 40,17 18,18 1,20 16,21 2,22 4,24 13,25 7,26 1,28 2,29 4,32 25,34 1,35 10.5,36 0.1,37 4,38 37,39 39.138,40 42.269,41 27.256,42 26.89,43 2.6,44 5.674}
{0 CHEMBL1770536,1 9.018,2 50,3 35.4,4 1.019,5 1.106,6 0.725,7 0.707,8 432.88,9 4.2,10 18,11 48,13 22,14 34,16 51,17 24,18 1,20 22,21 2,22 4,24 17,25 7,26 1,28 2,29 4,32 31,34 1,35 8.3,36 0.118,37 6,38 47,39 48.905,40 53.1,41 34.779,42 33.944,43 2.1,44 5.606}
{0 CHEMBL1770537,1 9.018,2 50,3 35.4,4 1.019,5 1.106,6 0.725,7 0.707,8 432.88,9 4.2,10 18,11 48,13 22,14 34,16 51,17 24,18 1,20 22,21 2,22 4,24 17,25 7,26 1,28 2,29 4,32 31,34 1,35 8.3,36 0.118,37 6,38 47,39 48.905,40 53.1,41 34.779,42 33.944,43 2.1,44 5.921}
{0 CHEMBL1770538,1 8.63,2 51.7,3 34.5,4 1.014,5 1.106,6 0.723,7 0.71,8 250.27,9 6.9,10 12,11 29,13 15,14 21,16 31,17 15,20 15,22 3,24 10,25 4,28 2,29 2,32 19,35 6.9,36 0.065,37 2,38 30,39 29.393,40 32.076,41 20.966,42 20.58,44 4.79}
{0 CHEMBL1770539,1 11.35,2 51.7,3 31,4 1.021,5 1.101,6 0.77,7 0.745,8 329.16,9 6.9,10 12,11 29,13 15,14 22,15 1,16 31,17 15,20 15,22 3,24 9,25 5,26 1,28 2,29 2,32 20,34 1,35 6.9,36 0.065,37 2,38 31,39 29.622,40 31.918,41 22.318,42 21.605,43 3.4,44 6.222}
{0 CHEMBL1770540,1 9.818,2 51.7,3 31,4 1.025,5 1.104,6 0.753,7 0.738,8 284.71,9 6.9,10 12,11 29,13 15,14 22,16 31,17 15,18 1,20 15,22 3,24 9,25 5,26 1,28 2,29 2,32 20,34 1,35 6.9,36 0.065,37 2,38 31,39 29.716,40 32.02,41 21.824,42 21.407,43 3.4,44 5.572}
{0 CHEMBL1770541,1 11.35,2 51.7,3 31,4 1.021,5 1.101,6 0.77,7 0.745,8 329.16,9 6.9,10 12,11 29,13 15,14 22,15 1,16 31,17 15,20 15,22 3,24 9,25 5,26 1,28 2,29 2,32 20,34 1,35 6.9,36 0.065,37 2,38 31,39 29.622,40 31.918,41 22.318,42 21.605,43 3.4,44 5.421}
{0 CHEMBL1770542,1 8.259,2 50,3 37.5,4 1.009,5 1.109,6 0.71,7 0.691,8 264.3,9 6.3,10 12,11 32,13 15,14 22,16 34,17 16,20 15,21 1,22 3,24 12,25 4,28 2,29 2,32 20,35 6.3,36 0.059,37 2,38 31,39 32.276,40 35.491,41 22.727,42 22.106,44 5.274}
{0 CHEMBL1770543,1 9.525,2 48.4,3 29,4 1.041,5 1.115,6 0.714,7 0.726,8 295.27,9 9.7,10 12,11 31,13 17,14 24,16 33,17 15,20 15,22 5,24 9,25 7,28 3,29 4,32 22,35 12.9,36 0.091,37 3,38 35,39 32.265,40 34.578,41 22.119,42 22.504,44 5.436}
{0 CHEMBL1770544,1 9.818,2 51.7,3 31,4 1.025,5 1.104,6 0.753,7 0.738,8 284.71,9 6.9,10 12,11 29,13 15,14 22,16 31,17 15,18 1,20 15,22 3,24 9,25 5,26 1,28 2,29 2,32 20,34 1,35 6.9,36 0.065,37 2,38 31,39 29.716,40 32.02,41 21.824,42 21.407,43 3.4,44 5.477}
{0 CHEMBL1770545,1 11.35,2 51.7,3 31,4 1.021,5 1.101,6 0.77,7 0.745,8 329.16,9 6.9,10 12,11 29,13 15,14 22,15 1,16 31,17 15,20 15,22 3,24 9,25 5,26 1,28 2,29 2,32 20,34 1,35 6.9,36 0.065,37 2,38 31,39 29.622,40 31.918,41 22.318,42 21.605,43 3.4,44 5.824}
{0 CHEMBL1770546,1 9.818,2 51.7,3 31,4 1.025,5 1.104,6 0.753,7 0.738,8 284.71,9 6.9,10 12,11 29,13 15,14 22,16 31,17 15,18 1,20 15,22 3,24 9,25 5,26 1,28 2,29 2,32 20,34 1,35 6.9,36 0.065,37 2,38 31,39 29.716,40 32.02,41 21.824,42 21.407,43 3.4,44 5.467}
{0 CHEMBL1770547,1 11.35,2 51.7,3 31,4 1.021,5 1.101,6 0.77,7 0.745,8 329.16,9 6.9,10 12,11 29,13 15,14 22,15 1,16 31,17 15,20 15,22 3,24 9,25 5,26 1,28 2,29 2,32 20,34 1,35 6.9,36 0.065,37 2,38 31,39 29.622,40 31.918,41 22.318,42 21.605,43 3.4,44 5.517}
{0 CHEMBL179945,1 9.285,2 45.5,3 36.4,4 1.012,5 1.108,6 0.745,7 0.706,8 408.54,9 9.1,10 17,11 44,13 20,14 31,16 47,17 20,20 19,21 1,22 3,24 16,25 8,26 2,28 4,29 2,31 2,32 28,35 4.5,36 0.106,37 5,38 42.5,39 44.516,40 48.743,41 32.796,42 31.05,44 6.35}
{0 CHEMBL180287,1 8.7,2 44.4,3 37.8,4 1.012,5 1.118,6 0.715,7 0.686,8 391.49,9 11.1,10 17,11 45,13 20,14 31,16 48,17 20,20 19,21 1,22 3,24 17,25 8,26 1,28 5,29 2,31 1,32 28,35 4.4,36 0.104,37 5,38 42.5,39 45.542,40 50.322,41 32.154,42 30.885,44 5.432}
{0 CHEMBL180512,1 8.991,2 44.7,3 38.3,4 1.009,5 1.11,6 0.735,7 0.693,8 422.57,9 8.5,10 17,11 47,13 20,14 32,16 50,17 21,20 19,21 2,22 3,24 18,25 8,26 2,28 4,29 2,31 2,32 29,35 4.3,36 0.12,37 6,38 43.5,39 47.4,40 52.158,41 34.557,42 32.577,44 5.638}
{0 CHEMBL180595,1 9.694,2 45.5,3 34.1,4 1.023,5 1.116,6 0.744,7 0.714,8 426.53,9 9.1,10 17,11 44,13 20,14 32,16 47,17 20,20 19,21 1,22 3,23 1,24 15,25 9,26 2,28 4,29 2,31 2,32 29,34 1,35 4.5,36 0.106,37 5,38 43.5,39 45.029,40 49.083,41 32.733,42 31.434,43 2.3,44 6.674}
{0 CHEMBL180596,1 9.694,2 45.5,3 34.1,4 1.023,5 1.116,6 0.744,7 0.714,8 426.53,9 9.1,10 17,11 44,13 20,14 32,16 47,17 20,20 19,21 1,22 3,23 1,24 15,25 9,26 2,28 4,29 2,31 2,32 29,34 1,35 4.5,36 0.106,37 5,38 43.5,39 45.029,40 49.083,41 32.733,42 31.434,43 2.3,44 5.886}
{0 CHEMBL180642,1 9.137,2 43.8,3 37.5,4 1.015,5 1.112,6 0.729,7 0.694,8 438.57,9 8.3,10 17,11 48,13 20,14 33,16 51,17 21,20 19,21 2,22 3,24 18,25 9,26 2,28 4,29 3,31 2,32 30,35 6.3,36 0.118,37 6,38 44.5,39 48.727,40 53.368,41 35.012,42 33.292,44 6.207}
{0 CHEMBL180643,1 9.85,2 40.5,3 35.1,4 1.031,5 1.126,6 0.729,7 0.7,8 364.46,9 10.8,10 11,11 37,13 14,14 26,16 39,17 15,20 13,21 2,22 3,23 1,24 13,25 9,26 2,28 4,29 2,31 2,32 24,34 1,35 5.4,36 0.103,37 4,38 34.5,39 38.145,40 41.668,41 26.972,42 25.907,43 2.7,44 5.201}
{0 CHEMBL180847,1 8.678,2 43.9,3 40.4,4 1.01,5 1.118,6 0.715,7 0.676,8 494.66,9 7,10 17,11 57,13 20,14 38,16 61,17 25,20 19,21 6,22 3,23 1,24 23,25 9,26 2,28 4,29 2,31 2,32 34,34 1,35 3.5,36 0.098,37 6,38 49.5,39 57.563,40 63.744,41 40.779,42 38.541,43 1.8,44 5.638}
{0 CHEMBL180953,1 8.292,2 40,3 44,4 1.003,5 1.12,6 0.702,7 0.653,8 414.6,9 8,10 11,11 50,13 14,14 31,16 53,17 20,20 13,21 7,22 3,24 22,25 8,26 2,28 4,29 2,31 2,32 28,35 4,36 0.094,37 5,38 39.5,39 50.167,40 55.989,41 35.08,42 32.631,44 5.585}
{0 CHEMBL181103,1 9.373,2 46.8,3 36.2,4 1.02,5 1.109,6 0.738,7 0.706,8 440.55,9 4.3,10 17,11 47,13 20,14 33,16 50,17 22,20 19,21 3,22 3,23 1,24 17,25 8,26 2,28 2,29 3,31 2,32 30,34 1,35 6.4,36 0.14,37 7,38 44.5,39 47.92,40 52.126,41 34.699,42 33.159,43 2.1,44 4.699}
{0 CHEMBL181135,1 9.128,2 39.5,3 39.5,4 1.021,5 1.128,6 0.709,7 0.673,8 392.52,9 9.3,10 11,11 43,13 14,14 28,16 45,17 17,20 13,21 4,22 3,23 1,24 17,25 9,26 2,28 4,29 2,31 2,32 26,34 1,35 4.7,36 0.111,37 5,38 36.5,39 43.913,40 48.498,41 30.495,42 28.96,43 2.3,44 6.638}
{0 CHEMBL181185,1 8.718,2 37.9,3 41.4,4 1.023,5 1.132,6 0.684,7 0.655,8 505.65,9 8.6,10 11,11 58,13 15,14 37,16 61,17 22,20 14,21 8,22 4,23 1,24 24,25 12,26 2,28 5,29 4,31 2,32 34,34 1,35 6.9,36 0.098,37 6,38 46.5,39 59.32,40 65.661,41 39.693,42 37.992,43 1.7,44 5.959}
{0 CHEMBL181418,1 8.92,2 45.5,3 36.4,4 1.017,5 1.114,6 0.718,7 0.695,8 392.47,9 9.1,10 17,11 44,13 20,14 31,16 47,17 20,20 19,21 1,22 3,24 16,25 8,26 1,28 4,29 3,31 1,32 28,35 6.8,36 0.106,37 5,38 42.5,39 44.767,40 49.033,41 31.602,42 30.578,44 5.347}
{0 CHEMBL182337,1 10.5,2 48.8,3 29.3,4 1.041,5 1.113,6 0.759,7 0.744,8 430.48,9 4.9,10 17,11 41,13 20,14 32,16 44,17 20,20 19,21 1,22 3,23 2,24 12,25 9,26 2,28 2,29 3,31 2,32 29,34 2,35 7.3,36 0.114,37 5,38 43.5,39 42.665,40 45.635,41 31.114,42 30.489,43 4.9,44 4.699}
{0 CHEMBL182437,1 9.285,2 45.5,3 36.4,4 1.012,5 1.108,6 0.745,7 0.706,8 408.54,9 9.1,10 17,11 44,13 20,14 31,16 47,17 20,20 19,21 1,22 3,24 16,25 8,26 2,28 4,29 2,31 2,32 28,35 4.5,36 0.106,37 5,38 42.5,39 44.516,40 48.743,41 32.796,42 31.05,44 4.699}
{0 CHEMBL182540,1 9.121,2 39.1,3 39.1,4 1.022,5 1.13,6 0.707,7 0.674,8 419.55,9 10.9,10 11,11 46,13 14,14 31,16 49,17 18,20 13,21 5,22 3,23 1,24 18,25 10,26 2,28 5,29 2,31 2,32 28,34 1,35 4.3,36 0.082,37 4,38 39.5,39 47.014,40 51.996,41 32.5,42 30.982,43 2.2,44 6.276}
{0 CHEMBL182587,1 9.756,2 44.7,3 34,4 1.03,5 1.124,6 0.733,7 0.709,8 458.55,9 8.5,10 17,11 47,13 20,14 34,16 50,17 21,20 19,21 2,22 3,23 2,24 16,25 10,26 2,28 4,29 2,31 2,32 31,34 2,35 4.3,36 0.1,37 5,38 45.5,39 48.425,40 52.838,41 34.432,42 33.344,43 4.3,44 4.699}
{0 CHEMBL182633,1 8.901,2 44.4,3 38.9,4 1.013,5 1.117,6 0.723,7 0.685,8 480.63,9 7.4,10 17,11 54,13 20,14 37,16 58,17 24,20 19,21 5,22 3,23 1,24 21,25 9,26 2,28 4,29 2,31 2,32 33,34 1,35 3.7,36 0.086,37 5,38 48.5,39 54.68,40 60.329,41 39.017,42 37.014,43 1.9,44 6.401}
{0 CHEMBL182685,1 10.068,2 45.5,3 34.1,4 1.019,5 1.107,6 0.765,7 0.724,8 442.98,9 9.1,10 17,11 44,13 20,14 32,16 47,17 20,18 1,20 19,21 1,22 3,24 15,25 9,26 3,28 4,29 2,31 2,32 29,34 1,35 4.5,36 0.106,37 5,38 43.5,39 44.84,40 48.687,41 33.654,42 31.878,43 2.3,44 5.745}
{0 CHEMBL182890,1 8.991,2 44.7,3 38.3,4 1.009,5 1.11,6 0.735,7 0.693,8 422.57,9 8.5,10 17,11 47,13 20,14 32,16 50,17 21,20 19,21 2,22 3,24 18,25 8,26 2,28 4,29 2,31 2,32 29,35 4.3,36 0.1,37 5,38 43.5,39 47.4,40 52.158,41 34.557,42 32.577,44 6.796}
{0 CHEMBL183047,1 9.194,2 40.9,3 38.6,4 1.021,5 1.125,6 0.716,7 0.681,8 404.53,9 9.1,10 11,11 44,13 14,14 30,16 47,17 18,20 13,21 5,22 3,23 1,24 17,25 9,26 2,28 4,29 2,31 2,32 27,34 1,35 4.5,36 0.085,37 4,38 38.5,39 44.913,40 49.498,41 31.495,42 29.96,43 2.3,44 6.347}
{0 CHEMBL183201,1 10.068,2 45.5,3 34.1,4 1.019,5 1.107,6 0.765,7 0.724,8 442.98,9 9.1,10 17,11 44,13 20,14 32,16 47,17 20,18 1,20 19,21 1,22 3,24 15,25 9,26 3,28 4,29 2,31 2,32 29,34 1,35 4.5,36 0.106,37 5,38 43.5,39 44.84,40 48.687,41 33.654,42 31.878,43 2.3,44 5.745}
{0 CHEMBL183223,1 9.512,2 43.8,3 35.4,4 1.026,5 1.119,6 0.728,7 0.702,8 456.56,9 8.3,10 17,11 48,13 20,14 34,16 51,17 21,20 19,21 2,22 3,23 1,24 17,25 10,26 2,28 4,29 3,31 2,32 31,34 1,35 6.3,36 0.118,37 6,38 45.5,39 49.24,40 53.708,41 34.949,42 33.675,43 2.1,44 6.766}
{0 CHEMBL183428,1 8.947,2 46.8,3 36.2,4 1.018,5 1.119,6 0.72,7 0.697,8 420.5,9 8.5,10 18,11 47,13 21,14 33,16 50,17 22,20 21,21 1,22 3,23 1,24 17,25 8,26 1,28 4,29 2,31 1,32 30,34 1,35 4.3,36 0.1,37 5,38 45,39 47.836,40 52.578,41 33.847,42 32.773,43 2.1,44 5.824}
{0 CHEMBL183440,1 8.608,2 38.5,3 42.3,4 1.015,5 1.131,6 0.693,7 0.655,8 447.61,9 9.6,10 11,11 52,13 14,14 33,16 55,17 20,20 13,21 7,22 3,23 1,24 22,25 10,26 2,28 5,29 2,31 2,32 30,34 1,35 3.8,36 0.109,37 6,38 41.5,39 52.782,40 58.827,41 36.023,42 34.035,43 1.9,44 5.222}
{0 CHEMBL183571,1 9.694,2 45.5,3 34.1,4 1.023,5 1.116,6 0.744,7 0.714,8 426.53,9 9.1,10 17,11 44,13 20,14 32,16 47,17 20,20 19,21 1,22 3,23 1,24 15,25 9,26 2,28 4,29 2,31 2,32 29,34 1,35 4.5,36 0.106,37 5,38 43.5,39 45.029,40 49.083,41 32.733,42 31.434,43 2.3,44 6.318}
{0 CHEMBL183605,1 9.456,2 46.7,3 35.6,4 1.018,5 1.111,6 0.744,7 0.71,8 425.54,9 6.7,10 17,11 45,13 20,14 32,16 48,17 21,20 19,21 2,22 3,23 1,24 16,25 8,26 2,28 3,29 2,31 2,32 29,34 1,35 4.4,36 0.125,37 6,38 43.5,39 45.811,40 50,41 33.489,42 31.939,43 2.2,44 5.276}
{0 CHEMBL183659,1 10.885,2 45.5,3 29.5,4 1.042,5 1.122,6 0.762,7 0.742,8 478.96,9 9.1,10 17,11 44,13 20,14 34,16 47,17 20,18 1,20 19,21 1,22 3,23 2,24 13,25 11,26 3,28 4,29 2,31 2,32 31,34 3,35 4.5,36 0.106,37 5,38 45.5,39 45.865,40 49.367,41 33.529,42 32.644,43 6.8,44 6.886}
{0 CHEMBL183661,1 8.991,2 44.7,3 38.3,4 1.009,5 1.11,6 0.735,7 0.693,8 422.57,9 8.5,10 17,11 47,13 20,14 32,16 50,17 21,20 19,21 2,22 3,24 18,25 8,26 2,28 4,29 2,31 2,32 29,35 4.3,36 0.1,37 5,38 43.5,39 47.4,40 52.158,41 34.557,42 32.577,44 5}
{0 CHEMBL183771,1 9.694,2 45.5,3 34.1,4 1.023,5 1.116,6 0.744,7 0.714,8 426.53,9 9.1,10 17,11 44,13 20,14 32,16 47,17 20,20 19,21 1,22 3,23 1,24 15,25 9,26 2,28 4,29 2,31 2,32 29,34 1,35 4.5,36 0.106,37 5,38 43.5,39 45.029,40 49.083,41 32.733,42 31.434,43 2.3,44 6.549}
{0 CHEMBL183883,1 9.756,2 44.7,3 34,4 1.03,5 1.124,6 0.733,7 0.709,8 458.55,9 8.5,10 17,11 47,13 20,14 34,16 50,17 21,20 19,21 2,22 3,23 2,24 16,25 10,26 2,28 4,29 2,31 2,32 31,34 2,35 4.3,36 0.12,37 6,38 45.5,39 48.425,40 52.838,41 34.432,42 33.344,43 4.3,44 4.699}
{0 CHEMBL2086466,1 7.689,2 35.8,3 47.2,4 1.014,5 1.133,6 0.647,7 0.615,8 407.54,9 5.7,10 6,11 53,13 11,14 29,16 54,17 19,19 2,20 8,21 9,22 4,24 25,25 9,26 1,28 3,29 5,31 1,32 28,33 1,35 9.4,36 0.093,37 5,38 38,39 53.738,40 60.029,41 34.313,42 32.62,44 5.854}
{0 CHEMBL2086467,1 12.483,2 38.1,3 38.1,4 1.028,5 1.111,6 0.76,7 0.703,8 262.14,9 4.8,10 6,11 21,13 9,14 13,15 1,16 21,17 8,20 8,22 3,24 8,25 5,26 2,28 1,29 2,31 1,32 13,34 1,35 9.5,36 0.143,37 3,38 19,39 21.596,40 23.34,41 15.96,42 14.771,43 4.8,44 4.796}
{0 CHEMBL2086468,1 10.368,2 40.9,3 45.5,4 1.003,5 1.119,6 0.71,7 0.654,8 228.1,9 4.5,10 6,11 22,13 7,14 12,15 1,16 22,17 9,20 7,21 2,22 1,24 10,25 3,26 1,28 1,29 1,32 12,34 1,35 4.5,36 0.091,37 2,38 16,39 22.076,40 24.625,41 15.62,42 14.395,43 4.5,44 4.097}
{0 CHEMBL2086469,1 10.44,2 43.5,3 43.5,4 1.003,5 1.114,6 0.723,7 0.669,8 240.11,9 4.3,10 6,11 23,13 8,14 13,15 1,16 23,17 10,20 9,21 1,22 2,24 10,25 3,26 1,28 1,29 1,32 13,34 1,35 4.3,36 0.13,37 3,38 18,39 23.076,40 25.625,41 16.62,42 15.395,43 4.3,44 4.367}
{0 CHEMBL2086470,1 11.304,2 45,3 40,4 1.01,5 1.111,6 0.743,7 0.693,8 226.08,9 5,10 6,11 20,13 8,14 12,15 1,16 20,17 9,20 9,22 2,24 8,25 3,26 1,28 1,29 1,32 12,34 1,35 5,36 0.1,37 2,38 17,39 20.193,40 22.21,41 14.858,42 13.869,43 5,44 5.523}
{0 CHEMBL2086471,1 11.304,2 45,3 40,4 1.01,5 1.111,6 0.743,7 0.693,8 226.08,9 5,10 6,11 20,13 8,14 12,15 1,16 20,17 9,20 9,22 2,24 8,25 3,26 1,28 1,29 1,32 12,34 1,35 5,36 0.1,37 2,38 17,39 20.193,40 22.21,41 14.858,42 13.869,43 5,44 4.097}
{0 CHEMBL2086472,1 8.259,2 45,3 40,4 1.024,5 1.135,6 0.672,7 0.661,8 165.18,9 5,10 6,11 20,13 8,14 12,16 20,17 9,20 9,22 2,23 1,24 8,25 3,28 1,29 1,32 12,34 1,35 5,36 0.1,37 2,38 17,39 20.476,40 22.708,41 13.443,42 13.227,43 5,44 4.538}
{0 CHEMBL2086473,1 8.011,2 37.1,3 45.7,4 1.013,5 1.127,6 0.667,7 0.63,8 280.38,9 5.7,10 6,11 35,13 10,14 20,16 36,17 13,20 9,21 4,22 4,24 16,25 6,26 1,28 2,29 3,31 1,32 19,35 8.6,36 0.111,37 4,38 27,39 35.447,40 39.451,41 23.352,42 22.062,44 4.693}
{0 CHEMBL2086474,1 8.665,2 38.5,3 42.3,4 1.022,5 1.12,6 0.686,7 0.653,8 225.29,9 3.8,10 6,11 26,13 10,14 15,16 26,17 10,20 9,21 1,22 4,24 11,25 5,26 1,28 1,29 3,31 1,32 15,35 11.5,36 0.115,37 3,38 22,39 26.578,40 29.123,41 17.824,42 16.987,44 5.301}
{0 CHEMBL2086475,1 8.736,2 40.9,3 36.4,4 1.038,5 1.13,6 0.666,7 0.671,8 192.19,9 9.1,10 6,11 22,13 10,14 14,16 22,17 9,20 9,22 4,24 8,25 5,28 2,29 3,32 14,35 13.6,36 0.136,37 3,38 21,39 22.836,40 24.87,41 14.659,42 14.768,44 6.174}
{0 CHEMBL2086476,1 9.356,2 43.5,3 34.8,4 1.06,5 1.165,6 0.656,7 0.675,8 215.19,9 4.3,10 6,11 23,13 8,14 15,16 23,17 10,20 9,21 1,22 2,23 3,24 8,25 5,28 1,29 1,32 15,34 3,35 4.3,36 0.087,37 2,38 20,39 24.385,40 26.803,41 15.08,42 15.52,43 13,44 5.42}
{0 CHEMBL2086477,1 7.36,2 45,3 45,4 0.998,5 1.118,6 0.675,7 0.642,8 147.19,9 5,10 6,11 20,13 8,14 11,16 20,17 9,20 9,22 2,24 9,25 2,28 1,29 1,32 11,35 5,36 0.1,37 2,38 16,39 19.964,40 22.369,41 13.506,42 12.843,44 4.367}
{0 CHEMBL2086478,1 7.01,2 43.5,3 47.8,4 0.993,5 1.121,6 0.664,7 0.625,8 161.22,9 4.3,10 6,11 23,13 8,14 12,16 23,17 10,20 9,21 1,22 2,24 11,25 2,28 1,29 1,32 12,35 4.3,36 0.087,37 2,38 17,39 22.847,40 25.784,41 15.267,42 14.37,44 4.347}
{0 CHEMBL2086479,1 8.105,2 39.6,3 43.4,4 1.016,5 1.125,6 0.671,7 0.643,8 429.54,9 5.7,10 12,11 53,13 17,14 32,16 55,17 21,20 16,21 5,22 5,24 23,25 9,26 1,28 3,29 5,31 1,32 30,35 9.4,36 0.127,37 7,38 43,39 53.854,40 59.614,41 35.551,42 34.093,44 6.456}
{0 CHEMBL2086480,1 7.53,2 36.5,3 48.1,4 1.008,5 1.131,6 0.651,7 0.614,8 391.54,9 5.8,10 6,11 52,13 11,14 29,16 54,17 19,20 10,21 9,22 5,24 25,25 8,26 1,28 3,29 4,31 1,32 27,35 7.7,36 0.093,37 5,38 37,39 52.411,40 58.82,41 33.858,42 31.905,44 5.921}
{0 CHEMBL2086481,1 7.689,2 35.8,3 47.2,4 1.014,5 1.133,6 0.647,7 0.615,8 407.54,9 5.7,10 6,11 53,13 10,14 31,16 56,17 19,20 8,21 11,22 4,24 25,25 9,26 1,28 3,29 5,31 1,32 28,35 9.4,36 0.089,37 5,38 38,39 53.738,40 60.029,41 34.313,42 32.62,44 4.553}
{0 CHEMBL2086482,1 7.952,2 34.6,3 46.2,4 1.024,5 1.142,6 0.639,7 0.615,8 413.52,9 5.8,10 6,11 52,13 11,14 29,16 53,17 18,20 10,21 8,22 5,23 1,24 24,25 10,26 1,28 3,29 5,31 1,32 28,34 1,35 9.6,36 0.113,37 6,38 37,39 53.251,40 59.369,41 33.25,42 32.003,43 1.9,44 5.638}
{0 CHEMBL2086483,1 7.447,2 34.5,3 49.1,4 1.011,5 1.135,6 0.638,7 0.603,8 409.56,9 5.5,10 6,11 55,13 11,14 29,16 56,17 19,20 10,21 9,22 5,24 27,25 9,26 1,28 3,29 5,31 1,32 28,35 9.1,36 0.107,37 6,38 37,39 55.622,40 62.444,41 35.074,42 33.147,44 4.097}
{0 CHEMBL2086484,1 7.447,2 34.5,3 49.1,4 1.011,5 1.135,6 0.638,7 0.603,8 409.56,9 5.5,10 6,11 55,13 11,14 29,16 56,17 19,20 10,21 9,22 5,24 27,25 9,26 1,28 3,29 5,31 1,32 28,35 9.1,36 0.107,37 6,38 37,39 55.622,40 62.444,41 35.074,42 33.147,44 5.553}
{0 CHEMBL2086485,1 7.447,2 34.5,3 49.1,4 1.011,5 1.135,6 0.638,7 0.603,8 409.56,9 5.5,10 6,11 55,13 11,14 29,16 56,17 19,20 10,21 9,22 5,24 27,25 9,26 1,28 3,29 5,31 1,32 28,35 9.1,36 0.107,37 6,38 37,39 55.622,40 62.444,41 35.074,42 33.147,44 5.553}
{0 CHEMBL2086486,1 7.303,2 34.5,3 50,4 1.009,5 1.136,6 0.635,7 0.598,8 423.59,9 5.2,10 6,11 58,13 11,14 30,16 59,17 20,20 10,21 10,22 5,24 29,25 9,26 1,28 3,29 5,31 1,32 29,35 8.6,36 0.102,37 6,38 38,39 58.505,40 65.86,41 36.836,42 34.674,44 4.097}
{0 CHEMBL2086487,1 8.428,2 34.5,3 43.6,4 1.039,5 1.154,6 0.634,7 0.624,8 463.53,9 5.5,10 6,11 55,13 11,14 32,16 56,17 19,20 10,21 9,22 5,23 3,24 24,25 12,26 1,28 3,29 5,31 1,32 31,34 3,35 9.1,36 0.107,37 6,38 40,39 57.16,40 63.463,41 34.887,42 34.297,43 5.5,44 5}
{0 CHEMBL2086488,1 8.234,2 34.5,3 44.8,4 1.035,5 1.153,6 0.632,7 0.618,8 477.56,9 5.2,10 6,11 58,13 11,14 33,16 59,17 20,20 10,21 10,22 5,23 3,24 26,25 12,26 1,28 3,29 5,31 1,32 32,34 3,35 8.6,36 0.102,37 6,38 41,39 60.043,40 66.879,41 36.648,42 35.824,43 5.2,44 5}
{0 CHEMBL2086489,1 8.269,2 34.6,3 46.2,4 1.02,5 1.134,6 0.657,7 0.624,8 429.97,9 5.8,10 6,11 52,13 11,14 29,16 53,17 18,18 1,20 10,21 8,22 5,24 24,25 10,26 2,28 3,29 5,31 1,32 28,34 1,35 9.6,36 0.113,37 6,38 37,39 53.062,40 58.973,41 34.171,42 32.448,43 1.9,44 6.854}
{0 CHEMBL2086490,1 8.269,2 34.6,3 46.2,4 1.02,5 1.134,6 0.657,7 0.624,8 429.97,9 5.8,10 6,11 52,13 11,14 29,16 53,17 18,18 1,20 10,21 8,22 5,24 24,25 10,26 2,28 3,29 5,31 1,32 28,34 1,35 9.6,36 0.113,37 6,38 37,39 53.062,40 58.973,41 34.171,42 32.448,43 1.9,44 5.167}
{0 CHEMBL2086491,1 7.844,2 33.3,3 46.3,4 1.02,5 1.141,6 0.64,7 0.614,8 423.55,9 9.3,10 6,11 54,13 11,14 30,16 55,17 18,19 1,20 8,21 9,22 4,24 25,25 11,26 1,28 5,29 5,31 1,32 29,33 1,35 9.3,36 0.109,37 6,38 39,39 55.058,40 61.611,41 34.563,42 33.136,44 4.097}
{0 CHEMBL2086492,1 7.372,2 32.8,3 50,4 1.014,5 1.139,6 0.626,7 0.593,8 427.58,9 5.2,10 6,11 58,13 10,14 30,16 59,17 19,20 8,21 11,22 4,24 29,25 10,26 1,28 3,29 6,31 1,32 29,35 10.3,36 0.153,37 9,38 37,39 58.832,40 66.069,41 36.29,42 34.389,44 4.097}
{0 CHEMBL2086493,1 7.856,2 34.6,3 46.2,4 1.018,5 1.137,6 0.645,7 0.618,8 408.53,9 7.7,10 6,11 52,13 11,14 29,16 53,17 18,19 1,20 8,21 9,22 4,24 24,25 10,26 1,28 4,29 5,31 1,32 28,33 1,35 9.6,36 0.113,37 6,38 38,39 52.956,40 59.112,41 33.557,42 32.115,44 4.097}
{0 CHEMBL2086494,1 7.856,2 34.6,3 46.2,4 1.018,5 1.137,6 0.645,7 0.618,8 408.53,9 7.7,10 6,11 52,13 11,14 29,16 53,17 18,19 1,20 8,21 9,22 4,24 24,25 10,26 1,28 4,29 5,31 1,32 28,33 1,35 9.6,36 0.113,37 6,38 38,39 52.956,40 59.112,41 33.557,42 32.115,44 4.097}
{0 CHEMBL2086495,1 7.765,2 34,3 47.2,4 1.02,5 1.137,6 0.637,7 0.61,8 411.53,9 5.7,10 6,11 53,13 11,14 29,16 54,17 18,20 9,21 9,22 5,24 25,25 10,26 1,28 3,29 6,31 1,32 28,35 11.3,36 0.111,37 6,38 37,39 54.065,40 60.239,41 33.767,42 32.335,44 4.097}
{0 CHEMBL2086496,1 7.81,2 35.6,3 46.7,4 1.014,5 1.133,6 0.652,7 0.619,8 351.47,9 6.7,10 6,11 45,13 10,14 25,16 46,17 16,19 1,20 7,21 8,22 3,24 21,25 8,26 1,28 3,29 4,31 1,32 24,33 1,35 8.9,36 0.087,37 4,38 33,39 45.643,40 50.989,41 29.335,42 27.852,44 4.097}
{0 CHEMBL2086497,1 7.907,2 39.7,3 44.8,4 1.015,5 1.123,6 0.664,7 0.635,8 458.58,9 3.4,10 12,11 58,13 17,14 34,16 60,17 23,20 16,21 7,22 5,24 26,25 9,26 1,28 2,29 6,31 1,32 32,35 10.3,36 0.15,37 9,38 45,39 58.847,40 65.155,41 38.523,42 36.84,44 4.097}
{0 CHEMBL2086498,1 7.748,2 39.3,3 45.9,4 1.012,5 1.124,6 0.66,7 0.629,8 472.61,9 3.3,10 12,11 61,13 17,14 35,16 63,17 24,20 16,21 8,22 5,24 28,25 9,26 1,28 2,29 6,31 1,32 33,35 9.8,36 0.159,37 10,38 46,39 61.731,40 68.571,41 40.284,42 38.367,44 4.041}
{0 CHEMBL2086499,1 8.153,2 39.3,3 42.9,4 1.017,5 1.127,6 0.671,7 0.645,8 456.57,9 7.1,10 12,11 56,13 18,14 34,16 58,17 22,20 15,21 7,22 6,24 24,25 10,26 1,28 4,29 5,31 1,32 32,35 8.9,36 0.155,37 9,38 46,39 56.956,40 63.112,41 37.557,42 36.115,44 5.398}
{0 CHEMBL2086500,1 8.35,2 39.6,3 41.5,4 1.02,5 1.126,6 0.675,7 0.653,8 442.54,9 7.5,10 12,11 53,13 18,14 33,16 55,17 21,20 15,21 6,22 6,24 22,25 10,26 1,28 4,29 5,31 1,32 31,35 9.4,36 0.145,37 8,38 45,39 54.073,40 59.697,41 35.796,42 34.588,44 4.796}
{0 CHEMBL2086501,1 7.353,2 37.1,3 48.6,4 1.005,5 1.131,6 0.648,7 0.611,8 514.71,9 5.7,10 12,11 70,13 17,14 38,16 72,17 26,20 16,21 10,22 5,24 34,25 10,26 1,28 4,29 5,31 1,32 36,35 7.1,36 0.139,37 10,38 49,39 70.374,40 79.188,41 45.364,42 42.749,44 4.119}
{0 CHEMBL2086502,1 8.444,2 39.6,3 41.5,4 1.026,5 1.131,6 0.67,7 0.651,8 447.53,9 5.7,10 12,11 53,13 17,14 33,16 55,17 21,20 16,21 5,22 5,23 1,24 22,25 10,26 1,28 3,29 5,31 1,32 31,34 1,35 9.4,36 0.127,37 7,38 44,39 54.367,40 59.954,41 35.489,42 34.477,43 1.9,44 4.886}
{0 CHEMBL2086503,1 7.599,2 33.9,3 48.2,4 1.017,5 1.137,6 0.634,7 0.605,8 425.56,9 5.4,10 6,11 56,13 11,14 30,16 57,17 19,20 10,21 9,22 5,24 27,25 10,26 1,28 3,29 6,31 1,32 29,35 10.7,36 0.123,37 7,38 38,39 56.949,40 63.654,41 35.529,42 33.862,44 5.602}
{0 CHEMBL2086504,1 7.447,2 34.5,3 49.1,4 1.011,5 1.135,6 0.638,7 0.603,8 409.56,9 5.5,10 6,11 55,13 11,14 29,16 56,17 19,20 10,21 9,22 5,24 27,25 9,26 1,28 3,29 5,31 1,32 28,35 9.1,36 0.107,37 6,38 37,39 55.622,40 62.444,41 35.074,42 33.147,44 6.041}
{0 CHEMBL2086505,1 8.885,2 39.3,3 39.3,4 1.041,5 1.144,6 0.663,7 0.657,8 497.54,9 5.4,10 12,11 56,13 17,14 36,16 58,17 22,20 16,21 6,22 5,23 3,24 22,25 12,26 1,28 3,29 5,31 1,32 34,34 3,35 8.9,36 0.121,37 7,38 47,39 58.276,40 64.048,41 37.125,42 36.77,43 5.4,44 6.745}
{0 CHEMBL2086506,1 8.783,2 39.6,3 39.6,4 1.035,5 1.138,6 0.668,7 0.658,8 465.52,9 5.7,10 12,11 53,13 17,14 34,16 55,17 21,20 16,21 5,22 5,23 2,24 21,25 11,26 1,28 3,29 5,31 1,32 32,34 2,35 9.4,36 0.127,37 7,38 45,39 54.88,40 60.293,41 35.426,42 34.86,43 3.8,44 5.796}
{0 CHEMBL2086507,1 8.444,2 39.6,3 41.5,4 1.026,5 1.131,6 0.67,7 0.651,8 447.53,9 5.7,10 12,11 53,13 17,14 33,16 55,17 21,20 16,21 5,22 5,23 1,24 22,25 10,26 1,28 3,29 5,31 1,32 31,34 1,35 9.4,36 0.127,37 7,38 44,39 54.367,40 59.954,41 35.489,42 34.477,43 1.9,44 7.268}
{0 CHEMBL2086508,1 8.783,2 39.6,3 39.6,4 1.035,5 1.138,6 0.668,7 0.658,8 465.52,9 5.7,10 12,11 53,13 17,14 34,16 55,17 21,20 16,21 5,22 5,23 2,24 21,25 11,26 1,28 3,29 5,31 1,32 32,34 2,35 9.4,36 0.127,37 7,38 45,39 54.88,40 60.293,41 35.426,42 34.86,43 3.8,44 5.523}
{0 CHEMBL2086509,1 8.754,2 39.6,3 41.5,4 1.022,5 1.124,6 0.687,7 0.659,8 463.98,9 5.7,10 12,11 53,13 17,14 33,16 55,17 21,18 1,20 16,21 5,22 5,24 22,25 10,26 2,28 3,29 5,31 1,32 31,34 1,35 9.4,36 0.127,37 7,38 44,39 54.178,40 59.558,41 36.409,42 34.921,43 1.9,44 7.027}
{0 CHEMBL2086510,1 8.885,2 39.3,3 39.3,4 1.041,5 1.144,6 0.663,7 0.657,8 497.54,9 5.4,10 12,11 56,13 17,14 36,16 58,17 22,20 16,21 6,22 5,23 3,24 22,25 12,26 1,28 3,29 5,31 1,32 34,34 3,35 8.9,36 0.121,37 7,38 47,39 58.276,40 64.048,41 37.125,42 36.77,43 5.4,44 6.959}
{0 CHEMBL2086511,1 8.151,2 42.2,3 42.2,4 1.015,5 1.12,6 0.68,7 0.654,8 521.64,9 4.7,10 18,11 64,13 23,14 40,16 67,17 27,20 22,21 5,22 5,24 27,25 10,26 1,28 3,29 6,31 1,32 37,35 9.4,36 0.134,37 9,38 54,39 64.949,40 71.654,41 43.529,42 41.862,44 6.886}
{0 CHEMBL2086512,1 7.921,2 39.3,3 44.6,4 1.013,5 1.126,6 0.666,7 0.636,8 443.57,9 5.4,10 12,11 56,13 17,14 33,16 58,17 22,20 16,21 6,22 5,24 25,25 9,26 1,28 3,29 5,31 1,32 31,35 8.9,36 0.121,37 7,38 44,39 56.738,40 63.029,41 37.313,42 35.62,44 7.155}
{0 CHEMBL2086513,1 8.129,2 42.4,3 42.4,4 1.013,5 1.119,6 0.683,7 0.655,8 479.6,9 5.1,10 17,11 59,13 22,14 37,16 62,17 25,20 20,21 5,22 5,24 25,25 9,26 1,28 3,29 5,31 1,32 34,35 8.5,36 0.113,37 7,38 50.5,39 59.738,40 66.029,41 40.313,42 38.62,44 7.086}
{0 CHEMBL2086514,1 8.129,2 42.4,3 42.4,4 1.013,5 1.119,6 0.683,7 0.655,8 479.6,9 5.1,10 17,11 59,13 22,14 37,16 62,17 25,20 20,21 5,22 5,24 25,25 9,26 1,28 3,29 5,31 1,32 34,35 8.5,36 0.113,37 7,38 50.5,39 59.738,40 66.029,41 40.313,42 38.62,44 6.658}
{0 CHEMBL2086515,1 8.151,2 42.2,3 42.2,4 1.015,5 1.12,6 0.68,7 0.654,8 521.64,9 4.7,10 18,11 64,13 23,14 40,16 67,17 27,20 22,21 5,22 5,24 27,25 10,26 1,28 3,29 6,31 1,32 37,35 9.4,36 0.134,37 9,38 54,39 64.949,40 71.654,41 43.529,42 41.862,44 7.268}
{0 CHEMBL2086516,1 8.151,2 42.2,3 42.2,4 1.015,5 1.12,6 0.68,7 0.654,8 521.64,9 4.7,10 18,11 64,13 23,14 40,16 67,17 27,20 22,21 5,22 5,24 27,25 10,26 1,28 3,29 6,31 1,32 37,35 9.4,36 0.134,37 9,38 54,39 64.949,40 71.654,41 43.529,42 41.862,44 7.222}
{0 CHEMBL2086517,1 8.22,2 34.9,3 44.2,4 1.025,5 1.135,6 0.652,7 0.629,8 353.44,9 7,10 6,11 43,13 11,14 25,16 44,17 15,20 10,21 5,22 5,24 19,25 9,26 1,28 3,29 5,31 1,32 24,35 11.6,36 0.114,37 5,38 33,39 44.087,40 48.784,41 28.029,42 27.04,44 6.959}
{0 CHEMBL2086518,1 7.988,2 34.8,3 45.7,4 1.021,5 1.135,6 0.648,7 0.621,8 367.47,9 6.5,10 6,11 46,13 11,14 26,16 47,17 16,20 10,21 6,22 5,24 21,25 9,26 1,28 3,29 5,31 1,32 25,35 10.9,36 0.128,37 6,38 34,39 46.971,40 52.199,41 29.79,42 28.567,44 5.959}
{0 CHEMBL2086519,1 7.689,2 35.8,3 47.2,4 1.014,5 1.133,6 0.647,7 0.615,8 407.54,9 5.7,10 6,11 53,13 11,14 30,16 55,17 19,20 10,21 9,22 5,24 25,25 9,26 1,28 3,29 5,31 1,32 28,35 9.4,36 0.109,37 6,38 38,39 53.738,40 60.029,41 34.313,42 32.62,44 7.357}
{0 CHEMBL2086520,1 7.774,2 40,3 45.5,4 1.007,5 1.124,6 0.67,7 0.635,8 427.57,9 5.5,10 12,11 55,13 17,14 32,16 57,17 22,20 16,21 6,22 5,24 25,25 8,26 1,28 3,29 4,31 1,32 30,35 7.3,36 0.123,37 7,38 43,39 55.411,40 61.82,41 36.858,42 34.905,44 6.796}
{0 CHEMBL2086521,1 7.85,2 41.1,3 44.6,4 1.007,5 1.122,6 0.676,7 0.641,8 439.58,9 5.4,10 12,11 56,13 17,14 34,16 59,17 23,20 16,21 7,22 5,24 25,25 8,26 1,28 3,29 4,31 1,32 31,35 7.1,36 0.102,37 6,38 45,39 56.411,40 62.82,41 37.858,42 35.905,44 5.921}
{0 CHEMBL2086522,1 7.902,2 37,3 45.7,4 1.014,5 1.13,6 0.659,7 0.627,8 363.48,9 6.5,10 6,11 46,13 11,14 27,16 48,17 17,20 10,21 7,22 5,24 21,25 8,26 1,28 3,29 4,31 1,32 25,35 8.7,36 0.104,37 5,38 35,39 46.643,40 51.989,41 30.335,42 28.852,44 6.959}
{0 CHEMBL2086523,1 7.198,2 35.9,3 50,4 1.003,5 1.134,6 0.643,7 0.602,8 460.66,9 6.3,10 6,11 64,13 11,14 35,16 67,17 23,20 10,21 13,22 5,24 32,25 9,26 1,28 4,29 4,31 1,32 32,35 6.3,36 0.06,37 4,38 43,39 64.163,40 72.564,41 41.148,42 38.507,44 7.699}
{0 CHEMBL2086524,1 7.198,2 35.9,3 50,4 1.003,5 1.134,6 0.643,7 0.602,8 460.66,9 6.3,10 6,11 64,13 11,14 35,16 67,17 23,20 10,21 13,22 5,24 32,25 9,26 1,28 4,29 4,31 1,32 32,35 6.3,36 0.06,37 4,38 43,39 64.163,40 72.564,41 41.148,42 38.507,44 6.347}
{0 CHEMBL2086525,1 7.529,2 35.2,3 48.1,4 1.009,5 1.136,6 0.646,7 0.61,8 406.56,9 7.4,10 6,11 54,13 11,14 30,16 56,17 19,20 10,21 9,22 5,24 26,25 9,26 1,28 4,29 4,31 1,32 28,35 7.4,36 0.071,37 4,38 38,39 54.512,40 61.318,41 34.864,42 32.927,44 6.444}
{0 CHEMBL2086526,1 8.195,2 35.2,3 44.4,4 1.028,5 1.148,6 0.643,7 0.624,8 442.54,9 7.4,10 6,11 54,13 11,14 32,16 56,17 19,20 10,21 9,22 5,23 2,24 24,25 11,26 1,28 4,29 4,31 1,32 30,34 2,35 7.4,36 0.071,37 4,38 40,39 55.538,40 61.997,41 34.739,42 33.693,43 3.7,44 6.092}
{0 CHEMBL2086527,1 7.697,2 35.3,3 47.1,4 1.012,5 1.135,6 0.649,7 0.616,8 392.53,9 7.8,10 6,11 51,13 11,14 29,16 53,17 18,20 10,21 8,22 5,24 24,25 9,26 1,28 4,29 4,31 1,32 27,35 7.8,36 0.075,37 4,38 37,39 51.629,40 57.903,41 33.103,42 31.4,44 7.244}
{0 CHEMBL2086528,1 7.264,2 38.1,3 49.2,4 1.001,5 1.128,6 0.653,7 0.611,8 457.65,9 4.8,10 6,11 63,13 11,14 36,16 67,17 24,20 10,21 14,22 5,24 31,25 8,26 1,28 3,29 4,31 1,32 32,35 6.3,36 0.075,37 5,38 44,39 63.061,40 71.065,41 41.142,42 38.486,44 6.114}
{0 CHEMBL2086529,1 8.098,2 39.1,3 43.5,4 1.012,5 1.127,6 0.677,7 0.644,8 372.49,9 8.7,10 12,11 46,13 16,14 28,16 48,17 18,20 14,21 4,22 4,24 20,25 8,26 1,28 4,29 3,31 1,32 26,35 6.5,36 0.104,37 5,38 38,39 46.534,40 51.863,41 31.125,42 29.632,44 7.26}
{0 CHEMBL2086530,1 7.888,2 38.8,3 44.9,4 1.009,5 1.128,6 0.671,7 0.636,8 386.52,9 8.2,10 12,11 49,13 16,14 29,16 51,17 19,20 14,21 5,22 4,24 22,25 8,26 1,28 4,29 3,31 1,32 27,35 6.1,36 0.098,37 5,38 39,39 49.418,40 55.278,41 32.887,42 31.158,44 6.004}
{0 CHEMBL2086531,1 7.888,2 38.8,3 44.9,4 1.009,5 1.128,6 0.671,7 0.636,8 386.52,9 8.2,10 12,11 49,13 16,14 29,16 51,17 19,20 14,21 5,22 4,24 22,25 8,26 1,28 4,29 3,31 1,32 27,35 6.1,36 0.098,37 5,38 39,39 49.418,40 55.278,41 32.887,42 31.158,44 7.456}
{0 CHEMBL2086532,1 8.99,2 38.8,3 38.8,4 1.04,5 1.149,6 0.667,7 0.659,8 440.49,9 8.2,10 12,11 49,13 16,14 32,16 51,17 19,20 14,21 5,22 4,23 3,24 19,25 11,26 1,28 4,29 3,31 1,32 30,34 3,35 6.1,36 0.098,37 5,38 42,39 50.956,40 56.297,41 32.699,42 32.308,43 6.1,44 7.284}
{0 CHEMBL2086533,1 8.99,2 38.8,3 38.8,4 1.04,5 1.149,6 0.667,7 0.659,8 440.49,9 8.2,10 12,11 49,13 16,14 32,16 51,17 19,20 14,21 5,22 4,23 3,24 19,25 11,26 1,28 4,29 3,31 1,32 30,34 3,35 6.1,36 0.098,37 5,38 42,39 50.956,40 56.297,41 32.699,42 32.308,43 6.1,44 5.745}
{0 CHEMBL2086534,1 7.904,2 40.4,3 44.7,4 1.007,5 1.123,6 0.678,7 0.641,8 371.5,9 6.4,10 12,11 47,13 16,14 28,16 49,17 19,20 15,21 4,22 4,24 21,25 7,26 1,28 3,29 3,31 1,32 26,35 6.4,36 0.102,37 5,38 38,39 47.316,40 52.78,41 31.881,42 30.137,44 6.745}
{0 CHEMBL2086535,1 8.79,2 40,3 40,4 1.035,5 1.144,6 0.669,7 0.656,8 439.5,9 6,10 12,11 50,13 16,14 32,16 52,17 20,20 15,21 5,22 4,23 3,24 20,25 10,26 1,28 3,29 3,31 1,32 30,34 3,35 6,36 0.096,37 5,38 42,39 51.738,40 57.214,41 33.455,42 32.814,43 6,44 6.721}
{0 CHEMBL2086536,1 7.386,2 39.3,3 48.2,4 0.999,5 1.125,6 0.664,7 0.62,8 413.59,9 5.4,10 12,11 56,13 16,14 31,16 58,17 22,20 15,21 7,22 4,24 27,25 7,26 1,28 3,29 3,31 1,32 29,35 5.4,36 0.138,37 8,38 41,39 55.967,40 63.026,41 37.165,42 34.717,44 6.42}
{0 CHEMBL2086537,1 7.248,2 39,3 49.2,4 0.997,5 1.126,6 0.66,7 0.614,8 427.62,9 5.1,10 12,11 59,13 16,14 32,16 61,17 23,20 15,21 8,22 4,24 29,25 7,26 1,28 3,29 3,31 1,32 30,35 5.1,36 0.148,37 9,38 42,39 58.851,40 66.441,41 38.926,42 36.244,44 6.509}
{0 CHEMBL2086538,1 7.775,2 33.3,3 47.1,4 1.019,5 1.139,6 0.638,7 0.61,8 396.52,9 7.8,10 6,11 51,13 11,14 28,16 52,17 17,20 9,21 8,22 5,24 24,25 10,26 1,28 4,29 5,31 1,32 27,35 9.8,36 0.115,37 6,38 36,39 51.956,40 58.112,41 32.557,42 31.115,44 7.013}
{0 CHEMBL2086539,1 8.279,2 38.5,3 42.3,4 1.021,5 1.129,6 0.669,7 0.646,8 430.53,9 7.7,10 12,11 52,13 17,14 32,16 54,17 20,20 15,21 5,22 5,24 22,25 10,26 1,28 4,29 5,31 1,32 30,35 9.6,36 0.13,37 7,38 43,39 53.073,40 58.697,41 34.796,42 33.588,44 7.108}
{0 CHEMBL2086540,1 8.099,2 35.6,3 44.4,4 1.019,5 1.135,6 0.657,7 0.63,8 364.47,9 8.9,10 6,11 45,13 11,14 27,16 47,17 16,20 9,21 7,22 5,24 20,25 9,26 1,28 4,29 4,31 1,32 25,35 8.9,36 0.106,37 5,38 35,39 45.862,40 51.072,41 29.58,42 28.346,44 6.745}
{0 CHEMBL2086541,1 7.397,2 37.1,3 48.4,4 1.005,5 1.131,6 0.651,7 0.613,8 458.64,9 6.5,10 6,11 62,13 11,14 36,16 66,17 23,20 9,21 14,22 5,24 30,25 9,26 1,28 4,29 4,31 1,32 32,35 6.5,36 0.076,37 5,38 44,39 62.28,40 70.148,41 40.387,42 37.98,44 7.824}
{0 CHEMBL2086542,1 7.95,2 32,3 46,4 1.023,5 1.144,6 0.636,7 0.612,8 397.51,9 10,10 6,11 50,13 11,14 28,16 51,17 16,20 8,21 8,22 5,24 23,25 11,26 1,28 5,29 5,31 1,32 27,35 10,36 0.118,37 6,38 36,39 51.174,40 57.195,41 31.801,42 30.609,44 7.585}
{0 CHEMBL2086543,1 8.461,2 37.3,3 41.2,4 1.025,5 1.133,6 0.667,7 0.649,8 431.52,9 9.8,10 12,11 51,13 17,14 32,16 53,17 19,20 14,21 5,22 5,24 21,25 11,26 1,28 5,29 5,31 1,32 30,35 9.8,36 0.132,37 7,38 43,39 52.291,40 57.78,41 34.04,42 33.083,44 7.161}
{0 CHEMBL2086544,1 7.535,2 36.1,3 47.5,4 1.008,5 1.135,6 0.65,7 0.614,8 459.63,9 8.2,10 6,11 61,13 11,14 36,16 65,17 22,20 8,21 14,22 5,24 29,25 10,26 1,28 5,29 4,31 1,32 32,35 6.6,36 0.077,37 5,38 44,39 61.498,40 69.232,41 39.631,42 37.475,44 7.854}
{0 CHEMBL2086545,1 7.447,2 34.5,3 49.1,4 1.011,5 1.135,6 0.638,7 0.603,8 409.56,9 5.5,10 6,11 55,13 11,14 29,16 56,17 19,20 10,21 9,22 5,24 27,25 9,26 1,28 3,29 5,31 1,32 28,35 9.1,36 0.107,37 6,38 37,39 55.622,40 62.444,41 35.074,42 33.147,44 4.495}
{0 CHEMBL2086885,1 8.105,2 39.6,3 43.4,4 1.016,5 1.125,6 0.671,7 0.643,8 429.54,9 5.7,10 12,11 53,13 17,14 32,16 55,17 21,20 16,21 5,22 5,24 23,25 9,26 1,28 3,29 5,31 1,32 30,35 9.4,36 0.127,37 7,38 43,39 53.854,40 59.614,41 35.551,42 34.093,44 5.538}
{0 CHEMBL2086886,1 7.736,2 35,3 47.5,4 1.011,5 1.134,6 0.653,7 0.615,8 309.43,9 7.5,10 6,11 40,13 9,14 23,16 42,17 14,20 7,21 7,22 3,24 19,25 7,26 1,28 3,29 3,31 1,32 21,35 7.5,36 0.071,37 3,38 29,39 40.433,40 45.365,41 26.12,42 24.61,44 4.097}
{0 CHEMBL2086887,1 8.147,2 43.8,3 41.1,4 1.008,5 1.12,6 0.694,7 0.664,8 594.75,9 8.2,10 29,11 73,13 33,14 47,16 77,17 32,20 28,21 4,22 4,24 30,25 11,26 1,28 6,29 4,31 1,32 43,35 5.5,36 0.156,37 12,38 65.5,39 73.6,40 81.73,41 50.637,42 48.496,44 5.244}
{0 CHEMBL2086888,1 12.912,2 42.9,3 33.3,4 1.023,5 1.105,6 0.798,7 0.74,8 271.15,9 9.5,10 10,11 21,13 11,14 15,15 1,16 22,17 9,20 8,21 1,22 1,24 7,25 5,26 2,28 2,29 1,31 1,32 14,34 1,35 4.8,36 0.045,37 1,38 21,39 21.487,40 23.213,41 16.75,42 15.55,43 4.8,44 5.051}
{0 CHEMBL2086889,1 8.246,2 39.5,3 39.5,4 1.024,5 1.137,6 0.663,7 0.655,8 313.35,9 13.2,10 6,11 38,13 11,14 25,16 40,17 15,20 11,21 4,22 5,24 15,25 8,28 5,29 3,32 23,35 7.9,36 0.075,37 3,38 33,39 38.909,40 43.196,41 25.199,42 24.885,44 7.602}
{0 CHEMBL2086890,1 7.952,2 34.6,3 46.2,4 1.024,5 1.142,6 0.639,7 0.615,8 413.52,9 5.8,10 6,11 52,13 11,14 29,16 53,17 18,20 10,21 8,22 5,23 1,24 24,25 10,26 1,28 3,29 5,31 1,32 28,34 1,35 9.6,36 0.113,37 6,38 37,39 53.251,40 59.369,41 33.25,42 32.003,43 1.9,44 6.721}
{0 CHEMBL2086891,1 8.269,2 34.6,3 46.2,4 1.02,5 1.134,6 0.657,7 0.624,8 429.97,9 5.8,10 6,11 52,13 11,14 29,16 53,17 18,18 1,20 10,21 8,22 5,24 24,25 10,26 2,28 3,29 5,31 1,32 28,34 1,35 9.6,36 0.113,37 6,38 37,39 53.062,40 58.973,41 34.171,42 32.448,43 1.9,44 6.959}
{0 CHEMBL2089382,1 7.719,2 48.4,3 41.9,4 1.002,5 1.11,6 0.693,7 0.665,8 239.29,9 3.2,10 12,11 31,13 14,14 19,16 32,17 15,20 15,22 2,24 13,25 3,28 1,29 2,32 18,35 6.5,36 0.125,37 4,38 27,39 31.058,40 34.408,41 21.483,42 20.612,44 4.585}
{0 CHEMBL2089383,1 7.384,2 41.7,3 45.8,4 1.007,5 1.125,6 0.655,7 0.629,8 177.22,9 4.2,10 6,11 24,13 8,14 13,16 24,17 10,20 9,21 1,22 2,24 11,25 3,28 1,29 2,32 13,35 8.3,36 0.125,37 3,38 18,39 24.174,40 26.993,41 15.722,42 15.085,44 4.237}
{0 CHEMBL2089384,1 7.204,2 38.9,3 47.2,4 1.004,5 1.134,6 0.646,7 0.616,8 259.34,9 8.3,10 6,11 36,13 9,14 20,16 37,17 14,20 10,21 4,22 3,24 17,25 5,28 3,29 2,32 19,35 5.6,36 0.081,37 3,38 26,39 36.145,40 40.82,41 23.256,42 22.181,44 4.523}
{0 CHEMBL2089385,1 7.094,2 35.1,3 48.9,4 1.01,5 1.142,6 0.624,7 0.598,8 666.87,9 8.5,10 6,11 94,13 15,14 50,16 96,17 33,20 14,21 19,22 9,24 46,25 15,28 8,29 7,32 48,35 7.4,36 0.167,37 16,38 62,39 94.894,40 107.341,41 58.694,42 56.184,44 6.699}
{0 CHEMBL2089386,1 7.606,2 34.6,3 48.1,4 1.014,5 1.135,6 0.641,7 0.608,8 395.53,9 5.8,10 6,11 52,13 11,14 28,16 53,17 18,20 10,21 8,22 5,24 25,25 9,26 1,28 3,29 5,31 1,32 27,35 9.6,36 0.113,37 6,38 36,39 52.738,40 59.029,41 33.313,42 31.62,44 6.565}
{0 CHEMBL2089387,1 7.984,2 35.1,3 45.9,4 1.015,5 1.134,6 0.658,7 0.624,8 295.4,9 8.1,10 6,11 37,13 10,14 21,16 38,17 13,20 9,21 4,22 4,24 17,25 7,26 1,28 3,29 3,31 1,32 20,35 8.1,36 0.105,37 4,38 28,39 37.549,40 41.95,41 24.358,42 23.083,44 5.886}
{0 CHEMBL2089388,1 8.105,2 39.6,3 43.4,4 1.016,5 1.125,6 0.671,7 0.643,8 429.54,9 5.7,10 12,11 53,13 17,14 32,16 55,17 21,20 16,21 5,22 5,24 23,25 9,26 1,28 3,29 5,31 1,32 30,35 9.4,36 0.127,37 7,38 43,39 53.854,40 59.614,41 35.551,42 34.093,44 6.921}
{0 CHEMBL2089389,1 8.105,2 39.6,3 43.4,4 1.016,5 1.125,6 0.671,7 0.643,8 429.54,9 5.7,10 12,11 53,13 17,14 32,16 55,17 21,20 16,21 5,22 5,24 23,25 9,26 1,28 3,29 5,31 1,32 30,35 9.4,36 0.145,37 8,38 43,39 53.854,40 59.614,41 35.551,42 34.093,44 7.018}
{0 CHEMBL2089390,1 8.105,2 39.6,3 43.4,4 1.016,5 1.125,6 0.671,7 0.643,8 429.54,9 5.7,10 12,11 53,13 17,14 32,16 55,17 21,20 16,21 5,22 5,24 23,25 9,26 1,28 3,29 5,31 1,32 30,35 9.4,36 0.145,37 8,38 43,39 53.854,40 59.614,41 35.551,42 34.093,44 6.284}
{0 CHEMBL2089391,1 8.105,2 39.6,3 43.4,4 1.016,5 1.125,6 0.671,7 0.643,8 429.54,9 5.7,10 12,11 53,13 17,14 32,16 55,17 21,20 16,21 5,22 5,24 23,25 9,26 1,28 3,29 5,31 1,32 30,35 9.4,36 0.145,37 8,38 43,39 53.854,40 59.614,41 35.551,42 34.093,44 6.237}
{0 CHEMBL2089392,1 8.105,2 39.6,3 43.4,4 1.016,5 1.125,6 0.671,7 0.643,8 429.54,9 5.7,10 12,11 53,13 17,14 32,16 55,17 21,20 16,21 5,22 5,24 23,25 9,26 1,28 3,29 5,31 1,32 30,35 9.4,36 0.145,37 8,38 43,39 53.854,40 59.614,41 35.551,42 34.093,44 6.301}
{0 CHEMBL2089393,1 7.993,2 40.4,3 43.9,4 1.013,5 1.123,6 0.672,7 0.642,8 455.58,9 5.3,10 12,11 57,13 17,14 35,16 60,17 23,20 16,21 7,22 5,24 25,25 9,26 1,28 3,29 5,31 1,32 32,35 8.8,36 0.117,37 7,38 46,39 57.738,40 64.029,41 38.313,42 36.62,44 6.854}
{0 CHEMBL2089394,1 7.847,2 38.2,3 45.5,4 1.013,5 1.128,6 0.66,7 0.629,8 431.56,9 5.5,10 12,11 55,13 17,14 31,16 56,17 21,20 16,21 5,22 5,24 25,25 9,26 1,28 3,29 5,31 1,32 30,35 9.1,36 0.179,37 10,38 42,39 55.738,40 62.029,41 36.313,42 34.62,44 5.824}
{0 CHEMBL2089395,1 7.689,2 35.8,3 47.2,4 1.014,5 1.133,6 0.647,7 0.615,8 407.54,9 5.7,10 6,11 53,13 11,14 30,16 55,17 19,20 10,21 9,22 5,24 25,25 9,26 1,28 3,29 5,31 1,32 28,35 9.4,36 0.109,37 6,38 38,39 53.738,40 60.029,41 34.313,42 32.62,44 6.523}
{0 CHEMBL2089396,1 7.756,2 39,3 45.8,4 1.011,5 1.126,6 0.662,7 0.63,8 457.6,9 5.1,10 12,11 59,13 17,14 34,16 61,17 23,20 16,21 7,22 5,24 27,25 9,26 1,28 3,29 5,31 1,32 32,35 8.5,36 0.148,37 9,38 45,39 59.622,40 66.444,41 39.074,42 37.147,44 6.678}
{0 CHEMBL2089397,1 7.756,2 39,3 45.8,4 1.011,5 1.126,6 0.662,7 0.63,8 457.6,9 5.1,10 12,11 59,13 17,14 34,16 61,17 23,20 16,21 7,22 5,24 27,25 9,26 1,28 3,29 5,31 1,32 32,35 8.5,36 0.148,37 9,38 45,39 59.622,40 66.444,41 39.074,42 37.147,44 6.42}
{0 CHEMBL2089398,1 7.921,2 39.3,3 44.6,4 1.013,5 1.126,6 0.666,7 0.636,8 443.57,9 5.4,10 12,11 56,13 17,14 33,16 58,17 22,20 16,21 6,22 5,24 25,25 9,26 1,28 3,29 5,31 1,32 31,35 8.9,36 0.138,37 8,38 44,39 56.738,40 63.029,41 37.313,42 35.62,44 5.301}
{0 CHEMBL2089399,1 7.921,2 39.3,3 44.6,4 1.013,5 1.126,6 0.666,7 0.636,8 443.57,9 5.4,10 12,11 56,13 17,14 33,16 58,17 22,20 16,21 6,22 5,24 25,25 9,26 1,28 3,29 5,31 1,32 31,35 8.9,36 0.138,37 8,38 44,39 56.738,40 63.029,41 37.313,42 35.62,44 6.347}
{0 CHEMBL2089400,1 7.921,2 39.3,3 44.6,4 1.013,5 1.126,6 0.666,7 0.636,8 443.57,9 5.4,10 12,11 56,13 17,14 33,16 58,17 22,20 16,21 6,22 5,24 25,25 9,26 1,28 3,29 5,31 1,32 31,35 8.9,36 0.121,37 7,38 44,39 56.738,40 63.029,41 37.313,42 35.62,44 5.495}
{0 CHEMBL2152090,1 7.921,2 39.3,3 44.6,4 1.013,5 1.126,6 0.666,7 0.636,8 443.57,9 5.4,10 12,11 56,13 17,14 33,16 58,17 22,20 16,21 6,22 5,24 25,25 9,26 1,28 3,29 5,31 1,32 31,35 8.9,36 0.138,37 8,38 44,39 56.738,40 63.029,41 37.313,42 35.62,44 6.553}
{0 CHEMBL2152091,1 7.756,2 39,3 45.8,4 1.011,5 1.126,6 0.662,7 0.63,8 457.6,9 5.1,10 12,11 59,13 17,14 34,16 61,17 23,20 16,21 7,22 5,24 27,25 9,26 1,28 3,29 5,31 1,32 32,35 8.5,36 0.148,37 9,38 45,39 59.622,40 66.444,41 39.074,42 37.147,44 5.292}
{0 CHEMBL2152092,1 8.029,2 38.5,3 44.2,4 1.016,5 1.127,6 0.664,7 0.636,8 417.53,9 5.8,10 12,11 52,13 17,14 30,16 53,17 20,20 16,21 4,22 5,24 23,25 9,26 1,28 3,29 5,31 1,32 29,35 9.6,36 0.189,37 10,38 41,39 52.854,40 58.614,41 34.551,42 33.093,44 5.481}
{0 CHEMBL2152093,1 7.921,2 39.3,3 44.6,4 1.013,5 1.126,6 0.666,7 0.636,8 443.57,9 5.4,10 12,11 56,13 17,14 33,16 58,17 22,20 16,21 6,22 5,24 25,25 9,26 1,28 3,29 5,31 1,32 31,35 8.9,36 0.138,37 8,38 44,39 56.738,40 63.029,41 37.313,42 35.62,44 4.097}
{0 CHEMBL2152094,1 7.921,2 39.3,3 44.6,4 1.013,5 1.126,6 0.666,7 0.636,8 443.57,9 5.4,10 12,11 56,13 17,14 33,16 58,17 22,20 16,21 6,22 5,24 25,25 9,26 1,28 3,29 5,31 1,32 31,35 8.9,36 0.138,37 8,38 44,39 56.738,40 63.029,41 37.313,42 35.62,44 4.097}
{0 CHEMBL2152095,1 8.105,2 39.6,3 43.4,4 1.016,5 1.125,6 0.671,7 0.643,8 429.54,9 5.7,10 12,11 53,13 17,14 32,16 55,17 21,20 16,21 5,22 5,24 23,25 9,26 1,28 3,29 5,31 1,32 30,35 9.4,36 0.145,37 8,38 43,39 53.854,40 59.614,41 35.551,42 34.093,44 4.26}
{0 CHEMBL2152096,1 8.105,2 39.6,3 43.4,4 1.016,5 1.125,6 0.671,7 0.643,8 429.54,9 5.7,10 12,11 53,13 17,14 32,16 55,17 21,20 16,21 5,22 5,24 23,25 9,26 1,28 3,29 5,31 1,32 30,35 9.4,36 0.145,37 8,38 43,39 53.854,40 59.614,41 35.551,42 34.093,44 4.523}
{0 CHEMBL2152097,1 8.31,2 40,3 42,4 1.019,5 1.124,6 0.676,7 0.651,8 415.51,9 6,10 12,11 50,13 17,14 31,16 52,17 20,20 16,21 4,22 5,24 21,25 9,26 1,28 3,29 5,31 1,32 29,35 10,36 0.154,37 8,38 42,39 50.971,40 56.199,41 33.79,42 32.567,44 5.796}
{0 CHEMBL2152098,1 7.614,2 39.7,3 46.6,4 1.005,5 1.125,6 0.666,7 0.628,8 441.6,9 5.2,10 12,11 58,13 17,14 33,16 60,17 23,20 16,21 7,22 5,24 27,25 8,26 1,28 3,29 4,31 1,32 31,35 6.9,36 0.133,37 8,38 44,39 58.294,40 65.235,41 38.62,42 36.432,44 6.745}
{0 CHEMBL2152099,1 7.774,2 40,3 45.5,4 1.007,5 1.124,6 0.67,7 0.635,8 427.57,9 5.5,10 12,11 55,13 17,14 32,16 57,17 22,20 16,21 6,22 5,24 25,25 8,26 1,28 3,29 4,31 1,32 30,35 7.3,36 0.123,37 7,38 43,39 55.411,40 61.82,41 36.858,42 34.905,44 6.699}
{0 CHEMBL2152100,1 7.469,2 39.3,3 47.5,4 1.003,5 1.125,6 0.662,7 0.622,8 455.63,9 4.9,10 12,11 61,13 17,14 34,16 63,17 24,20 16,21 8,22 5,24 29,25 8,26 1,28 3,29 4,31 1,32 32,35 6.6,36 0.143,37 9,38 45,39 61.178,40 68.65,41 40.381,42 37.959,44 6.114}
{0 CHEMBL2152101,1 7.688,2 40.7,3 45.8,4 1.005,5 1.123,6 0.672,7 0.634,8 453.61,9 5.1,10 12,11 59,13 17,14 35,16 62,17 24,20 16,21 8,22 5,24 27,25 8,26 1,28 3,29 4,31 1,32 32,35 6.8,36 0.113,37 7,38 46,39 59.294,40 66.235,41 39.62,42 37.432,44 6.387}
{0 CHEMBL2152102,1 7.688,2 40.7,3 45.8,4 1.005,5 1.123,6 0.672,7 0.634,8 453.61,9 5.1,10 12,11 59,13 17,14 35,16 62,17 24,20 16,21 8,22 5,24 27,25 8,26 1,28 3,29 4,31 1,32 32,35 6.8,36 0.081,37 5,38 46,39 59.294,40 66.235,41 39.62,42 37.432,44 6.208}
{0 CHEMBL2152103,1 7.469,2 39.3,3 47.5,4 1.003,5 1.125,6 0.662,7 0.622,8 455.63,9 4.9,10 12,11 61,13 17,14 34,16 63,17 24,20 16,21 8,22 5,24 29,25 8,26 1,28 3,29 4,31 1,32 32,35 6.6,36 0.127,37 8,38 45,39 61.178,40 68.65,41 40.381,42 37.959,44 6.337}
{0 CHEMBL2152104,1 7.614,2 39.7,3 46.6,4 1.005,5 1.125,6 0.666,7 0.628,8 441.6,9 5.2,10 12,11 58,13 17,14 33,16 60,17 23,20 16,21 7,22 5,24 27,25 8,26 1,28 3,29 4,31 1,32 31,35 6.9,36 0.117,37 7,38 44,39 58.294,40 65.235,41 38.62,42 36.432,44 6.201}
{0 CHEMBL2152105,1 6.995,2 35.9,3 51.6,4 0.999,5 1.133,6 0.639,7 0.594,8 447.66,9 4.7,10 6,11 64,13 11,14 33,16 66,17 23,20 10,21 13,22 5,24 33,25 8,26 1,28 3,29 4,31 1,32 31,35 6.3,36 0.121,37 8,38 41,39 63.945,40 72.481,41 40.904,42 38.012,44 6.854}
{0 CHEMBL2152196,1 6.941,2 37.5,3 51.4,4 0.996,5 1.129,6 0.645,7 0.598,8 499.74,9 4.2,10 6,11 72,13 11,14 39,16 76,17 27,20 10,21 17,22 5,24 37,25 8,26 1,28 3,29 4,31 1,32 35,35 5.6,36 0.105,37 8,38 47,39 71.712,40 81.311,41 46.427,42 43.066,44 6.18}
{0 CHEMBL2152197,1 7.252,2 35.5,3 50,4 1.006,5 1.133,6 0.639,7 0.6,8 449.63,9 4.8,10 6,11 62,13 11,14 33,16 64,17 22,20 10,21 12,22 5,24 31,25 9,26 1,28 3,29 5,31 1,32 31,35 8.1,36 0.125,37 8,38 41,39 62.389,40 70.275,41 39.597,42 37.2,44 6.444}
{0 CHEMBL2152198,1 7.387,2 34.4,3 49.2,4 1.01,5 1.137,6 0.637,7 0.602,8 450.62,9 6.6,10 6,11 61,13 11,14 33,16 63,17 21,20 10,21 11,22 5,24 30,25 10,26 1,28 4,29 5,31 1,32 31,35 8.2,36 0.127,37 8,38 41,39 61.607,40 69.358,41 38.841,42 36.695,44 6.42}
{0 CHEMBL2152199,1 7.83,2 42.6,3 44.3,4 1.005,5 1.119,6 0.682,7 0.646,8 477.63,9 4.9,10 17,11 61,13 22,14 37,16 64,17 26,20 20,21 6,22 5,24 27,25 8,26 1,28 3,29 4,31 1,32 34,35 6.6,36 0.109,37 7,38 50.5,39 61.294,40 68.235,41 41.62,42 39.432,44 6.77}
{0 CHEMBL2152200,1 7.543,2 40.3,3 46.8,4 1.003,5 1.123,6 0.667,7 0.628,8 467.64,9 4.8,10 12,11 62,13 17,14 36,16 65,17 25,20 16,21 9,22 5,24 29,25 8,26 1,28 3,29 4,31 1,32 33,35 6.5,36 0.092,37 6,38 47,39 62.178,40 69.65,41 41.381,42 38.959,44 6.495}
{0 CHEMBL2152201,1 7.688,2 40.7,3 45.8,4 1.005,5 1.123,6 0.672,7 0.634,8 453.61,9 5.1,10 12,11 59,13 17,14 35,16 62,17 24,20 16,21 8,22 5,24 27,25 8,26 1,28 3,29 4,31 1,32 32,35 6.8,36 0.097,37 6,38 46,39 59.294,40 66.235,41 39.62,42 37.432,44 6.699}
{0 CHEMBL2152202,1 8.354,2 39.3,3 42.6,4 1.028,5 1.142,6 0.659,7 0.641,8 509.6,9 4.9,10 12,11 61,13 17,14 37,16 63,17 24,20 16,21 8,22 5,23 3,24 26,25 11,26 1,28 3,29 4,31 1,32 35,34 3,35 6.6,36 0.127,37 8,38 48,39 62.716,40 69.669,41 40.193,42 39.109,43 4.9,44 6.26}
{0 CHEMBL2152203,1 8.208,2 39.7,3 44.8,4 1.011,5 1.124,6 0.681,7 0.642,8 476.04,9 5.2,10 12,11 58,13 17,14 34,16 60,17 23,18 1,20 16,21 7,22 5,24 26,25 9,26 2,28 3,29 4,31 1,32 32,34 1,35 6.9,36 0.133,37 8,38 45,39 58.618,40 65.179,41 39.477,42 37.26,43 1.7,44 6.553}
{0 CHEMBL2152204,1 7.607,2 38.7,3 46.8,4 1.008,5 1.127,6 0.659,7 0.624,8 471.63,9 4.8,10 12,11 62,13 17,14 35,16 64,17 24,20 16,21 8,22 5,24 29,25 9,26 1,28 3,29 5,31 1,32 33,35 8.1,36 0.141,37 9,38 46,39 62.505,40 69.86,41 40.835,42 38.674,44 6.959}
{0 CHEMBL2152205,1 7.11,2 38.6,3 50,4 0.998,5 1.127,6 0.652,7 0.608,8 497.72,9 4.3,10 12,11 70,13 17,14 37,16 72,17 27,20 16,21 11,22 5,24 35,25 8,26 1,28 3,29 4,31 1,32 35,35 5.7,36 0.125,37 9,38 48,39 69.829,40 78.896,41 45.665,42 42.539,44 4.658}
{0 CHEMBL2152206,1 7.613,2 42.6,3 45.6,4 1.001,5 1.119,6 0.679,7 0.639,8 517.7,9 4.4,10 18,11 68,13 23,14 40,16 71,17 29,20 22,21 7,22 5,24 31,25 8,26 1,28 3,29 4,31 1,32 37,35 5.9,36 0.127,37 9,38 54,39 68.061,40 76.065,41 46.142,42 43.486,44 4.244}
{0 CHEMBL2152207,1 7.682,2 42.2,3 45.3,4 1.003,5 1.12,6 0.678,7 0.64,8 491.66,9 4.7,10 17,11 64,13 22,14 38,16 67,17 27,20 20,21 7,22 5,24 29,25 8,26 1,28 3,29 4,31 1,32 35,35 6.3,36 0.119,37 8,38 51.5,39 64.178,40 71.65,41 43.381,42 40.959,44 6.553}
{0 CHEMBL2152208,1 7.82,2 41.3,3 44.4,4 1.006,5 1.123,6 0.677,7 0.642,8 492.65,9 6.3,10 17,11 63,13 22,14 38,16 66,17 26,20 19,21 7,22 5,24 28,25 9,26 1,28 4,29 4,31 1,32 35,35 6.3,36 0.121,37 8,38 51.5,39 63.396,40 70.733,41 42.625,42 40.453,44 6.509}
{0 CHEMBL2152209,1 7.607,2 38.7,3 46.8,4 1.008,5 1.127,6 0.659,7 0.624,8 471.63,9 4.8,10 12,11 62,13 17,14 35,16 64,17 24,20 16,21 8,22 5,24 29,25 9,26 1,28 3,29 5,31 1,32 33,35 8.1,36 0.141,37 9,38 46,39 62.505,40 69.86,41 40.835,42 38.674,44 6.638}
{0 CHEMBL2152210,1 7.601,2 37.9,3 47,4 1.011,5 1.129,6 0.652,7 0.62,8 501.66,9 4.5,10 12,11 66,13 17,14 37,16 68,17 25,20 16,21 9,22 5,24 31,25 10,26 1,28 3,29 6,31 1,32 35,35 9.1,36 0.147,37 10,38 48,39 66.716,40 74.484,41 43.051,42 40.915,44 6.337}
{0 CHEMBL2152211,1 7.961,2 39.3,3 44.3,4 1.016,5 1.125,6 0.664,7 0.637,8 485.61,9 4.9,10 12,11 61,13 17,14 37,16 64,17 24,20 16,21 8,22 5,24 27,25 10,26 1,28 3,29 6,31 1,32 34,35 9.8,36 0.125,37 8,38 48,39 61.949,40 68.654,41 40.529,42 38.862,44 6.553}
{0 CHEMBL2152212,1 7.677,2 39.7,3 46,4 1.008,5 1.125,6 0.664,7 0.63,8 483.64,9 4.8,10 12,11 63,13 17,14 37,16 66,17 25,20 16,21 9,22 5,24 29,25 9,26 1,28 3,29 5,31 1,32 34,35 7.9,36 0.121,37 8,38 48,39 63.505,40 70.86,41 41.835,42 39.674,44 6.585}
{0 CHEMBL2152213,1 8.208,2 39.7,3 44.8,4 1.011,5 1.124,6 0.681,7 0.642,8 476.04,9 5.2,10 12,11 58,13 17,14 34,16 60,17 23,18 1,20 16,21 7,22 5,24 26,25 9,26 2,28 3,29 4,31 1,32 32,34 1,35 6.9,36 0.133,37 8,38 45,39 58.618,40 65.179,41 39.477,42 37.26,43 1.7,44 6.77}
{0 CHEMBL2152214,1 7.338,2 39.1,3 48.4,4 1.001,5 1.126,6 0.658,7 0.617,8 469.66,9 4.7,10 12,11 64,13 17,14 35,16 66,17 25,20 16,21 9,22 5,24 31,25 8,26 1,28 3,29 4,31 1,32 33,35 6.3,36 0.121,37 8,38 46,39 64.061,40 72.065,41 42.142,42 39.486,44 6.745}
{0 CHEMBL2152215,1 7.409,2 41.8,3 45.5,4 1.006,5 1.125,6 0.658,7 0.631,8 407.51,9 5.5,10 12,11 55,13 16,14 32,16 57,17 23,20 17,21 6,22 4,24 25,25 7,28 3,29 4,32 30,35 7.3,36 0.123,37 7,38 42,39 55.334,40 61.9,41 36.211,42 34.718,44 5.051}
{0 CHEMBL2152216,1 7.027,2 41.1,3 48.2,4 0.998,5 1.127,6 0.652,7 0.617,8 393.53,9 5.4,10 12,11 56,13 15,14 31,16 58,17 23,20 16,21 7,22 3,24 27,25 6,28 3,29 3,32 29,35 5.4,36 0.138,37 8,38 40,39 55.891,40 63.106,41 36.517,42 34.53,44 5.796}
{0 CHEMBL216391,1 9.07,2 42.2,3 40.6,4 1.017,5 1.124,6 0.688,7 0.664,8 580.48,9 7.8,10 21,11 64,13 24,14 42,15 1,16 68,17 27,20 20,21 7,22 3,24 26,25 11,26 1,28 5,29 5,32 38,34 1,35 7.8,36 0.147,37 10,38 55.5,39 65.094,40 71.947,41 44.029,42 42.501,43 1.6,44 4.292}
{0 CHEMBL218647,1 9.227,2 40,3 42,4 1.018,5 1.128,6 0.681,7 0.654,8 461.35,9 8,10 11,11 50,13 14,14 32,15 1,16 53,17 20,20 12,21 8,22 3,24 21,25 9,26 1,28 4,29 4,32 29,34 1,35 8,36 0.113,37 6,38 40.5,39 50.898,40 56.409,41 34.046,42 32.711,43 2,44 4.208}
{0 CHEMBL218772,1 9.253,2 42.1,3 40.4,4 1.019,5 1.123,6 0.689,7 0.666,8 527.41,9 7,10 17,11 57,13 20,14 37,15 1,16 60,17 24,20 18,21 6,22 3,24 23,25 10,26 1,28 4,29 5,32 34,34 1,35 8.8,36 0.15,37 9,38 48.5,39 58.109,40 64.034,41 39.262,42 37.953,43 1.8,44 4.387}
{0 CHEMBL219013,1 9.407,2 41.8,3 40,4 1.024,5 1.13,6 0.686,7 0.666,8 517.39,9 7.3,10 16,11 55,13 19,14 36,15 1,16 58,17 23,20 17,21 6,22 3,23 1,24 22,25 10,26 1,28 4,29 4,32 33,34 2,35 7.3,36 0.155,37 9,38 47,39 56.294,40 62.164,41 37.745,42 36.621,43 3.6,44 4.721}
{0 CHEMBL219427,1 9.474,2 43.3,3 38.3,4 1.023,5 1.128,6 0.696,7 0.677,8 568.44,9 8.3,10 21,11 60,13 24,14 41,15 1,16 64,17 26,20 20,21 6,22 3,23 1,24 23,25 11,26 1,28 5,29 4,32 37,34 2,35 6.7,36 0.141,37 9,38 54.5,39 61.396,40 67.662,41 41.75,42 40.643,43 3.3,44 5.886}
{0 CHEMBL219514,1 9.227,2 40,3 42,4 1.018,5 1.128,6 0.681,7 0.654,8 461.35,9 8,10 11,11 50,13 14,14 32,15 1,16 53,17 20,20 12,21 8,22 3,24 21,25 9,26 1,28 4,29 4,32 29,34 1,35 8,36 0.113,37 6,38 40.5,39 50.898,40 56.409,41 34.046,42 32.711,43 2,44 4.959}
{0 CHEMBL220137,1 9.407,2 41.8,3 40,4 1.024,5 1.13,6 0.686,7 0.666,8 517.39,9 7.3,10 16,11 55,13 19,14 36,15 1,16 58,17 23,20 17,21 6,22 3,23 1,24 22,25 10,26 1,28 4,29 4,32 33,34 2,35 7.3,36 0.155,37 9,38 47,39 56.294,40 62.164,41 37.745,42 36.621,43 3.6,44 4.745}
{0 CHEMBL2203450,1 6.92,2 38.8,3 49.3,4 0.998,5 1.133,6 0.643,7 0.606,8 463.64,9 7.5,10 12,11 67,13 16,14 36,16 69,17 26,20 16,21 10,22 4,24 33,25 8,28 5,29 3,32 34,35 4.5,36 0.145,37 10,38 46,39 66.861,40 75.933,41 43.052,42 40.627,44 6.721}
{0 CHEMBL2203451,1 6.824,2 38.6,3 50,4 0.996,5 1.134,6 0.64,7 0.602,8 477.67,9 7.1,10 12,11 70,13 16,14 37,16 72,17 27,20 16,21 11,22 4,24 35,25 8,28 5,29 3,32 35,35 4.3,36 0.153,37 11,38 47,39 69.745,40 79.348,41 44.813,42 42.153,44 7.854}
{0 CHEMBL2203452,1 6.693,2 35,3 51.7,4 1,5 1.142,6 0.622,7 0.585,8 401.57,9 8.3,10 6,11 60,13 10,14 30,16 61,17 21,20 10,21 11,22 4,24 31,25 8,28 5,29 3,32 29,35 5,36 0.148,37 9,38 37,39 59.978,40 68.517,41 37.29,42 35.1,44 6.721}
{0 CHEMBL2203453,1 7.037,2 41.1,3 47.9,4 0.997,5 1.128,6 0.655,7 0.619,8 513.7,9 6.8,10 17,11 73,13 21,14 41,16 76,17 30,20 20,21 10,22 4,24 35,25 8,28 5,29 3,32 38,35 4.1,36 0.132,37 10,38 53.5,39 72.745,40 82.348,41 47.813,42 45.153,44 5.796}
{0 CHEMBL2203454,1 6.567,2 34.3,3 52.9,4 0.999,5 1.142,6 0.615,7 0.577,8 459.66,9 7.1,10 6,11 70,13 10,14 34,16 71,17 24,20 10,21 14,22 4,24 37,25 9,28 5,29 4,32 33,35 5.7,36 0.155,37 11,38 41,39 69.956,40 79.972,41 43.029,42 40.395,44 6.071}
{0 CHEMBL2203455,1 6.643,2 35.2,3 52.1,4 0.999,5 1.14,6 0.62,7 0.583,8 471.67,9 7,10 6,11 71,13 10,14 36,16 73,17 25,20 10,21 15,22 4,24 37,25 9,28 5,29 4,32 34,35 5.6,36 0.11,37 8,38 43,39 70.956,40 80.972,41 44.029,42 41.395,44 5.745}
{0 CHEMBL2203456,1 6.662,2 32.7,3 53.1,4 1.009,5 1.143,6 0.6,7 0.57,8 326.44,9 4.1,11 49,13 4,14 23,16 49,17 16,20 5,21 11,22 4,24 26,25 7,28 2,29 5,32 23,35 10.2,36 0.143,37 7,38 27,39 49.443,40 56.026,41 29.421,42 27.938,44 4.097}
{0 CHEMBL2203457,1 7.713,2 38,3 45.1,4 1.023,5 1.149,6 0.635,7 0.62,8 547.64,9 7,10 12,11 71,13 16,14 41,16 73,17 27,20 16,21 11,22 4,23 3,24 32,25 12,28 5,29 4,32 39,34 3,35 5.6,36 0.164,37 12,38 51,39 72.61,40 81.576,41 45.08,42 44.018,43 4.2,44 6.959}
{0 CHEMBL2203458,1 7.384,2 41.7,3 45.8,4 1.007,5 1.125,6 0.655,7 0.629,8 354.44,9 4.2,10 12,11 48,13 15,14 27,16 49,17 20,20 16,21 4,22 3,24 22,25 6,28 2,29 4,32 26,35 8.3,36 0.204,37 10,38 36,39 48.349,40 53.986,41 31.443,42 30.17,44 4.097}
{0 CHEMBL2203459,1 6.603,2 35.6,3 52.5,4 1,5 1.138,6 0.619,7 0.581,8 389.55,9 5.1,10 6,11 59,13 10,14 28,16 59,17 21,20 11,21 10,22 4,24 31,25 7,28 3,29 4,32 28,35 6.8,36 0.22,37 13,38 35,39 58.985,40 67.145,41 36.495,42 34.299,44 5.854}
{0 CHEMBL2203460,1 6.957,2 36.2,3 50,4 1.007,5 1.137,6 0.624,7 0.595,8 403.53,9 5.2,10 6,11 58,13 10,14 30,16 59,17 21,20 11,21 10,22 4,24 29,25 8,28 3,29 5,32 29,35 8.6,36 0.186,37 11,38 37,39 58.429,40 65.94,41 36.188,42 34.487,44 6.137}
{0 CHEMBL2203461,1 6.693,2 36.7,3 51.7,4 1,5 1.136,6 0.625,7 0.588,8 401.56,9 5,10 6,11 60,13 10,14 30,16 61,17 22,20 11,21 11,22 4,24 31,25 7,28 3,29 4,32 29,35 6.7,36 0.18,37 11,38 37,39 59.985,40 68.145,41 37.495,42 35.299,44 5.921}
{0 CHEMBL2203462,1 6.799,2 36.8,3 50.9,4 1.002,5 1.136,6 0.627,7 0.592,8 387.53,9 5.3,10 6,11 57,13 10,14 29,16 58,17 21,20 11,21 10,22 4,24 29,25 7,28 3,29 4,32 28,35 7,36 0.19,37 11,38 36,39 57.101,40 64.73,41 35.733,42 33.772,44 6.237}
{0 CHEMBL2203463,1 6.917,2 37,3 50,4 1.004,5 1.135,6 0.629,7 0.597,8 373.5,9 5.6,10 6,11 54,13 10,14 28,16 55,17 20,20 11,21 9,22 4,24 27,25 7,28 3,29 4,32 27,35 7.4,36 0.2,37 11,38 35,39 54.218,40 61.315,41 33.972,42 32.245,44 5.602}
{0 CHEMBL2203464,1 6.597,2 36.5,3 52.4,4 0.998,5 1.136,6 0.623,7 0.585,8 415.59,9 4.8,10 6,11 63,13 10,14 31,16 64,17 23,20 11,21 12,22 4,24 33,25 7,28 3,29 4,32 30,35 6.3,36 0.172,37 11,38 38,39 62.869,40 71.561,41 39.256,42 36.825,44 6.229}
{0 CHEMBL2203465,1 7.292,2 36.7,3 48.3,4 1.017,5 1.147,6 0.623,7 0.601,8 437.54,9 5,10 6,11 60,13 10,14 32,16 61,17 22,20 11,21 11,22 4,23 2,24 29,25 9,28 3,29 4,32 31,34 2,35 6.7,36 0.18,37 11,38 39,39 61.01,40 68.825,41 37.37,42 36.065,43 3.3,44 6.18}
{0 CHEMBL2203466,1 7.14,2 41,3 47.5,4 1.002,5 1.127,6 0.651,7 0.619,8 435.57,9 4.9,10 12,11 61,13 16,14 34,16 63,17 25,20 17,21 8,22 4,24 29,25 7,28 3,29 4,32 32,35 6.6,36 0.175,37 11,38 44,39 61.101,40 68.73,41 39.733,42 37.772,44 6.62}
{0 CHEMBL2203467,1 6.824,2 40,3 50,4 0.996,5 1.128,6 0.643,7 0.605,8 477.66,9 4.3,10 12,11 70,13 16,14 37,16 72,17 28,20 17,21 11,22 4,24 35,25 7,28 3,29 4,32 35,35 5.7,36 0.167,37 12,38 47,39 69.752,40 78.976,41 45.017,42 42.352,44 7.268}
{0 CHEMBL2203468,1 6.719,2 35.5,3 51.6,4 1.001,5 1.139,6 0.621,7 0.586,8 416.58,9 6.5,10 6,11 62,13 10,14 31,16 63,17 22,20 11,21 11,22 4,24 32,25 8,28 4,29 4,32 30,35 6.5,36 0.175,37 11,38 38,39 62.087,40 70.644,41 38.5,42 36.32,44 6.215}
{0 CHEMBL2203469,1 7.436,2 39.1,3 47.8,4 1.004,5 1.13,6 0.654,7 0.618,8 513.09,9 5.8,10 12,11 69,13 16,14 38,16 71,17 27,18 1,20 17,21 10,22 4,24 33,25 9,26 1,28 4,29 4,32 36,34 1,35 5.8,36 0.169,37 12,38 48,39 69.294,40 78.003,41 45.12,42 42.674,43 1.4,44 7.208}
{0 CHEMBL2203470,1 7.44,2 38.4,3 47.9,4 1.007,5 1.132,6 0.648,7 0.615,8 543.12,9 5.5,10 12,11 73,13 16,14 40,16 75,17 28,18 1,20 17,21 11,22 4,24 35,25 10,26 1,28 4,29 5,32 38,34 1,35 6.8,36 0.173,37 13,38 50,39 73.505,40 82.627,41 47.336,42 44.916,43 1.4,44 7.108}
{0 CHEMBL2203471,1 7.049,2 41.3,3 48,4 0.998,5 1.126,6 0.654,7 0.618,8 528.71,9 5.3,10 17,11 75,13 21,14 42,16 78,17 31,20 21,21 10,22 4,24 36,25 8,28 4,29 4,32 39,35 5.3,36 0.154,37 12,38 54.5,39 74.854,40 84.474,41 49.023,42 46.374,44 6.638}
{0 CHEMBL2203472,1 7.054,2 38.2,3 48.5,4 1.003,5 1.134,6 0.64,7 0.608,8 479.64,9 7.4,10 12,11 68,13 16,14 37,16 70,17 26,20 16,21 10,22 4,24 33,25 9,28 5,29 4,32 35,35 5.9,36 0.171,37 12,38 47,39 68.189,40 77.142,41 43.506,42 41.341,44 6.585}
{0 CHEMBL2203473,1 6.953,2 38,3 49.3,4 1.001,5 1.135,6 0.638,7 0.604,8 493.67,9 7,10 12,11 71,13 16,14 38,16 73,17 27,20 16,21 11,22 4,24 35,25 9,28 5,29 4,32 36,35 5.6,36 0.164,37 12,38 48,39 71.072,40 80.557,41 45.267,42 42.868,44 7.26}
{0 CHEMBL2203474,1 6.953,2 38,3 49.3,4 1.001,5 1.135,6 0.638,7 0.604,8 493.67,9 7,10 12,11 71,13 16,14 38,16 73,17 27,20 16,21 11,22 4,24 35,25 9,28 5,29 4,32 36,35 5.6,36 0.164,37 12,38 48,39 71.072,40 80.557,41 45.267,42 42.868,44 6.77}
{0 CHEMBL2203475,1 7.713,2 38,3 45.1,4 1.023,5 1.149,6 0.635,7 0.62,8 547.64,9 7,10 12,11 71,13 16,14 41,16 73,17 27,20 16,21 11,22 4,23 3,24 32,25 12,28 5,29 4,32 39,34 3,35 5.6,36 0.164,37 12,38 51,39 72.61,40 81.576,41 45.08,42 44.018,43 4.2,44 6.796}
{0 CHEMBL2203476,1 6.886,2 35.4,3 50.8,4 1.008,5 1.138,6 0.618,7 0.589,8 447.59,9 4.6,10 6,11 65,13 11,14 32,16 65,17 23,20 12,21 11,22 5,24 33,25 9,28 3,29 6,32 32,35 9.2,36 0.231,37 15,38 40,39 65.523,40 73.979,41 40.165,42 38.255,44 5.509}
{0 CHEMBL2203477,1 7.27,2 37,3 47.8,4 1.015,5 1.135,6 0.628,7 0.606,8 334.41,9 4.3,10 6,11 46,13 10,14 24,16 46,17 17,20 11,21 6,22 4,24 22,25 7,28 2,29 5,32 24,35 10.9,36 0.239,37 11,38 31,39 46.676,40 52.196,41 28.898,42 27.885,44 5.569}
{0 CHEMBL2203478,1 6.818,2 36.2,3 51.1,4 1.005,5 1.136,6 0.621,7 0.589,8 320.43,9 4.3,10 6,11 47,13 9,14 23,16 47,17 17,20 10,21 7,22 3,24 24,25 6,28 2,29 4,32 23,35 8.5,36 0.234,37 11,38 29,39 47.232,40 53.401,41 29.205,42 27.697,44 5.268}
{0 CHEMBL2203479,1 6.753,2 37.2,3 51.2,4 1.001,5 1.134,6 0.628,7 0.592,8 290.4,9 4.7,10 6,11 43,13 9,14 21,16 43,17 16,20 10,21 6,22 3,24 22,25 5,28 2,29 3,32 21,35 7,36 0.233,37 10,38 27,39 43.022,40 48.777,41 26.989,42 25.455,44 5.119}
{0 CHEMBL2203480,1 7.175,2 30.6,3 50,4 1.025,5 1.149,6 0.594,7 0.579,8 258.31,9 5.6,11 36,13 4,14 17,16 35,17 11,20 5,21 6,22 4,24 18,25 7,28 2,29 5,32 18,35 13.9,36 0.257,37 9,38 21,39 36.909,40 41.365,41 21.375,42 20.831,44 4.097}
{0 CHEMBL2203481,1 8.018,2 37,3 45.7,4 1.022,5 1.133,6 0.647,7 0.624,8 368.85,9 4.3,10 6,11 46,13 10,14 25,16 46,17 17,18 1,20 11,21 6,22 4,24 21,25 8,26 1,28 2,29 5,32 25,34 1,35 10.9,36 0.239,37 11,38 32,39 47,40 52.14,41 29.756,42 28.712,43 2.2,44 5.721}
{0 CHEMBL2203482,1 8.212,2 36.7,3 42.9,4 1.043,5 1.156,6 0.622,7 0.624,8 402.41,9 4.1,10 6,11 49,13 10,14 28,16 49,17 18,20 11,21 7,22 4,23 3,24 21,25 10,28 2,29 5,32 28,34 3,35 10.2,36 0.224,37 11,38 35,39 51.098,40 56.63,41 30.472,42 30.562,43 6.1,44 5.456}
{0 CHEMBL2203483,1 8.212,2 36.7,3 42.9,4 1.043,5 1.156,6 0.622,7 0.624,8 402.41,9 4.1,10 6,11 49,13 10,14 28,16 49,17 18,20 11,21 7,22 4,23 3,24 21,25 10,28 2,29 5,32 28,34 3,35 10.2,36 0.224,37 11,38 35,39 51.098,40 56.63,41 30.472,42 30.562,43 6.1,44 5}
{0 CHEMBL2203484,1 8.212,2 36.7,3 42.9,4 1.043,5 1.156,6 0.622,7 0.624,8 402.41,9 4.1,10 6,11 49,13 10,14 28,16 49,17 18,20 11,21 7,22 4,23 3,24 21,25 10,28 2,29 5,32 28,34 3,35 10.2,36 0.224,37 11,38 35,39 51.098,40 56.63,41 30.472,42 30.562,43 6.1,44 4.481}
{0 CHEMBL2203485,1 7.904,2 35.4,3 43.8,4 1.032,5 1.14,6 0.626,7 0.621,8 379.41,9 6.3,10 6,11 48,13 12,14 27,16 48,17 17,20 11,21 6,22 6,24 21,25 10,28 3,29 7,32 27,35 14.6,36 0.25,37 12,38 36,39 49.549,40 54.698,41 30.051,42 29.809,44 4.208}
{0 CHEMBL2203486,1 7.661,2 37,3 45.7,4 1.026,5 1.142,6 0.627,7 0.615,8 352.4,9 4.3,10 6,11 46,13 10,14 25,16 46,17 17,20 11,21 6,22 4,23 1,24 21,25 8,28 2,29 5,32 25,34 1,35 10.9,36 0.239,37 11,38 32,39 47.189,40 52.535,41 28.835,42 28.268,43 2.2,44 5.102}
{0 CHEMBL2203487,1 7.111,2 36.7,3 49,4 1.011,5 1.135,6 0.626,7 0.6,8 348.44,9 4.1,10 6,11 49,13 10,14 25,16 49,17 18,20 11,21 7,22 4,24 24,25 7,28 2,29 5,32 25,35 10.2,36 0.224,37 11,38 32,39 49.56,40 55.611,41 30.659,42 29.412,44 4.854}
{0 CHEMBL2203488,1 6.733,2 36.2,3 51.7,4 1.004,5 1.135,6 0.62,7 0.586,8 390.53,9 3.4,10 6,11 58,13 10,14 28,16 58,17 21,20 11,21 10,22 4,24 30,25 7,28 2,29 5,32 28,35 8.6,36 0.241,37 14,38 35,39 58.211,40 65.856,41 35.944,42 33.992,44 5.229}
{0 CHEMBL2203489,1 6.733,2 36.2,3 51.7,4 1.004,5 1.135,6 0.62,7 0.586,8 390.53,9 3.4,10 6,11 58,13 10,14 28,16 58,17 21,20 11,21 10,22 4,24 30,25 7,28 2,29 5,32 28,35 8.6,36 0.207,37 12,38 35,39 58.211,40 65.856,41 35.944,42 33.992,44 4.678}
{0 CHEMBL2203490,1 8.052,2 37,3 43.5,4 1.037,5 1.149,6 0.625,7 0.623,8 370.39,9 4.3,10 6,11 46,13 10,14 26,16 46,17 17,20 11,21 6,22 4,23 2,24 20,25 9,28 2,29 5,32 26,34 2,35 10.9,36 0.239,37 11,38 33,39 47.702,40 52.875,41 28.773,42 28.651,43 4.3,44 5}
{0 CHEMBL2203491,1 7.394,2 40.4,3 46.2,4 1.011,5 1.127,6 0.647,7 0.623,8 384.47,9 3.8,10 11,11 52,13 15,14 29,16 53,17 21,20 15,21 6,22 4,24 24,25 7,28 2,29 5,32 28,35 9.6,36 0.208,37 11,38 38.5,39 52.56,40 58.611,41 33.659,42 32.412,44 4.854}
{0 CHEMBL2203492,1 7.394,2 40.4,3 46.2,4 1.011,5 1.127,6 0.647,7 0.623,8 384.47,9 3.8,10 11,11 52,13 15,14 29,16 53,17 21,20 15,21 6,22 4,24 24,25 7,28 2,29 5,32 28,35 9.6,36 0.208,37 11,38 38.5,39 52.56,40 58.611,41 33.659,42 32.412,44 5.041}
{0 CHEMBL2203493,1 6.821,2 35.8,3 50.9,4 1.004,5 1.138,6 0.622,7 0.59,8 361.49,9 5.7,10 6,11 53,13 10,14 26,16 53,17 19,20 11,21 8,22 4,24 27,25 7,28 3,29 4,32 26,35 7.5,36 0.208,37 11,38 33,39 53.218,40 60.315,41 32.972,42 31.245,44 5.959}
{0 CHEMBL259664,1 8.743,2 53.3,3 33.3,4 1.013,5 1.103,6 0.732,7 0.719,8 262.28,9 6.7,10 16,11 30,13 18,14 23,16 33,17 16,20 16,22 2,24 10,25 4,28 2,29 2,32 20,35 6.7,36 0.03,37 1,38 33,39 30.393,40 33.076,41 21.966,42 21.58,44 4}
{0 CHEMBL325480,1 17.064,2 50,3 25,4 1.037,5 1.092,6 0.881,7 0.801,8 273.03,9 6.3,10 6,11 16,13 8,14 13,16 17,17 8,20 8,22 2,24 4,25 4,26 1,27 1,28 1,29 2,32 12,34 1,35 12.5,38 18,39 16.593,40 17.468,41 14.097,42 12.821,43 6.3,44 4.187}
{0 CHEMBL327012,1 11.349,2 50,3 25,4 1.053,5 1.106,6 0.768,7 0.771,8 181.58,9 6.3,10 6,11 16,13 8,14 13,16 17,17 8,18 1,20 8,22 2,24 4,25 4,26 1,28 1,29 2,32 12,34 1,35 12.5,38 18,39 16.847,40 17.692,41 12.295,42 12.332,43 6.3,44 4.187}
{0 CHEMBL359878,1 8.448,2 43.8,3 39.6,4 1.009,5 1.12,6 0.707,7 0.675,8 405.52,9 10.4,10 17,11 48,13 20,14 32,16 51,17 21,20 19,21 2,22 3,24 19,25 8,26 1,28 5,29 2,31 1,32 29,35 4.2,36 0.098,37 5,38 43.5,39 48.425,40 53.737,41 33.915,42 32.411,44 4.699}
{0 CHEMBL359960,1 9.137,2 43.8,3 37.5,4 1.015,5 1.112,6 0.729,7 0.694,8 438.57,9 8.3,10 17,11 48,13 20,14 33,16 51,17 21,20 19,21 2,22 3,24 18,25 9,26 2,28 4,29 3,31 2,32 30,35 6.3,36 0.118,37 6,38 44.5,39 48.727,40 53.368,41 35.012,42 33.292,44 5.699}
{0 CHEMBL360152,1 9.834,2 44.4,3 33.3,4 1.03,5 1.118,6 0.738,7 0.714,8 442.53,9 8.9,10 17,11 45,13 20,14 33,16 48,17 20,20 19,21 1,22 3,23 1,24 15,25 10,26 2,28 4,29 3,31 2,32 30,34 1,35 6.7,36 0.104,37 5,38 44.5,39 46.356,40 50.292,41 33.188,42 32.148,43 2.2,44 5.854}
{0 CHEMBL360282,1 9.512,2 43.8,3 35.4,4 1.026,5 1.119,6 0.728,7 0.702,8 456.56,9 8.3,10 17,11 48,13 20,14 34,16 51,17 21,20 19,21 2,22 3,23 1,24 17,25 10,26 2,28 4,29 3,31 2,32 31,34 1,35 6.3,36 0.118,37 6,38 45.5,39 49.24,40 53.708,41 34.949,42 33.675,43 2.1,44 6.854}
{0 CHEMBL360314,1 10.103,2 45.5,3 31.8,4 1.035,5 1.123,6 0.743,7 0.723,8 444.52,9 9.1,10 17,11 44,13 20,14 33,16 47,17 20,20 19,21 1,22 3,23 2,24 14,25 10,26 2,28 4,29 2,31 2,32 30,34 2,35 4.5,36 0.106,37 5,38 44.5,39 45.542,40 49.423,41 32.671,42 31.817,43 4.5,44 6.854}
{0 CHEMBL360924,1 9.756,2 44.7,3 34,4 1.03,5 1.124,6 0.733,7 0.709,8 458.55,9 8.5,10 17,11 47,13 20,14 34,16 50,17 21,20 19,21 2,22 3,23 2,24 16,25 10,26 2,28 4,29 2,31 2,32 31,34 2,35 4.3,36 0.1,37 5,38 45.5,39 48.425,40 52.838,41 34.432,42 33.344,43 4.3,44 6.824}
{0 CHEMBL361399,1 8.732,2 44,3 40,4 1.006,5 1.111,6 0.726,7 0.682,8 436.6,9 8,10 17,11 50,13 20,14 33,16 53,17 22,20 19,21 3,22 3,24 20,25 8,26 2,28 4,29 2,31 2,32 30,35 4,36 0.113,37 6,38 44.5,39 50.283,40 55.574,41 36.318,42 34.104,44 5.886}
{0 CHEMBL361560,1 8.906,2 40.4,3 40.4,4 1.017,5 1.126,6 0.708,7 0.67,8 418.56,9 8.5,10 11,11 47,13 14,14 31,16 50,17 19,20 13,21 6,22 3,23 1,24 19,25 9,26 2,28 4,29 2,31 2,32 28,34 1,35 4.3,36 0.08,37 4,38 39.5,39 47.796,40 52.913,41 33.256,42 31.487,43 2.1,44 6.699}
{0 CHEMBL361605,1 9.512,2 43.8,3 35.4,4 1.026,5 1.119,6 0.728,7 0.702,8 456.56,9 8.3,10 17,11 48,13 20,14 34,16 51,17 21,20 19,21 2,22 3,23 1,24 17,25 10,26 2,28 4,29 3,31 2,32 31,34 1,35 6.3,36 0.118,37 6,38 45.5,39 49.24,40 53.708,41 34.949,42 33.675,43 2.1,44 6.553}
{0 CHEMBL361790,1 10.226,2 47.6,3 31,4 1.034,5 1.117,6 0.754,7 0.733,8 429.5,9 7.1,10 17,11 42,13 20,14 32,16 45,17 20,20 19,21 1,22 3,23 2,24 13,25 9,26 2,28 3,29 2,31 2,32 29,34 2,35 4.8,36 0.111,37 5,38 43.5,39 43.44,40 46.924,41 31.665,42 30.795,43 4.8,44 4.699}
{0 CHEMBL361982,1 8.173,2 39.7,3 44.1,4 1.009,5 1.128,6 0.684,7 0.645,8 555.76,9 7.4,10 17,11 68,13 20,14 41,16 71,17 27,20 19,21 8,22 3,23 1,24 30,25 11,26 2,28 5,29 3,31 2,32 38,34 1,35 4.4,36 0.169,37 12,38 52.5,39 68.643,40 76.697,41 46.523,42 43.857,43 1.5,44 5.319}
{0 CHEMBL361988,1 9.431,2 39.5,3 37.2,4 1.026,5 1.13,6 0.715,7 0.685,8 405.52,9 11.6,10 11,11 43,13 14,14 30,16 46,17 17,20 13,21 4,22 3,23 1,24 16,25 10,26 2,28 5,29 2,31 2,32 27,34 1,35 4.7,36 0.087,37 4,38 38.5,39 44.131,40 48.581,41 30.739,42 29.455,43 2.3,44 5.149}
{0 CHEMBL362006,1 8.822,2 43.2,3 37.8,4 1.015,5 1.119,6 0.713,7 0.685,8 326.41,9 10.8,10 12,11 37,13 15,14 25,16 39,17 16,20 15,21 1,22 3,24 14,25 7,26 1,28 4,29 2,31 1,32 23,35 5.4,36 0.103,37 4,38 34,39 37.556,40 41.408,41 26.387,42 25.336,44 4.745}
{0 CHEMBL362261,1 10.36,2 46.5,3 30.2,4 1.041,5 1.119,6 0.747,7 0.733,8 445.5,9 7,10 17,11 43,13 20,14 33,16 46,17 20,20 19,21 1,22 3,23 2,24 13,25 10,26 2,28 3,29 3,31 2,32 30,34 2,35 7,36 0.109,37 5,38 44.5,39 44.767,40 48.134,41 32.119,42 31.51,43 4.7,44 4.699}
{0 CHEMBL362471,1 10.103,2 45.5,3 31.8,4 1.035,5 1.123,6 0.743,7 0.723,8 444.52,9 9.1,10 17,11 44,13 20,14 33,16 47,17 20,20 19,21 1,22 3,23 2,24 14,25 10,26 2,28 4,29 2,31 2,32 30,34 2,35 4.5,36 0.106,37 5,38 44.5,39 45.542,40 49.423,41 32.671,42 31.817,43 4.5,44 6.538}
{0 CHEMBL362479,1 9.524,2 44.2,3 34.9,4 1.017,5 1.112,6 0.745,7 0.71,8 409.53,9 11.6,10 17,11 43,13 20,14 31,16 46,17 19,20 18,21 1,22 3,24 15,25 9,26 2,28 5,29 2,31 2,32 28,35 4.7,36 0.109,37 5,38 42.5,39 43.734,40 47.826,41 32.04,42 30.545,44 5.921}
{0 CHEMBL367352,1 9.181,2 43.4,3 37.7,4 1.022,5 1.126,6 0.716,7 0.687,8 486.61,9 7.5,10 17,11 53,13 20,14 36,16 56,17 23,20 19,21 4,22 3,23 2,24 20,25 10,26 2,28 4,29 2,31 2,32 33,34 2,35 3.8,36 0.107,37 6,38 47.5,39 54.192,40 59.668,41 37.955,42 36.397,43 3.8,44 6.046}
{0 CHEMBL367581,1 9.856,2 46.7,3 33.3,4 1.029,5 1.119,6 0.743,7 0.718,8 443.53,9 6.7,10 17,11 45,13 20,14 33,16 48,17 21,20 19,21 2,22 3,23 2,24 15,25 9,26 2,28 3,29 2,31 2,32 30,34 2,35 4.4,36 0.104,37 5,38 44.5,39 46.323,40 50.34,41 33.426,42 32.322,43 4.4,44 4.699}
{0 CHEMBL368014,1 9.364,2 40.5,3 37.8,4 1.017,5 1.117,6 0.731,7 0.69,8 346.47,9 10.8,10 11,11 37,13 14,14 25,16 39,17 15,20 13,21 2,22 3,24 14,25 8,26 2,28 4,29 2,31 2,32 23,35 5.4,36 0.103,37 4,38 33.5,39 37.633,40 41.328,41 27.034,42 25.523,44 5.076}
{0 CHEMBL374790,1 9.253,2 42.1,3 40.4,4 1.019,5 1.123,6 0.689,7 0.666,8 527.41,9 7,10 17,11 57,13 20,14 37,15 1,16 60,17 24,20 18,21 6,22 3,24 23,25 10,26 1,28 4,29 5,32 34,34 1,35 8.8,36 0.15,37 9,38 48.5,39 58.109,40 64.034,41 39.262,42 37.953,43 1.8,44 4.523}
{0 CHEMBL374887,1 9.407,2 41.8,3 40,4 1.024,5 1.13,6 0.686,7 0.666,8 517.39,9 7.3,10 16,11 55,13 19,14 36,15 1,16 58,17 23,20 17,21 6,22 3,23 1,24 22,25 10,26 1,28 4,29 4,32 33,34 2,35 7.3,36 0.155,37 9,38 47,39 56.294,40 62.164,41 37.745,42 36.621,43 3.6,44 4.004}
{0 CHEMBL375426,1 9.474,2 43.3,3 38.3,4 1.023,5 1.128,6 0.696,7 0.677,8 568.44,9 8.3,10 21,11 60,13 24,14 41,15 1,16 64,17 26,20 20,21 6,22 3,23 1,24 23,25 11,26 1,28 5,29 4,32 37,34 2,35 6.7,36 0.141,37 9,38 54.5,39 61.396,40 67.662,41 41.75,42 40.643,43 3.3,44 4.745}
{0 CHEMBL375595,1 9.161,2 40.4,3 42.3,4 1.019,5 1.126,6 0.678,7 0.653,8 476.36,9 5.8,10 12,11 52,13 15,14 32,15 1,16 54,17 21,20 15,21 6,22 3,24 22,25 9,26 1,28 3,29 5,32 30,34 1,35 9.6,36 0.167,37 9,38 41,39 53.007,40 58.536,41 35.256,42 33.931,43 1.9,44 4.167}
{0 CHEMBL384038,1 9.474,2 43.3,3 38.3,4 1.023,5 1.128,6 0.696,7 0.677,8 568.44,9 8.3,10 21,11 60,13 24,14 41,15 1,16 64,17 26,20 20,21 6,22 3,23 1,24 23,25 11,26 1,28 5,29 4,32 37,34 2,35 6.7,36 0.141,37 9,38 54.5,39 61.396,40 67.662,41 41.75,42 40.643,43 3.3,44 5.398}
{0 CHEMBL384892,1 9.286,2 42.6,3 39.3,4 1.02,5 1.123,6 0.693,7 0.672,8 566.45,9 8.2,10 21,11 61,13 24,14 41,15 1,16 65,17 26,20 20,21 6,22 3,24 24,25 11,26 1,28 5,29 5,32 37,34 1,35 8.2,36 0.138,37 9,38 54.5,39 62.211,40 68.532,41 42.267,42 40.974,43 1.6,44 4.469}
{0 CHEMBL410077,1 9.266,2 40.7,3 40.7,4 1.019,5 1.128,6 0.686,7 0.662,8 500.39,9 9.3,10 16,11 54,13 19,14 35,15 1,16 57,17 22,20 16,21 6,22 3,24 22,25 10,26 1,28 5,29 4,32 32,34 1,35 7.4,36 0.158,37 9,38 46,39 55,40 60.908,41 37.051,42 35.733,43 1.9,44 4.658}
{0 CHEMBL425170,1 10.068,2 45.5,3 34.1,4 1.019,5 1.107,6 0.765,7 0.724,8 442.98,9 9.1,10 17,11 44,13 20,14 32,16 47,17 20,18 1,20 19,21 1,22 3,24 15,25 9,26 3,28 4,29 2,31 2,32 29,34 1,35 4.5,36 0.106,37 5,38 43.5,39 44.84,40 48.687,41 33.654,42 31.878,43 2.3,44 5.824}
{0 CHEMBL426609,1 9.137,2 43.8,3 37.5,4 1.015,5 1.112,6 0.729,7 0.694,8 438.57,9 8.3,10 17,11 48,13 20,14 33,16 51,17 21,20 19,21 2,22 3,24 18,25 9,26 2,28 4,29 3,31 2,32 30,35 6.3,36 0.118,37 6,38 44.5,39 48.727,40 53.368,41 35.012,42 33.292,44 5.678}
{0 CHEMBL439042,1 7.117,2 34.2,3 49.2,4 1.013,5 1.143,6 0.617,7 0.594,8 854.09,9 7.5,10 6,11 120,13 16,14 64,16 123,17 41,20 16,21 25,22 10,24 59,25 20,28 9,29 11,32 61,35 9.2,36 0.179,37 22,38 77,39 121.607,40 137.168,41 74.086,42 71.225,44 4.398}
{0 CHEMBL515155,1 8.743,2 53.3,3 33.3,4 1.013,5 1.103,6 0.732,7 0.719,8 262.28,9 6.7,10 12,11 30,13 15,14 23,16 33,17 16,20 16,22 3,24 10,25 4,28 2,29 2,32 20,35 6.7,38 32,39 30.393,40 33.076,41 21.966,42 21.58,44 4.387}
