"molecule_id","FCFP4_1024b271","FCFP4_1024b65","FCFP4_1024b985","FCFP4_1024b429","FCFP4_1024b376","FCFP4_1024b1","FCFP4_1024b10","FCFP4_1024b100","FCFP4_1024b1000","FCFP4_1024b1001","FCFP4_1024b1002","FCFP4_1024b1003","FCFP4_1024b1004","FCFP4_1024b1005","FCFP4_1024b1006","FCFP4_1024b1007","FCFP4_1024b1008","FCFP4_1024b1009","FCFP4_1024b101","FCFP4_1024b1010","FCFP4_1024b1011","FCFP4_1024b1012","FCFP4_1024b1013","FCFP4_1024b1014","FCFP4_1024b1015","FCFP4_1024b1016","FCFP4_1024b1017","FCFP4_1024b1018","FCFP4_1024b1019","FCFP4_1024b102","FCFP4_1024b1020","FCFP4_1024b1021","FCFP4_1024b1022","FCFP4_1024b1023","FCFP4_1024b1024","FCFP4_1024b103","FCFP4_1024b104","FCFP4_1024b105","FCFP4_1024b106","FCFP4_1024b107","FCFP4_1024b108","FCFP4_1024b109","FCFP4_1024b11","FCFP4_1024b110","FCFP4_1024b111","FCFP4_1024b112","FCFP4_1024b113","FCFP4_1024b114","FCFP4_1024b115","FCFP4_1024b116","FCFP4_1024b117","FCFP4_1024b118","FCFP4_1024b119","FCFP4_1024b12","FCFP4_1024b120","FCFP4_1024b121","FCFP4_1024b122","FCFP4_1024b123","FCFP4_1024b124","FCFP4_1024b125","FCFP4_1024b126","FCFP4_1024b127","FCFP4_1024b128","FCFP4_1024b129","FCFP4_1024b13","FCFP4_1024b130","FCFP4_1024b131","FCFP4_1024b132","FCFP4_1024b133","FCFP4_1024b134","FCFP4_1024b135","FCFP4_1024b136","FCFP4_1024b137","FCFP4_1024b138","FCFP4_1024b139","FCFP4_1024b14","FCFP4_1024b140","FCFP4_1024b141","FCFP4_1024b142","FCFP4_1024b143","FCFP4_1024b144","FCFP4_1024b145","FCFP4_1024b146","FCFP4_1024b147","FCFP4_1024b148","FCFP4_1024b149","FCFP4_1024b15","FCFP4_1024b150","FCFP4_1024b151","FCFP4_1024b152","FCFP4_1024b153","FCFP4_1024b154","FCFP4_1024b155","FCFP4_1024b156","FCFP4_1024b157","FCFP4_1024b158","FCFP4_1024b159","FCFP4_1024b16","FCFP4_1024b160","FCFP4_1024b161","FCFP4_1024b162","FCFP4_1024b163","FCFP4_1024b164","FCFP4_1024b165","FCFP4_1024b166","FCFP4_1024b167","FCFP4_1024b168","FCFP4_1024b169","FCFP4_1024b17","FCFP4_1024b170","FCFP4_1024b171","FCFP4_1024b172","FCFP4_1024b173","FCFP4_1024b174","FCFP4_1024b175","FCFP4_1024b176","FCFP4_1024b177","FCFP4_1024b178","FCFP4_1024b179","FCFP4_1024b18","FCFP4_1024b180","FCFP4_1024b181","FCFP4_1024b182","FCFP4_1024b183","FCFP4_1024b184","FCFP4_1024b185","FCFP4_1024b186","FCFP4_1024b187","FCFP4_1024b188","FCFP4_1024b189","FCFP4_1024b19","FCFP4_1024b190","FCFP4_1024b191","FCFP4_1024b192","FCFP4_1024b193","FCFP4_1024b194","FCFP4_1024b195","FCFP4_1024b196","FCFP4_1024b197","FCFP4_1024b198","FCFP4_1024b199","FCFP4_1024b2","FCFP4_1024b20","FCFP4_1024b200","FCFP4_1024b201","FCFP4_1024b202","FCFP4_1024b203","FCFP4_1024b204","FCFP4_1024b205","FCFP4_1024b206","FCFP4_1024b207","FCFP4_1024b208","FCFP4_1024b209","FCFP4_1024b21","pXC50"
{6 1,73 1,109 1,110 1,120 1,155 4.456}
{0 CHEMBL110611,6 1,101 1,109 1,110 1,155 4.678}
{0 CHEMBL1159894,1 1,2 1,3 1,4 1,5 1,6 1,109 1,110 1,128 1,142 1,155 2.357}
{0 CHEMBL1159895,1 1,2 1,3 1,4 1,5 1,6 1,109 1,110 1,128 1,142 1,155 2.187}
{0 CHEMBL1159896,1 1,2 1,3 1,4 1,5 1,6 1,109 1,110 1,142 1,155 1.719}
{0 CHEMBL1159899,1 1,2 1,3 1,4 1,5 1,6 1,109 1,110 1,142 1,155 1.764}
{0 CHEMBL11608,6 1,58 1,109 1,110 1,128 1,155 2.699}
{0 CHEMBL144246,6 1,69 1,109 1,110 1,120 1,142 1,155 5.328}
{0 CHEMBL1515,6 1,69 1,109 1,120 1,142 1,155 4.347}
{0 CHEMBL163120,6 1,109 1,110 1,128 1,155 4.524}
{0 CHEMBL163500,6 1,82 1,98 1,142 1,155 5.301}
{0 CHEMBL164747,6 1,69 1,109 1,110 1,120 1,128 1,142 1,155 7.26}
{0 CHEMBL164791,6 1,69 1,109 1,110 1,120 1,142 1,155 4.495}
{0 CHEMBL165032,6 1,109 1,110 1,113 1,120 1,142 1,147 1,155 5.812}
{0 CHEMBL165150,6 1,109 1,110 1,120 1,142 1,155 6}
{0 CHEMBL165154,6 1,109 1,110 1,120 1,142 1,155 5.208}
{0 CHEMBL165206,6 1,75 1,109 1,110 1,120 1,142 1,155 5.721}
{0 CHEMBL165242,6 1,44 1,103 1,109 1,110 1,120 1,142 1,155 6.18}
{0 CHEMBL24510,6 1,73 1,109 1,110 1,120 1,142 1,155 6.827}
{0 CHEMBL269466,1 1,2 1,3 1,4 1,5 1,6 1,109 1,110 1,142 1,155 2.114}
{0 CHEMBL273674,1 1,2 1,3 1,4 1,5 1,6 1,109 1,110 1,142 1,155 1.721}
{0 CHEMBL275322,6 1,69 1,73 1,77 1,109 1,110 1,120 1,142 1,155 6.942}
{0 CHEMBL276864,6 1,109 1,110 1,118 1,155 1.69}
{0 CHEMBL278068,6 1,69 1,109 1,110 1,120 1,142 1,155 5.921}
{0 CHEMBL293230,6 1,69 1,109 1,110 1,118 1,120 1,142 1,155 4.276}
{0 CHEMBL293669,6 1,69 1,109 1,110 1,120 1,142 1,155 5.62}
{0 CHEMBL294141,6 1,69 1,73 1,109 1,110 1,120 1,142 1,155 5.319}
{0 CHEMBL294593,6 1,69 1,75 1,109 1,110 1,120 1,142 1,155 4.284}
{0 CHEMBL303000,4 1,5 1,6 1,63 1,69 1,109 1,110 1,120 1,142 1,155 4.444}
{0 CHEMBL304957,4 1,5 1,6 1,63 1,69 1,109 1,110 1,120 1,142 1,155 4.328}
{0 CHEMBL306643,6 1,69 1,75 1,109 1,110 1,120 1,142 1,155 4.018}
{0 CHEMBL310979,6 1,69 1,109 1,110 1,120 1,142 1,155 4.796}
{0 CHEMBL344095,6 1,69 1,109 1,110 1,120 1,142 1,155 5.678}
{0 CHEMBL348820,6 1,91 1,109 1,110 1,120 1,137 1,142 1,155 4.873}
{0 CHEMBL349152,6 1,109 1,110 1,113 1,120 1,142 1,147 1,155 4.796}
{0 CHEMBL349889,6 1,109 1,110 1,120 1,142 1,155 4.62}
{0 CHEMBL350128,6 1,69 1,109 1,110 1,120 1,128 1,142 1,155 5.658}
{0 CHEMBL350557,6 1,44 1,103 1,109 1,110 1,120 1,142 1,155 5.208}
{0 CHEMBL351468,6 1,62 1,109 1,110 1,111 1,113 1,126 1,142 1,155 5.553}
{0 CHEMBL351630,109 1,110 1,120 1,128 1,155 4.398}
{0 CHEMBL351873,6 1,109 1,110 1,120 1,142 1,155 7.456}
{0 CHEMBL351892,6 1,109 1,110 1,120 1,142 1,155 4.125}
{0 CHEMBL351936,6 1,75 1,109 1,110 1,111 1,113 1,142 1,155 5.432}
{0 CHEMBL352155,6 1,69 1,109 1,110 1,120 1,142 1,155 4.244}
{0 CHEMBL352449,6 1,109 1,110 1,111 1,113 1,142 1,155 5.854}
{0 CHEMBL352685,6 1,75 1,109 1,110 1,120 1,142 1,155 4.824}
{0 CHEMBL355612,6 1,44 1,103 1,109 1,110 1,120 1,142 1,155 4.215}
{0 CHEMBL417921,6 1,69 1,109 1,110 1,120 1,142 1,155 5.337}
{0 CHEMBL423819,4 1,6 1,69 1,109 1,110 1,120 1,128 1,142 1,155 4.102}
{0 CHEMBL433288,6 1,69 1,75 1,109 1,110 1,120 1,142 1,155 4.77}
{0 CHEMBL433493,6 1,69 1,109 1,110 1,120 1,142 1,155 7.131}
{0 CHEMBL442739,6 1,69 1,73 1,109 1,110 1,120 1,142 1,155 5.444}
{0 CHEMBL444581,6 1,69 1,75 1,109 1,110 1,120 1,142 1,155 4.013}
{0 CHEMBL54434,6 1,69 1,109 1,110 1,120 1,142 1,155 6.886}
{0 CHEMBL54500,6 1,69 1,73 1,109 1,110 1,120 1,142 1,155 5.721}
{0 CHEMBL54906,6 1,69 1,77 1,106 1,109 1,110 1,120 1,142 1,155 6.309}
{0 CHEMBL55205,6 1,69 1,106 1,109 1,110 1,120 1,142 1,155 5.222}
{0 CHEMBL55206,6 1,69 1,109 1,110 1,120 1,142 1,155 5.276}
{0 CHEMBL55767,6 1,69 1,73 1,109 1,110 1,120 1,142 1,155 5.201}
{0 CHEMBL55949,6 1,69 1,109 1,110 1,120 1,142 1,155 6}
{0 CHEMBL610,6 1,58 1,109 1,110 1,155 2.155}
{0 CHEMBL62406,6 1,69 1,109 1,110 1,118 1,120 1,142 1,155 4.509}
{0 CHEMBL63145,6 1,69 1,109 1,120 1,142 1,155 4.208}
{0 CHEMBL63767,6 1,29 1,69 1,109 1,110 1,120 1,142 1,155 4.31}
{0 CHEMBL63907,6 1,69 1,75 1,109 1,110 1,120 1,142 1,155 5.252}
{0 CHEMBL63990,6 1,69 1,109 1,110 1,120 1,142 1,155 6.167}
{0 CHEMBL64937,6 1,69 1,109 1,110 1,120 1,142 1,155 5.824}
{0 CHEMBL65495,6 1,69 1,75 1,109 1,110 1,120 1,142 1,155 4.553}
{0 CHEMBL65523,6 1,69 1,109 1,110 1,120 1,142 1,155 4.921}
{0 CHEMBL65687,6 1,69 1,75 1,109 1,110 1,120 1,142 1,155 4.921}
{0 CHEMBL67018,6 1,69 1,109 1,110 1,120 1,128 1,142 1,155 4.125}
{0 CHEMBL67229,6 1,69 1,75 1,109 1,110 1,120 1,142 1,155 4.328}
{0 CHEMBL67235,6 1,69 1,109 1,110 1,120 1,142 1,155 5.699}
{0 CHEMBL67369,6 1,69 1,109 1,110 1,120 1,142 1,155 5.658}
{0 CHEMBL79575,6 1,34 1,69 1,109 1,110 1,120 1,142 1,155 4.745}
{0 CHEMBL79689,1 1,2 1,4 1,5 1,6 1,63 1,69 1,109 1,110 1,120 1,142 1,155 4.167}
{0 CHEMBL81366,4 1,6 1,69 1,71 1,109 1,110 1,120 1,142 1,155 4.538}
{0 CHEMBL83048,1 1,2 1,3 1,4 1,5 1,6 1,36 1,61 1,69 1,109 1,110 1,120 1,142 1,155 4.06}
{0 CHEMBL83087,6 1,69 1,109 1,110 1,120 1,128 1,142 1,155 4.638}
