{
  "data_features": {
    "feature": [
      {
        "data_type": "nominal",
        "index": "0",
        "is_ignore": "false",
        "is_row_identifier": "true",
        "is_target": "false",
        "name": "molecule_id",
        "nominal_value": [
          "CHEMBL1054",
          "CHEMBL1055",
          "CHEMBL1142",
          "CHEMBL116438",
          "CHEMBL118",
          "CHEMBL118903",
          "CHEMBL119296",
          "CHEMBL1209038",
          "CHEMBL1209039",
          "CHEMBL1214193",
          "CHEMBL1214194",
          "CHEMBL1214195",
          "CHEMBL1214248",
          "CHEMBL122708",
          "CHEMBL1356238",
          "CHEMBL1401508",
          "CHEMBL1414",
          "CHEMBL145",
          "CHEMBL145781",
          "CHEMBL153094",
          "CHEMBL15844",
          "CHEMBL165",
          "CHEMBL17",
          "CHEMBL171476",
          "CHEMBL176495",
          "CHEMBL18",
          "CHEMBL1822699",
          "CHEMBL1822700",
          "CHEMBL1822701",
          "CHEMBL1822702",
          "CHEMBL182455",
          "CHEMBL183419",
          "CHEMBL186422",
          "CHEMBL186537",
          "CHEMBL189526",
          "CHEMBL19",
          "CHEMBL190447",
          "CHEMBL191045",
          "CHEMBL191528",
          "CHEMBL1946085",
          "CHEMBL1946086",
          "CHEMBL1946087",
          "CHEMBL1946088",
          "CHEMBL1946177",
          "CHEMBL1946178",
          "CHEMBL1946184",
          "CHEMBL1955873",
          "CHEMBL1956578",
          "CHEMBL1956579",
          "CHEMBL19612",
          "CHEMBL20",
          "CHEMBL2016670",
          "CHEMBL2019140",
          "CHEMBL2019143",
          "CHEMBL2019155",
          "CHEMBL2040866",
          "CHEMBL2042368",
          "CHEMBL2042369",
          "CHEMBL2042370",
          "CHEMBL2042371",
          "CHEMBL206452",
          "CHEMBL2092896",
          "CHEMBL2092897",
          "CHEMBL21",
          "CHEMBL21485",
          "CHEMBL2179304",
          "CHEMBL2179305",
          "CHEMBL2179306",
          "CHEMBL2179307",
          "CHEMBL2179308",
          "CHEMBL218490",
          "CHEMBL220491",
          "CHEMBL220492",
          "CHEMBL23194",
          "CHEMBL2323134",
          "CHEMBL2323135",
          "CHEMBL2323136",
          "CHEMBL2323137",
          "CHEMBL2323138",
          "CHEMBL2323139",
          "CHEMBL2323140",
          "CHEMBL24261",
          "CHEMBL25101",
          "CHEMBL251680",
          "CHEMBL253691",
          "CHEMBL255863",
          "CHEMBL26",
          "CHEMBL261219",
          "CHEMBL262628",
          "CHEMBL265674",
          "CHEMBL266026",
          "CHEMBL266240",
          "CHEMBL268177",
          "CHEMBL268439",
          "CHEMBL27601",
          "CHEMBL286738",
          "CHEMBL288114",
          "CHEMBL303004",
          "CHEMBL303429",
          "CHEMBL307145",
          "CHEMBL310671",
          "CHEMBL32749",
          "CHEMBL328560",
          "CHEMBL35",
          "CHEMBL352535",
          "CHEMBL355001",
          "CHEMBL360356",
          "CHEMBL364571",
          "CHEMBL374829",
          "CHEMBL37537",
          "CHEMBL406",
          "CHEMBL414",
          "CHEMBL418",
          "CHEMBL419",
          "CHEMBL424",
          "CHEMBL441343",
          "CHEMBL455271",
          "CHEMBL456724",
          "CHEMBL464987",
          "CHEMBL476937",
          "CHEMBL477748",
          "CHEMBL490356",
          "CHEMBL49732",
          "CHEMBL50",
          "CHEMBL506166",
          "CHEMBL506247",
          "CHEMBL550572",
          "CHEMBL560175",
          "CHEMBL567139",
          "CHEMBL567896",
          "CHEMBL568173",
          "CHEMBL568348",
          "CHEMBL568385",
          "CHEMBL568416",
          "CHEMBL568417",
          "CHEMBL568516",
          "CHEMBL571514",
          "CHEMBL571738",
          "CHEMBL572366",
          "CHEMBL574",
          "CHEMBL577123",
          "CHEMBL578167",
          "CHEMBL58323",
          "CHEMBL593037",
          "CHEMBL593276",
          "CHEMBL593507",
          "CHEMBL593667",
          "CHEMBL593759",
          "CHEMBL593972",
          "CHEMBL594224",
          "CHEMBL594918",
          "CHEMBL595861",
          "CHEMBL596060",
          "CHEMBL596276",
          "CHEMBL596277",
          "CHEMBL607813",
          "CHEMBL607823",
          "CHEMBL607824",
          "CHEMBL608978",
          "CHEMBL609",
          "CHEMBL610454",
          "CHEMBL610455",
          "CHEMBL611502",
          "CHEMBL611504",
          "CHEMBL6246",
          "CHEMBL6466",
          "CHEMBL65369",
          "CHEMBL6633",
          "CHEMBL66381",
          "CHEMBL6685",
          "CHEMBL66879",
          "CHEMBL6705",
          "CHEMBL6724",
          "CHEMBL6753",
          "CHEMBL6784",
          "CHEMBL68253",
          "CHEMBL6853",
          "CHEMBL6919",
          "CHEMBL7087",
          "CHEMBL7092",
          "CHEMBL7146",
          "CHEMBL71611",
          "CHEMBL7204",
          "CHEMBL73962",
          "CHEMBL750",
          "CHEMBL77517",
          "CHEMBL83294",
          "CHEMBL865",
          "CHEMBL926",
          "CHEMBL941"
        ],
        "number_of_missing_values": "0"
      },
      {
        "data_type": "numeric",
        "index": "1",
        "is_ignore": "false",
        "is_row_identifier": "false",
        "is_target": "false",
        "name": "N.",
        "number_of_missing_values": "0"
      },
      {
        "data_type": "numeric",
        "index": "2",
        "is_ignore": "false",
        "is_row_identifier": "false",
        "is_target": "false",
        "name": "nN",
        "number_of_missing_values": "0"
      },
      {
        "data_type": "numeric",
        "index": "3",
        "is_ignore": "false",
        "is_row_identifier": "false",
        "is_target": "false",
        "name": "nS",
        "number_of_missing_values": "0"
      },
      {
        "data_type": "numeric",
        "index": "4",
        "is_ignore": "false",
        "is_row_identifier": "false",
        "is_target": "false",
        "name": "C.",
        "number_of_missing_values": "0"
      },
      {
        "data_type": "numeric",
        "index": "5",
        "is_ignore": "false",
        "is_row_identifier": "false",
        "is_target": "false",
        "name": "Mi",
        "number_of_missing_values": "0"
      },
      {
        "data_type": "numeric",
        "index": "6",
        "is_ignore": "false",
        "is_row_identifier": "false",
        "is_target": "false",
        "name": "nCsp2",
        "number_of_missing_values": "0"
      },
      {
        "data_type": "numeric",
        "index": "7",
        "is_ignore": "false",
        "is_row_identifier": "false",
        "is_target": "false",
        "name": "nHM",
        "number_of_missing_values": "0"
      },
      {
        "data_type": "numeric",
        "index": "8",
        "is_ignore": "false",
        "is_row_identifier": "false",
        "is_target": "false",
        "name": "AMW",
        "number_of_missing_values": "0"
      },
      {
        "data_type": "numeric",
        "index": "9",
        "is_ignore": "false",
        "is_row_identifier": "false",
        "is_target": "false",
        "name": "H.",
        "number_of_missing_values": "0"
      },
      {
        "data_type": "numeric",
        "index": "10",
        "is_ignore": "false",
        "is_row_identifier": "false",
        "is_target": "true",
        "name": "pXC50",
        "number_of_missing_values": "0"
      }
    ]
  }
}