{
  "data_set_description": {
    "collection_date": "November 2013",
    "creator": "Dr Jeremy Besnard, Dr Ivan Olier, Dr Noureddin Sadawi, Dr Larisa Soldatova, Dr Crina Grosan, Prof Ross King, Dr Richard Bickerton, Prof Andrew Hopkins and Dr Willem van Hoorn",
    "default_target_attribute": "pXC50",
    "description": "This dataset contains QSAR data (from ChEMBL version 17) showing activity values (unit is pseudo-pCI50) of several compounds on drug target ChEMBL_ID: CHEMBL1255150 (TID: 103561), and it has 47 rows and 43 features (not including molecule IDs and class feature: molecule_id and pXC50). The features represent Basic Molecular Descriptors which were generated from SMILES strings.  Missing value imputation was applied to this dataset (By choosing the Median).",
    "description_version": "1",
    "file_id": "3229832",
    "format": "ARFF",
    "id": "23635",
    "licence": "Public",
    "md5_checksum": "522c37a778fab9809f80e2436e8e21e2",
    "minio_url": "https://data.openml.org/datasets/0002/23635/dataset_23635.pq",
    "name": "QSAR-DATASET-FOR-DRUG-TARGET-CHEMBL1255150",
    "original_data_url": "https://www.ebi.ac.uk/chembl/target/inspect/CHEMBL1255150",
    "parquet_url": "https://data.openml.org/datasets/0002/23635/dataset_23635.pq",
    "processing_date": "2018-10-03 22:34:13",
    "row_id_attribute": "molecule_id",
    "status": "deactivated",
    "tag": [
      "MetaQSAR",
      "study_13"
    ],
    "upload_date": "2016-07-14T12:53:38",
    "url": "https://api.openml.org/data/v1/download/3229832/QSAR-DATASET-FOR-DRUG-TARGET-CHEMBL1255150.arff",
    "version": "7",
    "visibility": "public"
  }
}