"molecule_id","ATS1e","ATS1i","ATS1v","ATS2e","ATS2v","ATS3e","ATS3p","ATS3v","ATS4p","ATS4v","ATS5p","ATS5v","ATS6e","ATS6i","ATS6v","ATS7e","ATS7i","ATS7m","ATS7v","ATS8e","ATS8i","ATS8s","ATS8v","ATSC1i","ATSC2i","ATSC3i","ATSC4i","ATSC5i","ATSC6i","ATSC7i","ATSC8e","ATSC8s","CIC0","CSI","ECC","Eig02_AEA.dm.","Eig07_AEA.dm.","Eig07_EA.ri.","Eig09_AEA.dm.","Eig11_AEA.ed.","Eig11_EA.ri.","Eig12_AEA.ed.","Eig13_EA.ri.","Eig14_AEA.bo.","Eig14_EA.bo.","Eig14_EA.ri.","Eta_C","Eta_L","Eta_sh_x","GATS1e","GATS1p","GATS5v","GATS6v","GATS8m","pXC50"
{1 3.436,2 3.534,3 2.821,4 3.894,5 3.131,6 4.17,7 3.143,8 3.158,9 3.061,10 3.1,11 2.91,12 2.907,13 3.865,14 4.067,15 2.72,16 3.591,17 3.765,18 2.944,19 2.478,20 3.184,21 3.367,22 4.946,23 2.099,24 0.362,25 0.513,26 0.497,27 0.457,28 0.39,29 0.311,30 0.229,31 0.298,32 23.168,33 2.904,34 209,35 108,36 3.385,37 0.619,38 0.576,39 0.5,40 1.391,41 -1.056,42 1,43 -1.477,44 -0.581,45 -2,46 -1.704,47 11.285,48 3.846,50 0.978,51 1.209,52 1.033,53 0.787,54 0.741,55 5.222}
{0 CHEMBL152965,1 3.431,2 3.535,3 2.784,4 3.957,5 3.058,6 4.143,7 3.02,8 2.966,9 2.994,10 2.869,11 2.894,12 2.821,13 3.886,14 4.118,15 2.641,16 3.586,17 3.786,18 2.735,19 2.379,20 3.286,21 3.529,22 4.823,23 2.231,24 0.341,25 0.436,26 0.404,27 0.381,28 0.332,29 0.271,30 0.22,31 0.325,32 30.453,33 2.774,34 217,35 111,36 2.837,37 0.355,38 -0.124,39 -0.951,40 1.49,41 -1.146,42 1.113,43 -1.51,44 -0.703,45 -2.427,46 -1.635,47 10.372,48 3.766,49 0.146,50 1.166,51 1.781,52 1.212,53 0.909,54 0.883,55 6}
{0 CHEMBL153186,1 3.572,2 3.665,3 2.921,4 4.063,5 3.209,6 4.296,7 3.199,8 3.22,9 3.174,10 3.177,11 3.076,12 3.07,13 4.062,14 4.273,15 2.922,16 3.936,17 4.129,18 3.121,19 2.754,20 3.709,21 3.876,22 5.21,23 2.549,24 0.392,25 0.529,26 0.524,27 0.511,28 0.457,29 0.392,30 0.304,31 0.689,32 94.634,33 3.126,34 293,35 150,36 3.385,37 1.211,38 0.564,39 0.5,40 1.586,41 -0.961,42 1.357,43 -1.212,44 -0.118,45 -1.697,46 -1.382,47 12.854,48 4.266,50 0.978,51 1.464,52 1.022,53 1.117,54 1.409,55 4.523}
{0 CHEMBL153545,1 3.415,2 3.518,3 2.84,4 3.929,5 3.128,6 4.113,7 3.191,8 3.061,9 3.135,10 2.923,11 2.996,12 2.869,13 3.87,14 4.101,15 2.706,16 3.579,17 3.778,18 2.742,19 2.39,20 3.286,21 3.529,22 4.823,23 2.231,24 0.408,25 0.58,26 0.526,27 0.503,28 0.426,29 0.382,30 0.259,31 0.306,32 28.877,33 2.64,34 217,35 111,36 3.113,37 0.618,38 -0.117,39 -0.809,40 1.49,41 -1.13,42 1.113,43 -1.509,44 -0.703,45 -2.427,46 -1.562,47 12.281,48 4.537,49 0.136,50 1.155,51 1.441,52 1.099,53 0.889,54 0.681,55 5.155}
{0 CHEMBL155097,1 3.36,2 3.485,3 2.702,4 3.868,5 2.937,6 3.983,7 2.83,8 2.769,9 2.797,10 2.658,11 2.701,12 2.603,13 3.655,14 3.896,15 2.418,16 3.373,17 3.628,18 2.666,19 2.24,20 3.083,21 3.25,22 4.912,23 2.135,24 0.308,25 0.367,26 0.314,27 0.298,28 0.258,29 0.204,30 0.176,31 0.285,32 28.602,33 2.627,34 206,35 105,36 2.681,37 0.286,38 -0.129,39 -1,40 1,41 -1.349,42 0.967,43 -1.613,44 -0.921,45 -2.585,46 -1.795,47 8.667,48 3.349,49 0.155,50 1.209,51 1.781,52 1.139,53 0.963,54 0.758,55 5.301}
{0 CHEMBL356644,1 3.623,2 3.759,3 2.98,4 4.161,5 3.295,6 4.425,7 3.438,8 3.317,9 3.443,10 3.321,11 3.404,12 3.281,13 4.368,14 4.625,15 3.101,16 4.144,17 4.445,18 3.139,19 2.837,20 3.806,21 4.057,22 5.358,23 2.59,24 0.459,25 0.634,26 0.647,27 0.66,28 0.619,29 0.514,30 0.396,31 0.544,32 60.903,33 3.22,34 245,35 126,36 3.097,37 0.618,38 0.577,39 -0.383,40 2,41 -1,42 1.831,43 -1.297,44 -0.118,45 -1.756,46 -1.479,47 14.616,48 4.837,49 0.126,50 1.149,51 1.66,52 0.968,53 1.07,54 1.171,55 5}
{0 CHEMBL357731,1 3.47,2 3.594,3 2.859,4 4.001,5 3.158,6 4.262,7 3.238,8 3.1,9 3.148,10 3.007,11 3.03,12 2.869,13 3.91,14 4.174,15 2.695,16 3.695,17 3.92,18 3.007,19 2.532,20 3.454,21 3.661,22 5.141,23 2.27,24 0.399,25 0.55,26 0.519,27 0.476,28 0.417,29 0.341,30 0.273,31 0.467,32 56.429,33 2.955,34 219,35 112,36 3.097,37 0.418,38 0.241,39 -0.83,40 1.522,41 -1.118,42 1.134,43 -1.483,44 -0.652,45 -2.427,46 -1.755,47 11.904,48 4.383,49 0.142,50 1.134,51 1.647,52 1.028,53 0.893,54 0.878,55 4.097}
{0 CHEMBL358698,1 3.272,2 3.386,3 2.667,4 3.769,5 2.959,6 3.995,7 2.959,8 2.864,9 2.843,10 2.751,11 2.662,12 2.587,13 3.509,14 3.734,15 2.284,16 3.045,17 3.279,18 2.354,19 1.889,20 2.531,21 2.728,22 3.871,23 1.117,24 0.314,25 0.419,26 0.365,27 0.322,28 0.269,29 0.188,30 0.099,31 0.213,32 32.306,33 2.504,34 147,35 76,36 3.051,37 -0.65,38 -0.925,39 -1,40 1,41 -1.476,42 0.828,43 -1.923,47 8.952,48 3.383,49 0.166,50 1.204,51 1.666,52 0.97,53 0.788,54 1.475,55 6.886}
{0 CHEMBL359064,1 3.488,2 3.573,3 2.836,4 3.961,5 3.119,6 4.177,7 3.062,8 3.117,9 3.034,10 3.07,11 2.931,12 2.982,13 3.999,14 4.194,15 2.795,16 3.73,17 3.906,18 2.764,19 2.555,20 3.403,21 3.594,22 5.126,23 2.458,24 0.35,25 0.464,26 0.449,27 0.433,28 0.379,29 0.313,30 0.255,31 0.361,32 37.965,33 2.94,34 249,35 128,36 3.385,37 1.02,38 0.564,39 0.5,40 1.586,41 -0.961,42 1.116,43 -1.321,44 -0.162,45 -1.954,46 -1.509,47 11.319,48 3.778,50 1.017,51 1.461,52 1.212,53 0.981,54 0.49,55 4}
{0 CHEMBL50542,1 3.273,2 3.383,3 2.655,4 3.779,5 2.949,6 4.001,7 2.975,8 2.874,9 2.865,10 2.773,11 2.665,12 2.583,13 3.459,14 3.719,15 2.313,16 3.042,17 3.208,18 2.361,19 1.914,20 2.36,21 2.627,22 3.466,23 0.967,24 0.31,25 0.414,26 0.371,27 0.327,28 0.266,29 0.202,30 0.092,31 0.147,32 21.199,33 2.504,34 147,35 76,36 2.734,37 -0.163,38 -0.506,39 -1,40 1.103,41 -1.508,42 1,43 -1.887,47 8.662,48 3.246,49 0.166,50 1.186,51 1.729,52 0.979,53 0.776,54 1.066,55 6.222}
