{
  "data_features": {
    "feature": [
      {
        "data_type": "nominal",
        "index": "0",
        "is_ignore": "false",
        "is_row_identifier": "true",
        "is_target": "false",
        "name": "molecule_id",
        "nominal_value": [
          "CHEMBL1201283",
          "CHEMBL200140",
          "CHEMBL200398",
          "CHEMBL200667",
          "CHEMBL224199",
          "CHEMBL224563",
          "CHEMBL375048",
          "CHEMBL382272",
          "CHEMBL387665",
          "CHEMBL426184",
          "CHEMBL458612",
          "CHEMBL499811",
          "CHEMBL501231",
          "CHEMBL501259",
          "CHEMBL505526",
          "CHEMBL534488",
          "CHEMBL535159",
          "CHEMBL535384",
          "CHEMBL537642",
          "CHEMBL537645",
          "CHEMBL537865",
          "CHEMBL537866",
          "CHEMBL538329"
        ],
        "number_of_missing_values": "0"
      },
      {
        "data_type": "numeric",
        "index": "1",
        "is_ignore": "false",
        "is_row_identifier": "false",
        "is_target": "false",
        "name": "Mi",
        "number_of_missing_values": "0"
      },
      {
        "data_type": "numeric",
        "index": "2",
        "is_ignore": "false",
        "is_row_identifier": "false",
        "is_target": "false",
        "name": "N.",
        "number_of_missing_values": "0"
      },
      {
        "data_type": "numeric",
        "index": "3",
        "is_ignore": "false",
        "is_row_identifier": "false",
        "is_target": "true",
        "name": "pXC50",
        "number_of_missing_values": "0"
      }
    ]
  }
}