"molecule_id","FCFP4_1024b695","FCFP4_1024b389","FCFP4_1024b441","FCFP4_1024b397","FCFP4_1024b52","FCFP4_1024b749","FCFP4_1024b227","FCFP4_1024b514","FCFP4_1024b648","FCFP4_1024b995","FCFP4_1024b1","FCFP4_1024b10","FCFP4_1024b100","FCFP4_1024b1000","FCFP4_1024b1001","FCFP4_1024b1002","FCFP4_1024b1003","FCFP4_1024b1004","FCFP4_1024b1005","FCFP4_1024b1006","FCFP4_1024b1007","FCFP4_1024b1008","FCFP4_1024b1009","FCFP4_1024b101","FCFP4_1024b1010","FCFP4_1024b1011","FCFP4_1024b1012","FCFP4_1024b1013","FCFP4_1024b1014","FCFP4_1024b1015","FCFP4_1024b1016","FCFP4_1024b1017","FCFP4_1024b1018","FCFP4_1024b1019","FCFP4_1024b102","FCFP4_1024b1020","FCFP4_1024b1021","FCFP4_1024b1022","FCFP4_1024b1023","FCFP4_1024b1024","FCFP4_1024b103","FCFP4_1024b104","FCFP4_1024b105","FCFP4_1024b106","FCFP4_1024b107","FCFP4_1024b108","FCFP4_1024b109","FCFP4_1024b11","FCFP4_1024b110","FCFP4_1024b111","FCFP4_1024b112","pXC50"
{11 1,52 4.578}
{0 CHEMBL109227,11 1,52 6.699}
{0 CHEMBL113381,11 1,45 1,52 7.097}
{0 CHEMBL1160008,11 1,25 1,52 5.523}
{0 CHEMBL1160160,11 1,52 4.796}
{0 CHEMBL1160166,11 1,52 4.097}
{0 CHEMBL1206880,7 1,11 1,33 1,52 6.745}
{0 CHEMBL121924,11 1,28 1,37 1,52 4.337}
{0 CHEMBL1221,11 1,52 4.699}
{0 CHEMBL122209,11 1,28 1,52 4.215}
{0 CHEMBL1222313,11 1,25 1,45 1,52 6}
{0 CHEMBL122450,9 1,10 1,11 1,46 1,52 8.699}
{0 CHEMBL1239,11 1,52 4.046}
{0 CHEMBL124416,9 1,10 1,11 1,46 1,52 8.699}
{0 CHEMBL124855,11 1,52 4.301}
{0 CHEMBL127782,3 1,4 1,5 1,6 1,8 1,11 1,52 7.509}
{0 CHEMBL128523,1 1,2 1,3 1,4 1,5 1,6 1,7 1,8 1,11 1,52 4}
{0 CHEMBL129090,1 1,2 1,3 1,4 1,5 1,6 1,7 1,8 1,11 1,17 1,52 4}
{0 CHEMBL129226,1 1,2 1,3 1,4 1,5 1,6 1,7 1,8 1,11 1,52 4}
{0 CHEMBL129651,1 1,2 1,3 1,4 1,5 1,6 1,7 1,8 1,11 1,52 4}
{0 CHEMBL130187,1 1,2 1,3 1,4 1,5 1,6 1,7 1,8 1,11 1,17 1,45 1,52 4}
{0 CHEMBL130854,1 1,2 1,3 1,4 1,5 1,6 1,7 1,8 1,11 1,52 4}
{0 CHEMBL1394467,11 1,25 1,34 1,36 1,52 4.77}
{0 CHEMBL1396011,11 1,25 1,34 1,36 1,52 4.921}
{0 CHEMBL139713,11 1,52 5.796}
{0 CHEMBL139725,11 1,52 4.597}
{0 CHEMBL139928,11 1,46 1,52 5.377}
{0 CHEMBL140254,11 1,34 1,52 5.538}
{0 CHEMBL140467,11 1,52 5.155}
{0 CHEMBL140723,11 1,20 1,52 5.578}
{0 CHEMBL140740,11 1,45 1,52 5.594}
{0 CHEMBL140747,11 1,34 1,46 1,52 5.229}
{0 CHEMBL140780,11 1,52 5.268}
{0 CHEMBL140916,11 1,52 5.409}
{0 CHEMBL141079,11 1,52 5.071}
{0 CHEMBL141272,11 1,52 5.301}
{0 CHEMBL141313,11 1,52 4.272}
{0 CHEMBL142083,11 1,52 4}
{0 CHEMBL142592,11 1,52 5.699}
{0 CHEMBL143399,11 1,52 6.44}
{0 CHEMBL1436305,11 1,25 1,34 1,36 1,52 4.77}
{0 CHEMBL143654,11 1,52 5.523}
{0 CHEMBL1439,11 1,28 1,52 4.298}
{0 CHEMBL143927,11 1,20 1,52 4.801}
{0 CHEMBL1484,11 1,12 1,52 4.699}
{0 CHEMBL1573229,11 1,13 1,25 1,34 1,36 1,52 4.959}
{0 CHEMBL1591906,11 1,25 1,34 1,36 1,52 4.824}
{0 CHEMBL16223,11 1,36 1,52 4}
{0 CHEMBL1627394,11 1,52 5.301}
{0 CHEMBL1628078,11 1,23 1,45 1,52 5.301}
{0 CHEMBL16958,11 1,52 5.097}
{0 CHEMBL175189,11 1,52 6.921}
{0 CHEMBL177772,11 1,52 5.796}
{0 CHEMBL177912,11 1,52 4.991}
{0 CHEMBL179782,11 1,52 6.155}
{0 CHEMBL180481,11 1,52 5.745}
{0 CHEMBL180679,11 1,52 6.347}
{0 CHEMBL181590,11 1,52 5.523}
{0 CHEMBL181804,11 1,52 5.456}
{0 CHEMBL182522,11 1,52 6.155}
{0 CHEMBL182644,11 1,52 5.824}
{0 CHEMBL184695,11 1,52 6.523}
{0 CHEMBL184830,11 1,36 1,52 5.569}
{0 CHEMBL184890,11 1,52 5.699}
{0 CHEMBL184984,11 1,52 6.046}
{0 CHEMBL192600,11 1,25 1,45 1,52 4.222}
{0 CHEMBL2068465,11 1,17 1,36 1,52 7.699}
{0 CHEMBL2079714,1 1,2 1,3 1,4 1,5 1,6 1,7 1,8 1,11 1,52 6.155}
{0 CHEMBL20852,11 1,36 1,52 5.137}
{0 CHEMBL20866,11 1,52 5.444}
{0 CHEMBL20945,11 1,52 5.536}
{0 CHEMBL21427,11 1,52 5.229}
{0 CHEMBL21485,11 1,52 4.979}
{0 CHEMBL226664,11 1,45 1,52 4.549}
{0 CHEMBL227512,11 1,45 1,52 4.44}
{0 CHEMBL227726,11 1,45 1,52 4.533}
{0 CHEMBL24235,11 1,52 5.125}
{0 CHEMBL24275,8 1,11 1,52 5.102}
{0 CHEMBL24351,8 1,11 1,52 4.374}
{0 CHEMBL24878,11 1,52 5.119}
{0 CHEMBL25644,11 1,26 1,52 7}
{0 CHEMBL25766,11 1,52 4.979}
{0 CHEMBL261377,11 1,25 1,34 1,36 1,52 4.77}
{0 CHEMBL26275,8 1,11 1,52 5.854}
{0 CHEMBL263746,9 1,10 1,11 1,41 1,46 1,52 8.301}
{0 CHEMBL263882,11 1,52 5.18}
{0 CHEMBL265722,11 1,52 4.181}
{0 CHEMBL267626,11 1,12 1,52 4}
{0 CHEMBL267627,11 1,17 1,36 1,52 4.77}
{0 CHEMBL267863,11 1,36 1,52 5.854}
{0 CHEMBL269471,11 1,12 1,52 6.553}
{0 CHEMBL277225,11 1,26 1,52 5.426}
{0 CHEMBL277857,11 1,52 4.017}
{0 CHEMBL289526,9 1,10 1,11 1,37 1,52 4.732}
{0 CHEMBL289979,9 1,10 1,11 1,31 1,37 1,52 6.583}
{0 CHEMBL290072,9 1,10 1,11 1,31 1,37 1,52 5.854}
{0 CHEMBL295322,9 1,10 1,11 1,31 1,37 1,52 8.027}
{0 CHEMBL295625,9 1,10 1,11 1,37 1,52 5.74}
{0 CHEMBL296455,11 1,45 1,52 5}
{0 CHEMBL296738,9 1,10 1,11 1,37 1,52 5.039}
{0 CHEMBL297253,9 1,10 1,11 1,31 1,37 1,45 1,52 5.369}
{0 CHEMBL297671,9 1,10 1,11 1,37 1,52 5.973}
{0 CHEMBL297805,9 1,10 1,11 1,31 1,37 1,52 8.119}
{0 CHEMBL298301,11 1,52 5.523}
{0 CHEMBL298653,11 1,17 1,45 1,52 4.824}
{0 CHEMBL31962,11 1,52 4}
{0 CHEMBL320049,11 1,52 6.495}
{0 CHEMBL324688,11 1,52 6.824}
{0 CHEMBL331090,9 1,10 1,11 1,41 1,46 1,52 8.222}
{0 CHEMBL332565,11 1,28 1,52 5.569}
{0 CHEMBL333330,11 1,28 1,52 4.347}
{0 CHEMBL334931,11 1,52 6.301}
{0 CHEMBL334932,11 1,52 5.42}
{0 CHEMBL336239,11 1,34 1,52 5.63}
{0 CHEMBL336630,1 1,2 1,3 1,4 1,5 1,6 1,7 1,8 1,11 1,17 1,52 4}
{0 CHEMBL338157,1 1,2 1,3 1,4 1,5 1,6 1,7 1,8 1,11 1,17 1,45 1,52 5.398}
{0 CHEMBL338351,1 1,2 1,3 1,4 1,5 1,6 1,7 1,8 1,11 1,17 1,45 1,52 4}
{0 CHEMBL338933,1 1,2 1,3 1,4 1,5 1,6 1,7 1,8 1,11 1,45 1,52 4.101}
{0 CHEMBL339600,1 1,2 1,3 1,4 1,5 1,6 1,7 1,8 1,11 1,17 1,45 1,52 4}
{0 CHEMBL34034,48 1,52 4.745}
{0 CHEMBL340351,3 1,4 1,5 1,6 1,8 1,11 1,52 6.292}
{0 CHEMBL340423,1 1,2 1,3 1,4 1,5 1,6 1,7 1,8 1,11 1,52 4}
{0 CHEMBL340707,3 1,4 1,5 1,6 1,8 1,11 1,40 1,52 7.456}
{0 CHEMBL340937,1 1,2 1,3 1,4 1,5 1,6 1,7 1,8 1,11 1,52 4}
{0 CHEMBL341484,1 1,2 1,3 1,4 1,5 1,6 1,7 1,8 1,11 1,17 1,52 4}
{0 CHEMBL341496,1 1,2 1,3 1,4 1,5 1,6 1,7 1,8 1,11 1,52 4}
{0 CHEMBL341722,11 1,52 4.656}
{0 CHEMBL342173,11 1,52 6.108}
{0 CHEMBL34241,11 1,46 1,52 4.399}
{0 CHEMBL342460,11 1,52 4.963}
{0 CHEMBL344890,11 1,52 5.194}
{0 CHEMBL34712,52 5.301}
{0 CHEMBL34964,11 1,52 6.699}
{0 CHEMBL359901,11 1,52 5.301}
{0 CHEMBL366099,11 1,52 6}
{0 CHEMBL366664,7 1,11 1,33 1,52 7.167}
{0 CHEMBL368033,11 1,52 5.523}
{0 CHEMBL370041,11 1,25 1,45 1,52 4.194}
{0 CHEMBL370761,11 1,45 1,52 4.854}
{0 CHEMBL371148,11 1,45 1,52 4.032}
{0 CHEMBL372227,11 1,45 1,52 4.585}
{0 CHEMBL375228,11 1,52 4.71}
{0 CHEMBL390789,11 1,47 1,52 4.658}
{0 CHEMBL403,11 1,28 1,52 4.181}
{0 CHEMBL404,11 1,28 1,52 4.198}
{0 CHEMBL405886,11 1,25 1,34 1,36 1,52 5.301}
{0 CHEMBL412073,11 1,26 1,40 1,52 5.155}
{0 CHEMBL415234,1 1,2 1,3 1,4 1,5 1,6 1,8 1,11 1,52 4}
{0 CHEMBL415532,11 1,52 4.921}
{0 CHEMBL415918,9 1,10 1,11 1,31 1,37 1,52 5.114}
{0 CHEMBL416447,9 1,10 1,11 1,12 1,16 1,31 1,37 1,52 7.276}
{0 CHEMBL416561,11 1,52 5.673}
{0 CHEMBL420168,11 1,52 5}
{0 CHEMBL421765,11 1,25 1,34 1,52 4}
{0 CHEMBL42528,9 1,10 1,11 1,37 1,52 7.921}
{0 CHEMBL428611,11 1,25 1,34 1,36 1,52 4.854}
{0 CHEMBL429694,11 1,36 1,52 5.409}
{0 CHEMBL430923,11 1,52 5.301}
{0 CHEMBL43955,9 1,10 1,11 1,31 1,37 1,52 6.62}
{0 CHEMBL44274,9 1,10 1,11 1,31 1,37 1,52 5.799}
{0 CHEMBL44278,9 1,10 1,11 1,31 1,37 1,45 1,52 6.959}
{0 CHEMBL44588,9 1,10 1,11 1,31 1,37 1,52 5.377}
{0 CHEMBL44754,9 1,10 1,11 1,31 1,37 1,52 6.409}
{0 CHEMBL44813,9 1,10 1,11 1,31 1,37 1,52 7.108}
{0 CHEMBL44932,9 1,10 1,11 1,23 1,31 1,37 1,52 8.081}
{0 CHEMBL45084,9 1,10 1,11 1,37 1,52 5.893}
{0 CHEMBL45136,9 1,10 1,11 1,37 1,52 6.102}
{0 CHEMBL45273,9 1,10 1,11 1,37 1,52 5.451}
{0 CHEMBL45343,11 1,52 5}
{0 CHEMBL45494,11 1,25 1,52 5.699}
{0 CHEMBL45841,11 1,25 1,52 5.097}
{0 CHEMBL45981,11 1,13 1,34 1,45 1,52 5.398}
{0 CHEMBL46040,11 1,52 5.523}
{0 CHEMBL46202,11 1,25 1,52 5.301}
{0 CHEMBL46478,9 1,10 1,11 1,37 1,52 5.735}
{0 CHEMBL46666,11 1,49 1,52 5}
{0 CHEMBL46958,9 1,10 1,11 1,31 1,37 1,52 4.981}
{0 CHEMBL47173,11 1,37 1,45 1,52 5.699}
{0 CHEMBL47198,9 1,10 1,11 1,23 1,31 1,37 1,52 7.154}
{0 CHEMBL47606,11 1,25 1,52 4.301}
{0 CHEMBL47626,11 1,52 4.824}
{0 CHEMBL47808,52 4.824}
{0 CHEMBL48334,2 1,11 1,52 5.523}
{0 CHEMBL48412,11 1,13 1,25 1,52 5.398}
{0 CHEMBL48561,11 1,23 1,52 5}
{0 CHEMBL48760,11 1,45 1,52 5.222}
{0 CHEMBL49498,11 1,21 1,45 1,52 5.699}
{0 CHEMBL49869,11 1,21 1,45 1,52 6.301}
{0 CHEMBL50,11 1,39 1,52 5.398}
{0 CHEMBL50656,11 1,52 4.523}
{0 CHEMBL51483,3 1,11 1,52 4.212}
{0 CHEMBL593,11 1,45 1,52 4.046}
{0 CHEMBL606647,11 1,52 4.602}
{0 CHEMBL6220,11 1,52 5.469}
{0 CHEMBL6221,11 1,52 4.194}
{0 CHEMBL6261,11 1,52 5.284}
{0 CHEMBL6281,11 1,52 5.638}
{0 CHEMBL6286,11 1,52 4.77}
{0 CHEMBL6292,11 1,52 5.523}
{0 CHEMBL6301,11 1,52 4}
{0 CHEMBL6309,11 1,52 4.538}
{0 CHEMBL6311,11 1,52 4.398}
{0 CHEMBL6461,11 1,12 1,28 1,52 5.689}
{0 CHEMBL6469,11 1,12 1,52 6.569}
{0 CHEMBL6533,11 1,52 6.444}
{0 CHEMBL6678,11 1,17 1,36 1,52 6.553}
{0 CHEMBL777,11 1,52 7.824}
{0 CHEMBL808,11 1,52 4.602}
{0 CHEMBL81556,11 1,52 4}
{0 CHEMBL82324,11 1,25 1,52 5.538}
{0 CHEMBL84953,11 1,52 4}
{0 CHEMBL87686,11 1,36 1,46 1,52 5.004}
{0 CHEMBL91,11 1,52 4.398}
