{
  "data_features": {
    "feature": [
      {
        "data_type": "nominal",
        "index": "0",
        "is_ignore": "false",
        "is_row_identifier": "true",
        "is_target": "false",
        "name": "molecule_id",
        "nominal_value": [
          "CHEMBL2338554",
          "CHEMBL255387",
          "CHEMBL303031",
          "CHEMBL303944",
          "CHEMBL304368",
          "CHEMBL304727",
          "CHEMBL305293",
          "CHEMBL305418",
          "CHEMBL306381",
          "CHEMBL306449",
          "CHEMBL306860",
          "CHEMBL428244",
          "CHEMBL436855",
          "CHEMBL68970",
          "CHEMBL69027",
          "CHEMBL69424",
          "CHEMBL69482",
          "CHEMBL70602",
          "CHEMBL71493",
          "CHEMBL71654",
          "CHEMBL71937"
        ],
        "number_of_missing_values": "0"
      },
      {
        "data_type": "numeric",
        "index": "1",
        "is_ignore": "false",
        "is_row_identifier": "false",
        "is_target": "false",
        "name": "AMW",
        "number_of_missing_values": "0"
      },
      {
        "data_type": "numeric",
        "index": "2",
        "is_ignore": "false",
        "is_row_identifier": "false",
        "is_target": "false",
        "name": "C.",
        "number_of_missing_values": "0"
      },
      {
        "data_type": "numeric",
        "index": "3",
        "is_ignore": "false",
        "is_row_identifier": "false",
        "is_target": "true",
        "name": "pXC50",
        "number_of_missing_values": "0"
      }
    ]
  }
}