{
  "data_features": {
    "feature": [
      {
        "data_type": "nominal",
        "index": "0",
        "is_ignore": "false",
        "is_row_identifier": "true",
        "is_target": "false",
        "name": "molecule_id",
        "nominal_value": [
          "CHEMBL100109",
          "CHEMBL100187",
          "CHEMBL100569",
          "CHEMBL101027",
          "CHEMBL101067",
          "CHEMBL101261",
          "CHEMBL101343",
          "CHEMBL101559",
          "CHEMBL101672",
          "CHEMBL101707",
          "CHEMBL101726",
          "CHEMBL101759",
          "CHEMBL101878",
          "CHEMBL102002",
          "CHEMBL102141",
          "CHEMBL102148",
          "CHEMBL102552",
          "CHEMBL103649",
          "CHEMBL104157",
          "CHEMBL104192",
          "CHEMBL104241",
          "CHEMBL104426",
          "CHEMBL104472",
          "CHEMBL104731",
          "CHEMBL104815",
          "CHEMBL104872",
          "CHEMBL104930",
          "CHEMBL104970",
          "CHEMBL105439",
          "CHEMBL105569",
          "CHEMBL106079",
          "CHEMBL106111",
          "CHEMBL106718",
          "CHEMBL107132",
          "CHEMBL107188",
          "CHEMBL107282",
          "CHEMBL107392",
          "CHEMBL107429",
          "CHEMBL107522",
          "CHEMBL107627",
          "CHEMBL107743",
          "CHEMBL107911",
          "CHEMBL11501",
          "CHEMBL11585",
          "CHEMBL1159675",
          "CHEMBL1160093",
          "CHEMBL1160095",
          "CHEMBL1160099",
          "CHEMBL1160100",
          "CHEMBL1160107",
          "CHEMBL1160114",
          "CHEMBL1160116",
          "CHEMBL1160127",
          "CHEMBL1160130",
          "CHEMBL1160522",
          "CHEMBL1161244",
          "CHEMBL1161245",
          "CHEMBL1161247",
          "CHEMBL1161248",
          "CHEMBL1161250",
          "CHEMBL1161253",
          "CHEMBL1161255",
          "CHEMBL1161256",
          "CHEMBL1161260",
          "CHEMBL1161263",
          "CHEMBL11659",
          "CHEMBL1166",
          "CHEMBL1169703",
          "CHEMBL1171655",
          "CHEMBL1172717",
          "CHEMBL1173124",
          "CHEMBL11929",
          "CHEMBL129157",
          "CHEMBL129208",
          "CHEMBL1299478",
          "CHEMBL1299980",
          "CHEMBL1302696",
          "CHEMBL1302889",
          "CHEMBL1303333",
          "CHEMBL1305574",
          "CHEMBL1306471",
          "CHEMBL1306521",
          "CHEMBL1306844",
          "CHEMBL1306897",
          "CHEMBL1307663",
          "CHEMBL1308055",
          "CHEMBL1308195",
          "CHEMBL1309895",
          "CHEMBL1313324",
          "CHEMBL1313755",
          "CHEMBL1315298",
          "CHEMBL1316089",
          "CHEMBL1316472",
          "CHEMBL1317897",
          "CHEMBL1318608",
          "CHEMBL1320535",
          "CHEMBL1320702",
          "CHEMBL1325757",
          "CHEMBL1325818",
          "CHEMBL1326271",
          "CHEMBL1326349",
          "CHEMBL1327091",
          "CHEMBL1328104",
          "CHEMBL1329487",
          "CHEMBL1332854",
          "CHEMBL1333181",
          "CHEMBL1333858",
          "CHEMBL1334755",
          "CHEMBL1335064",
          "CHEMBL1336784",
          "CHEMBL1336874",
          "CHEMBL1337267",
          "CHEMBL1339485",
          "CHEMBL1340228",
          "CHEMBL1340766",
          "CHEMBL1342085",
          "CHEMBL1342836",
          "CHEMBL1343166",
          "CHEMBL1343853",
          "CHEMBL1343966",
          "CHEMBL1344023",
          "CHEMBL1345800",
          "CHEMBL1345911",
          "CHEMBL1346025",
          "CHEMBL1346724",
          "CHEMBL1347547",
          "CHEMBL1347610",
          "CHEMBL1348946",
          "CHEMBL1350299",
          "CHEMBL135041",
          "CHEMBL1350703",
          "CHEMBL1351250",
          "CHEMBL1351704",
          "CHEMBL1351925",
          "CHEMBL135198",
          "CHEMBL1352624",
          "CHEMBL1354909",
          "CHEMBL135815",
          "CHEMBL135998",
          "CHEMBL1360824",
          "CHEMBL1361742",
          "CHEMBL1361889",
          "CHEMBL1362445",
          "CHEMBL1362650",
          "CHEMBL1363662",
          "CHEMBL1364454",
          "CHEMBL1364731",
          "CHEMBL1365706",
          "CHEMBL1366112",
          "CHEMBL1366289",
          "CHEMBL136647",
          "CHEMBL1367703",
          "CHEMBL1369893",
          "CHEMBL137311",
          "CHEMBL1375551",
          "CHEMBL1376556",
          "CHEMBL137780",
          "CHEMBL1378569",
          "CHEMBL1378952",
          "CHEMBL1381264",
          "CHEMBL1381406",
          "CHEMBL1381815",
          "CHEMBL1383972",
          "CHEMBL1384373",
          "CHEMBL1384550",
          "CHEMBL1385587",
          "CHEMBL138568",
          "CHEMBL1387744",
          "CHEMBL1388156",
          "CHEMBL138905",
          "CHEMBL1393151",
          "CHEMBL139490",
          "CHEMBL139548",
          "CHEMBL139606",
          "CHEMBL1396811",
          "CHEMBL139718",
          "CHEMBL1398357",
          "CHEMBL139840",
          "CHEMBL139910",
          "CHEMBL139980",
          "CHEMBL140066",
          "CHEMBL140090",
          "CHEMBL140148",
          "CHEMBL1401522",
          "CHEMBL1402117",
          "CHEMBL140276",
          "CHEMBL1403497",
          "CHEMBL140359",
          "CHEMBL1404120",
          "CHEMBL140466",
          "CHEMBL140469",
          "CHEMBL1405120",
          "CHEMBL1406738",
          "CHEMBL140686",
          "CHEMBL140764",
          "CHEMBL140911",
          "CHEMBL1409822",
          "CHEMBL1410870",
          "CHEMBL1410895",
          "CHEMBL1411168",
          "CHEMBL1411673",
          "CHEMBL1412423",
          "CHEMBL141347",
          "CHEMBL1414362",
          "CHEMBL1414513",
          "CHEMBL141584",
          "CHEMBL1416348",
          "CHEMBL141782",
          "CHEMBL141834",
          "CHEMBL1418430",
          "CHEMBL1420113",
          "CHEMBL1421745",
          "CHEMBL142241",
          "CHEMBL1422472",
          "CHEMBL1422807",
          "CHEMBL142312",
          "CHEMBL142417",
          "CHEMBL142447",
          "CHEMBL1425576",
          "CHEMBL1427330",
          "CHEMBL142747",
          "CHEMBL1427486",
          "CHEMBL142760",
          "CHEMBL1427763",
          "CHEMBL1428264",
          "CHEMBL1428997",
          "CHEMBL142924",
          "CHEMBL1429479",
          "CHEMBL143067",
          "CHEMBL1431851",
          "CHEMBL1431909",
          "CHEMBL143203",
          "CHEMBL143205",
          "CHEMBL143226",
          "CHEMBL1433546",
          "CHEMBL143412",
          "CHEMBL1434377",
          "CHEMBL1434555",
          "CHEMBL143501",
          "CHEMBL143594",
          "CHEMBL1437190",
          "CHEMBL1438210",
          "CHEMBL1438370",
          "CHEMBL1438503",
          "CHEMBL143896",
          "CHEMBL143910",
          "CHEMBL1439933",
          "CHEMBL1443088",
          "CHEMBL1443805",
          "CHEMBL1444386",
          "CHEMBL1445488",
          "CHEMBL1446094",
          "CHEMBL1447158",
          "CHEMBL144847",
          "CHEMBL1448606",
          "CHEMBL144993",
          "CHEMBL1450813",
          "CHEMBL145108",
          "CHEMBL1451107",
          "CHEMBL145132",
          "CHEMBL145148",
          "CHEMBL145173",
          "CHEMBL145206",
          "CHEMBL145211",
          "CHEMBL1452158",
          "CHEMBL145223",
          "CHEMBL145250",
          "CHEMBL1452939",
          "CHEMBL1453126",
          "CHEMBL145343",
          "CHEMBL1454680",
          "CHEMBL145504",
          "CHEMBL145517",
          "CHEMBL145630",
          "CHEMBL145655",
          "CHEMBL145664",
          "CHEMBL145741",
          "CHEMBL145795",
          "CHEMBL1458593",
          "CHEMBL1459808",
          "CHEMBL1460470",
          "CHEMBL1460857",
          "CHEMBL1460896",
          "CHEMBL1461270",
          "CHEMBL1461524",
          "CHEMBL1463203",
          "CHEMBL1464805",
          "CHEMBL146492",
          "CHEMBL1467881",
          "CHEMBL1468383",
          "CHEMBL1469245",
          "CHEMBL1470199",
          "CHEMBL1471965",
          "CHEMBL1471990",
          "CHEMBL1473121",
          "CHEMBL1474528",
          "CHEMBL1479139",
          "CHEMBL1480073",
          "CHEMBL1480262",
          "CHEMBL1480510",
          "CHEMBL1481077",
          "CHEMBL1481605",
          "CHEMBL1481627",
          "CHEMBL1482670",
          "CHEMBL1482795",
          "CHEMBL1482926",
          "CHEMBL148317",
          "CHEMBL1484595",
          "CHEMBL1484632",
          "CHEMBL1486214",
          "CHEMBL1486470",
          "CHEMBL1487024",
          "CHEMBL1491016",
          "CHEMBL1491272",
          "CHEMBL1492305",
          "CHEMBL1492565",
          "CHEMBL1493011",
          "CHEMBL1497338",
          "CHEMBL1497731",
          "CHEMBL1498705",
          "CHEMBL1501577",
          "CHEMBL1501743",
          "CHEMBL1503793",
          "CHEMBL1504166",
          "CHEMBL1505300",
          "CHEMBL1509380",
          "CHEMBL1509590",
          "CHEMBL1509867",
          "CHEMBL1509913",
          "CHEMBL1511181",
          "CHEMBL1518206",
          "CHEMBL1518982",
          "CHEMBL1520551",
          "CHEMBL1522018",
          "CHEMBL1525735",
          "CHEMBL1526150",
          "CHEMBL1526763",
          "CHEMBL1528327",
          "CHEMBL1528476",
          "CHEMBL1528977",
          "CHEMBL1529328",
          "CHEMBL1531824",
          "CHEMBL1532025",
          "CHEMBL1532956",
          "CHEMBL153334",
          "CHEMBL1534006",
          "CHEMBL153412",
          "CHEMBL1535349",
          "CHEMBL153565",
          "CHEMBL1536896",
          "CHEMBL153732",
          "CHEMBL1537775",
          "CHEMBL1537781",
          "CHEMBL1537847",
          "CHEMBL1538250",
          "CHEMBL1538322",
          "CHEMBL1538897",
          "CHEMBL1540680",
          "CHEMBL1541480",
          "CHEMBL1542128",
          "CHEMBL1543841",
          "CHEMBL1544407",
          "CHEMBL1545689",
          "CHEMBL1545846",
          "CHEMBL1545927",
          "CHEMBL1546767",
          "CHEMBL1548574",
          "CHEMBL1548704",
          "CHEMBL1548770",
          "CHEMBL1548928",
          "CHEMBL1549732",
          "CHEMBL154985",
          "CHEMBL1550553",
          "CHEMBL1552053",
          "CHEMBL1552672",
          "CHEMBL155311",
          "CHEMBL155317",
          "CHEMBL1555215",
          "CHEMBL1555317",
          "CHEMBL1556531",
          "CHEMBL1556684",
          "CHEMBL1556780",
          "CHEMBL1558644",
          "CHEMBL1560147",
          "CHEMBL156082",
          "CHEMBL1560833",
          "CHEMBL1564058",
          "CHEMBL1564141",
          "CHEMBL1564638",
          "CHEMBL1566994",
          "CHEMBL1568373",
          "CHEMBL1568803",
          "CHEMBL1569092",
          "CHEMBL1569215",
          "CHEMBL1569364",
          "CHEMBL1570668",
          "CHEMBL1571625",
          "CHEMBL1573804",
          "CHEMBL1575767",
          "CHEMBL1576310",
          "CHEMBL1578629",
          "CHEMBL1580600",
          "CHEMBL1580664",
          "CHEMBL1581048",
          "CHEMBL1583854",
          "CHEMBL1586269",
          "CHEMBL1587149",
          "CHEMBL1587502",
          "CHEMBL1590386",
          "CHEMBL1591174",
          "CHEMBL1591691",
          "CHEMBL1595376",
          "CHEMBL1595766",
          "CHEMBL1596745",
          "CHEMBL1597650",
          "CHEMBL1598236",
          "CHEMBL1600901",
          "CHEMBL1602055",
          "CHEMBL1604122",
          "CHEMBL1604247",
          "CHEMBL1605425",
          "CHEMBL1609744",
          "CHEMBL1610433",
          "CHEMBL1610506",
          "CHEMBL1610814",
          "CHEMBL1612000",
          "CHEMBL1612291",
          "CHEMBL1613540",
          "CHEMBL163147",
          "CHEMBL164512",
          "CHEMBL165413",
          "CHEMBL165694",
          "CHEMBL165767",
          "CHEMBL165781",
          "CHEMBL165880",
          "CHEMBL165909",
          "CHEMBL166334",
          "CHEMBL166451",
          "CHEMBL166674",
          "CHEMBL166715",
          "CHEMBL166785",
          "CHEMBL166790",
          "CHEMBL166822",
          "CHEMBL166858",
          "CHEMBL166882",
          "CHEMBL166914",
          "CHEMBL166944",
          "CHEMBL166995",
          "CHEMBL167028",
          "CHEMBL167045",
          "CHEMBL167053",
          "CHEMBL167075",
          "CHEMBL167100",
          "CHEMBL167162",
          "CHEMBL167165",
          "CHEMBL167228",
          "CHEMBL167279",
          "CHEMBL167349",
          "CHEMBL167560",
          "CHEMBL167637",
          "CHEMBL167653",
          "CHEMBL167767",
          "CHEMBL168123",
          "CHEMBL168324",
          "CHEMBL168401",
          "CHEMBL168547",
          "CHEMBL168594",
          "CHEMBL168621",
          "CHEMBL168677",
          "CHEMBL168689",
          "CHEMBL168720",
          "CHEMBL168727",
          "CHEMBL168763",
          "CHEMBL168766",
          "CHEMBL168772",
          "CHEMBL168805",
          "CHEMBL168879",
          "CHEMBL168905",
          "CHEMBL168918",
          "CHEMBL168977",
          "CHEMBL169050",
          "CHEMBL169082",
          "CHEMBL169106",
          "CHEMBL169306",
          "CHEMBL169419",
          "CHEMBL169433",
          "CHEMBL169464",
          "CHEMBL169487",
          "CHEMBL169627",
          "CHEMBL169747",
          "CHEMBL169775",
          "CHEMBL1699206",
          "CHEMBL1701401",
          "CHEMBL170223",
          "CHEMBL1702964",
          "CHEMBL170488",
          "CHEMBL170548",
          "CHEMBL1705518",
          "CHEMBL170611",
          "CHEMBL1706207",
          "CHEMBL1709846",
          "CHEMBL1709966",
          "CHEMBL1710601",
          "CHEMBL1711830",
          "CHEMBL1717770",
          "CHEMBL1719956",
          "CHEMBL1723045",
          "CHEMBL1726180",
          "CHEMBL1726773",
          "CHEMBL1727049",
          "CHEMBL1727678",
          "CHEMBL1730686",
          "CHEMBL177078",
          "CHEMBL1864040",
          "CHEMBL1870454",
          "CHEMBL1871747",
          "CHEMBL1873140",
          "CHEMBL1873454",
          "CHEMBL1875123",
          "CHEMBL1876111",
          "CHEMBL1881326",
          "CHEMBL1883011",
          "CHEMBL1884200",
          "CHEMBL1884782",
          "CHEMBL1886169",
          "CHEMBL1886491",
          "CHEMBL1888496",
          "CHEMBL1898074",
          "CHEMBL1899457",
          "CHEMBL1964690",
          "CHEMBL1966168",
          "CHEMBL1966202",
          "CHEMBL1966700",
          "CHEMBL1968356",
          "CHEMBL1969992",
          "CHEMBL1970785",
          "CHEMBL1970867",
          "CHEMBL1971033",
          "CHEMBL1971051",
          "CHEMBL1971127",
          "CHEMBL1972506",
          "CHEMBL1972750",
          "CHEMBL1973435",
          "CHEMBL1974063",
          "CHEMBL1975054",
          "CHEMBL1975801",
          "CHEMBL1976161",
          "CHEMBL1976317",
          "CHEMBL1976677",
          "CHEMBL1976919",
          "CHEMBL1977596",
          "CHEMBL1979539",
          "CHEMBL1979696",
          "CHEMBL1980308",
          "CHEMBL1980844",
          "CHEMBL1981538",
          "CHEMBL1982026",
          "CHEMBL1982195",
          "CHEMBL1982202",
          "CHEMBL1982308",
          "CHEMBL1983001",
          "CHEMBL1983460",
          "CHEMBL1983530",
          "CHEMBL1984584",
          "CHEMBL1984772",
          "CHEMBL1985667",
          "CHEMBL1985696",
          "CHEMBL1985795",
          "CHEMBL1986889",
          "CHEMBL1988376",
          "CHEMBL1988686",
          "CHEMBL1990774",
          "CHEMBL1991303",
          "CHEMBL1992308",
          "CHEMBL1992359",
          "CHEMBL1992681",
          "CHEMBL1993220",
          "CHEMBL1993978",
          "CHEMBL1994463",
          "CHEMBL1994877",
          "CHEMBL1994935",
          "CHEMBL1995152",
          "CHEMBL1996136",
          "CHEMBL1996139",
          "CHEMBL1996519",
          "CHEMBL1996548",
          "CHEMBL1997413",
          "CHEMBL1997797",
          "CHEMBL1997827",
          "CHEMBL1998061",
          "CHEMBL1999908",
          "CHEMBL2000103",
          "CHEMBL2000877",
          "CHEMBL2001433",
          "CHEMBL2002565",
          "CHEMBL2003445",
          "CHEMBL2003808",
          "CHEMBL2004916",
          "CHEMBL2005518",
          "CHEMBL2005671",
          "CHEMBL2006338",
          "CHEMBL2006357",
          "CHEMBL2007227",
          "CHEMBL2147467",
          "CHEMBL2147469",
          "CHEMBL224857",
          "CHEMBL23130",
          "CHEMBL23332",
          "CHEMBL239127",
          "CHEMBL240132",
          "CHEMBL24097",
          "CHEMBL24100",
          "CHEMBL24103",
          "CHEMBL24106",
          "CHEMBL24125",
          "CHEMBL24153",
          "CHEMBL24156",
          "CHEMBL24160",
          "CHEMBL24165",
          "CHEMBL24166",
          "CHEMBL24215",
          "CHEMBL24257",
          "CHEMBL24284",
          "CHEMBL24318",
          "CHEMBL24340",
          "CHEMBL24372",
          "CHEMBL24379",
          "CHEMBL24422",
          "CHEMBL24437",
          "CHEMBL24439",
          "CHEMBL244645",
          "CHEMBL24492",
          "CHEMBL24535",
          "CHEMBL24559",
          "CHEMBL24617",
          "CHEMBL24654",
          "CHEMBL24657",
          "CHEMBL24702",
          "CHEMBL24749",
          "CHEMBL24772",
          "CHEMBL24796",
          "CHEMBL24800",
          "CHEMBL25241",
          "CHEMBL25831",
          "CHEMBL25928",
          "CHEMBL25997",
          "CHEMBL26007",
          "CHEMBL26043",
          "CHEMBL26051",
          "CHEMBL26060",
          "CHEMBL26063",
          "CHEMBL26104",
          "CHEMBL26117",
          "CHEMBL26161",
          "CHEMBL26174",
          "CHEMBL262213",
          "CHEMBL262275",
          "CHEMBL26228",
          "CHEMBL262805",
          "CHEMBL26340",
          "CHEMBL26403",
          "CHEMBL26407",
          "CHEMBL26450",
          "CHEMBL26458",
          "CHEMBL26490",
          "CHEMBL265566",
          "CHEMBL265620",
          "CHEMBL267455",
          "CHEMBL268122",
          "CHEMBL268367",
          "CHEMBL268459",
          "CHEMBL268683",
          "CHEMBL268861",
          "CHEMBL269206",
          "CHEMBL273196",
          "CHEMBL273627",
          "CHEMBL274561",
          "CHEMBL274606",
          "CHEMBL278798",
          "CHEMBL279248",
          "CHEMBL280736",
          "CHEMBL280738",
          "CHEMBL280837",
          "CHEMBL280994",
          "CHEMBL281220",
          "CHEMBL281766",
          "CHEMBL281893",
          "CHEMBL282192",
          "CHEMBL282550",
          "CHEMBL282857",
          "CHEMBL283428",
          "CHEMBL283688",
          "CHEMBL284432",
          "CHEMBL285102",
          "CHEMBL285126",
          "CHEMBL285336",
          "CHEMBL286492",
          "CHEMBL286514",
          "CHEMBL286515",
          "CHEMBL286889",
          "CHEMBL286957",
          "CHEMBL287640",
          "CHEMBL290376",
          "CHEMBL315611",
          "CHEMBL317137",
          "CHEMBL317199",
          "CHEMBL317271",
          "CHEMBL317587",
          "CHEMBL317682",
          "CHEMBL318175",
          "CHEMBL318177",
          "CHEMBL318304",
          "CHEMBL318352",
          "CHEMBL318998",
          "CHEMBL319035",
          "CHEMBL319122",
          "CHEMBL319868",
          "CHEMBL320393",
          "CHEMBL320512",
          "CHEMBL320897",
          "CHEMBL320937",
          "CHEMBL321162",
          "CHEMBL321960",
          "CHEMBL322165",
          "CHEMBL322404",
          "CHEMBL322437",
          "CHEMBL322622",
          "CHEMBL322894",
          "CHEMBL322901",
          "CHEMBL323101",
          "CHEMBL323304",
          "CHEMBL326013",
          "CHEMBL329730",
          "CHEMBL330149",
          "CHEMBL330206",
          "CHEMBL336471",
          "CHEMBL336844",
          "CHEMBL336929",
          "CHEMBL337532",
          "CHEMBL337799",
          "CHEMBL341636",
          "CHEMBL342083",
          "CHEMBL342482",
          "CHEMBL342542",
          "CHEMBL342611",
          "CHEMBL342722",
          "CHEMBL342764",
          "CHEMBL342826",
          "CHEMBL342910",
          "CHEMBL343254",
          "CHEMBL343518",
          "CHEMBL343798",
          "CHEMBL343892",
          "CHEMBL344104",
          "CHEMBL344260",
          "CHEMBL344283",
          "CHEMBL344552",
          "CHEMBL344675",
          "CHEMBL344790",
          "CHEMBL344862",
          "CHEMBL344937",
          "CHEMBL344993",
          "CHEMBL346222",
          "CHEMBL346607",
          "CHEMBL346638",
          "CHEMBL347158",
          "CHEMBL347371",
          "CHEMBL347493",
          "CHEMBL348175",
          "CHEMBL348255",
          "CHEMBL348266",
          "CHEMBL348443",
          "CHEMBL349483",
          "CHEMBL349986",
          "CHEMBL349991",
          "CHEMBL350065",
          "CHEMBL350285",
          "CHEMBL350603",
          "CHEMBL350901",
          "CHEMBL351371",
          "CHEMBL351664",
          "CHEMBL352304",
          "CHEMBL352359",
          "CHEMBL352547",
          "CHEMBL352587",
          "CHEMBL352631",
          "CHEMBL352789",
          "CHEMBL352851",
          "CHEMBL352883",
          "CHEMBL352961",
          "CHEMBL352975",
          "CHEMBL353154",
          "CHEMBL353241",
          "CHEMBL353366",
          "CHEMBL353390",
          "CHEMBL353636",
          "CHEMBL353701",
          "CHEMBL353733",
          "CHEMBL353809",
          "CHEMBL353818",
          "CHEMBL353933",
          "CHEMBL354135",
          "CHEMBL354149",
          "CHEMBL354307",
          "CHEMBL354355",
          "CHEMBL354388",
          "CHEMBL354443",
          "CHEMBL354492",
          "CHEMBL354511",
          "CHEMBL354525",
          "CHEMBL354539",
          "CHEMBL354563",
          "CHEMBL354577",
          "CHEMBL354762",
          "CHEMBL354800",
          "CHEMBL354801",
          "CHEMBL354913",
          "CHEMBL354949",
          "CHEMBL354968",
          "CHEMBL354977",
          "CHEMBL355260",
          "CHEMBL355327",
          "CHEMBL355417",
          "CHEMBL355469",
          "CHEMBL355622",
          "CHEMBL355883",
          "CHEMBL356007",
          "CHEMBL356067",
          "CHEMBL356071",
          "CHEMBL356094",
          "CHEMBL356216",
          "CHEMBL356295",
          "CHEMBL356348",
          "CHEMBL356580",
          "CHEMBL356711",
          "CHEMBL356792",
          "CHEMBL357067",
          "CHEMBL357079",
          "CHEMBL357210",
          "CHEMBL357211",
          "CHEMBL357635",
          "CHEMBL357660",
          "CHEMBL357920",
          "CHEMBL358077",
          "CHEMBL358081",
          "CHEMBL358085",
          "CHEMBL358110",
          "CHEMBL358366",
          "CHEMBL358387",
          "CHEMBL358441",
          "CHEMBL358491",
          "CHEMBL358503",
          "CHEMBL358508",
          "CHEMBL358526",
          "CHEMBL358719",
          "CHEMBL358961",
          "CHEMBL358970",
          "CHEMBL358999",
          "CHEMBL359184",
          "CHEMBL359422",
          "CHEMBL382408",
          "CHEMBL394723",
          "CHEMBL397831",
          "CHEMBL409191",
          "CHEMBL410952",
          "CHEMBL411506",
          "CHEMBL415171",
          "CHEMBL41519",
          "CHEMBL416014",
          "CHEMBL416329",
          "CHEMBL417071",
          "CHEMBL418752",
          "CHEMBL419892",
          "CHEMBL420476",
          "CHEMBL421411",
          "CHEMBL422043",
          "CHEMBL422147",
          "CHEMBL422205",
          "CHEMBL422398",
          "CHEMBL423014",
          "CHEMBL423195",
          "CHEMBL423271",
          "CHEMBL423555",
          "CHEMBL423699",
          "CHEMBL423770",
          "CHEMBL423926",
          "CHEMBL424164",
          "CHEMBL424544",
          "CHEMBL429002",
          "CHEMBL430087",
          "CHEMBL430540",
          "CHEMBL431814",
          "CHEMBL433916",
          "CHEMBL434678",
          "CHEMBL434874",
          "CHEMBL435423",
          "CHEMBL435463",
          "CHEMBL435621",
          "CHEMBL435785",
          "CHEMBL439810",
          "CHEMBL440188",
          "CHEMBL441406",
          "CHEMBL442449",
          "CHEMBL444601",
          "CHEMBL448420",
          "CHEMBL450936",
          "CHEMBL453359",
          "CHEMBL473314",
          "CHEMBL488110",
          "CHEMBL489110",
          "CHEMBL490355",
          "CHEMBL490491",
          "CHEMBL491283",
          "CHEMBL506204",
          "CHEMBL509562",
          "CHEMBL510512",
          "CHEMBL51173",
          "CHEMBL521570",
          "CHEMBL56542",
          "CHEMBL56731",
          "CHEMBL579028",
          "CHEMBL609410",
          "CHEMBL7880",
          "CHEMBL7962",
          "CHEMBL8108",
          "CHEMBL8980",
          "CHEMBL9111",
          "CHEMBL9415",
          "CHEMBL9423",
          "CHEMBL9491",
          "CHEMBL95940",
          "CHEMBL95993",
          "CHEMBL97597",
          "CHEMBL99309",
          "CHEMBL99951"
        ],
        "number_of_missing_values": "0"
      },
      {
        "data_type": "numeric",
        "index": "1",
        "is_ignore": "false",
        "is_row_identifier": "false",
        "is_target": "false",
        "name": "AMW",
        "number_of_missing_values": "0"
      },
      {
        "data_type": "numeric",
        "index": "2",
        "is_ignore": "false",
        "is_row_identifier": "false",
        "is_target": "false",
        "name": "C.",
        "number_of_missing_values": "0"
      },
      {
        "data_type": "numeric",
        "index": "3",
        "is_ignore": "false",
        "is_row_identifier": "false",
        "is_target": "false",
        "name": "H.",
        "number_of_missing_values": "0"
      },
      {
        "data_type": "numeric",
        "index": "4",
        "is_ignore": "false",
        "is_row_identifier": "false",
        "is_target": "false",
        "name": "Me",
        "number_of_missing_values": "0"
      },
      {
        "data_type": "numeric",
        "index": "5",
        "is_ignore": "false",
        "is_row_identifier": "false",
        "is_target": "false",
        "name": "Mi",
        "number_of_missing_values": "0"
      },
      {
        "data_type": "numeric",
        "index": "6",
        "is_ignore": "false",
        "is_row_identifier": "false",
        "is_target": "false",
        "name": "Mp",
        "number_of_missing_values": "0"
      },
      {
        "data_type": "numeric",
        "index": "7",
        "is_ignore": "false",
        "is_row_identifier": "false",
        "is_target": "false",
        "name": "Mv",
        "number_of_missing_values": "0"
      },
      {
        "data_type": "numeric",
        "index": "8",
        "is_ignore": "false",
        "is_row_identifier": "false",
        "is_target": "false",
        "name": "MW",
        "number_of_missing_values": "0"
      },
      {
        "data_type": "numeric",
        "index": "9",
        "is_ignore": "false",
        "is_row_identifier": "false",
        "is_target": "false",
        "name": "N.",
        "number_of_missing_values": "0"
      },
      {
        "data_type": "numeric",
        "index": "10",
        "is_ignore": "false",
        "is_row_identifier": "false",
        "is_target": "false",
        "name": "nAB",
        "number_of_missing_values": "0"
      },
      {
        "data_type": "numeric",
        "index": "11",
        "is_ignore": "false",
        "is_row_identifier": "false",
        "is_target": "false",
        "name": "nAT",
        "number_of_missing_values": "0"
      },
      {
        "data_type": "numeric",
        "index": "12",
        "is_ignore": "false",
        "is_row_identifier": "false",
        "is_target": "false",
        "name": "nB",
        "number_of_missing_values": "0"
      },
      {
        "data_type": "numeric",
        "index": "13",
        "is_ignore": "false",
        "is_row_identifier": "false",
        "is_target": "false",
        "name": "nBM",
        "number_of_missing_values": "0"
      },
      {
        "data_type": "numeric",
        "index": "14",
        "is_ignore": "false",
        "is_row_identifier": "false",
        "is_target": "false",
        "name": "nBO",
        "number_of_missing_values": "0"
      },
      {
        "data_type": "numeric",
        "index": "15",
        "is_ignore": "false",
        "is_row_identifier": "false",
        "is_target": "false",
        "name": "nBR",
        "number_of_missing_values": "0"
      },
      {
        "data_type": "numeric",
        "index": "16",
        "is_ignore": "false",
        "is_row_identifier": "false",
        "is_target": "false",
        "name": "nBT",
        "number_of_missing_values": "0"
      },
      {
        "data_type": "numeric",
        "index": "17",
        "is_ignore": "false",
        "is_row_identifier": "false",
        "is_target": "false",
        "name": "nC",
        "number_of_missing_values": "0"
      },
      {
        "data_type": "numeric",
        "index": "18",
        "is_ignore": "false",
        "is_row_identifier": "false",
        "is_target": "false",
        "name": "nCL",
        "number_of_missing_values": "0"
      },
      {
        "data_type": "numeric",
        "index": "19",
        "is_ignore": "false",
        "is_row_identifier": "false",
        "is_target": "false",
        "name": "nCsp",
        "number_of_missing_values": "0"
      },
      {
        "data_type": "numeric",
        "index": "20",
        "is_ignore": "false",
        "is_row_identifier": "false",
        "is_target": "false",
        "name": "nCsp2",
        "number_of_missing_values": "0"
      },
      {
        "data_type": "numeric",
        "index": "21",
        "is_ignore": "false",
        "is_row_identifier": "false",
        "is_target": "false",
        "name": "nCsp3",
        "number_of_missing_values": "0"
      },
      {
        "data_type": "numeric",
        "index": "22",
        "is_ignore": "false",
        "is_row_identifier": "false",
        "is_target": "false",
        "name": "nDB",
        "number_of_missing_values": "0"
      },
      {
        "data_type": "numeric",
        "index": "23",
        "is_ignore": "false",
        "is_row_identifier": "false",
        "is_target": "false",
        "name": "nF",
        "number_of_missing_values": "0"
      },
      {
        "data_type": "numeric",
        "index": "24",
        "is_ignore": "false",
        "is_row_identifier": "false",
        "is_target": "false",
        "name": "nH",
        "number_of_missing_values": "0"
      },
      {
        "data_type": "numeric",
        "index": "25",
        "is_ignore": "false",
        "is_row_identifier": "false",
        "is_target": "false",
        "name": "nHet",
        "number_of_missing_values": "0"
      },
      {
        "data_type": "numeric",
        "index": "26",
        "is_ignore": "false",
        "is_row_identifier": "false",
        "is_target": "false",
        "name": "nHM",
        "number_of_missing_values": "0"
      },
      {
        "data_type": "numeric",
        "index": "27",
        "is_ignore": "false",
        "is_row_identifier": "false",
        "is_target": "false",
        "name": "nI",
        "number_of_missing_values": "0"
      },
      {
        "data_type": "numeric",
        "index": "28",
        "is_ignore": "false",
        "is_row_identifier": "false",
        "is_target": "false",
        "name": "nN",
        "number_of_missing_values": "0"
      },
      {
        "data_type": "numeric",
        "index": "29",
        "is_ignore": "false",
        "is_row_identifier": "false",
        "is_target": "false",
        "name": "nO",
        "number_of_missing_values": "0"
      },
      {
        "data_type": "numeric",
        "index": "30",
        "is_ignore": "false",
        "is_row_identifier": "false",
        "is_target": "false",
        "name": "nP",
        "number_of_missing_values": "0"
      },
      {
        "data_type": "numeric",
        "index": "31",
        "is_ignore": "false",
        "is_row_identifier": "false",
        "is_target": "false",
        "name": "nS",
        "number_of_missing_values": "0"
      },
      {
        "data_type": "numeric",
        "index": "32",
        "is_ignore": "false",
        "is_row_identifier": "false",
        "is_target": "false",
        "name": "nSK",
        "number_of_missing_values": "0"
      },
      {
        "data_type": "numeric",
        "index": "33",
        "is_ignore": "false",
        "is_row_identifier": "false",
        "is_target": "false",
        "name": "nTB",
        "number_of_missing_values": "0"
      },
      {
        "data_type": "numeric",
        "index": "34",
        "is_ignore": "false",
        "is_row_identifier": "false",
        "is_target": "false",
        "name": "nX",
        "number_of_missing_values": "0"
      },
      {
        "data_type": "numeric",
        "index": "35",
        "is_ignore": "false",
        "is_row_identifier": "false",
        "is_target": "false",
        "name": "O.",
        "number_of_missing_values": "0"
      },
      {
        "data_type": "numeric",
        "index": "36",
        "is_ignore": "false",
        "is_row_identifier": "false",
        "is_target": "false",
        "name": "RBF",
        "number_of_missing_values": "0"
      },
      {
        "data_type": "numeric",
        "index": "37",
        "is_ignore": "false",
        "is_row_identifier": "false",
        "is_target": "false",
        "name": "RBN",
        "number_of_missing_values": "0"
      },
      {
        "data_type": "numeric",
        "index": "38",
        "is_ignore": "false",
        "is_row_identifier": "false",
        "is_target": "false",
        "name": "SCBO",
        "number_of_missing_values": "0"
      },
      {
        "data_type": "numeric",
        "index": "39",
        "is_ignore": "false",
        "is_row_identifier": "false",
        "is_target": "false",
        "name": "Se",
        "number_of_missing_values": "0"
      },
      {
        "data_type": "numeric",
        "index": "40",
        "is_ignore": "false",
        "is_row_identifier": "false",
        "is_target": "false",
        "name": "Si",
        "number_of_missing_values": "0"
      },
      {
        "data_type": "numeric",
        "index": "41",
        "is_ignore": "false",
        "is_row_identifier": "false",
        "is_target": "false",
        "name": "Sp",
        "number_of_missing_values": "0"
      },
      {
        "data_type": "numeric",
        "index": "42",
        "is_ignore": "false",
        "is_row_identifier": "false",
        "is_target": "false",
        "name": "Sv",
        "number_of_missing_values": "0"
      },
      {
        "data_type": "numeric",
        "index": "43",
        "is_ignore": "false",
        "is_row_identifier": "false",
        "is_target": "false",
        "name": "X.",
        "number_of_missing_values": "0"
      },
      {
        "data_type": "numeric",
        "index": "44",
        "is_ignore": "false",
        "is_row_identifier": "false",
        "is_target": "true",
        "name": "pXC50",
        "number_of_missing_values": "0"
      }
    ]
  }
}