{
  "data_features": {
    "feature": [
      {
        "data_type": "nominal",
        "index": "0",
        "is_ignore": "false",
        "is_row_identifier": "true",
        "is_target": "false",
        "name": "molecule_id",
        "nominal_value": [
          "CHEMBL1162110",
          "CHEMBL1336680",
          "CHEMBL1353738",
          "CHEMBL1359859",
          "CHEMBL1376311",
          "CHEMBL1381310",
          "CHEMBL1403045",
          "CHEMBL1424694",
          "CHEMBL1429070",
          "CHEMBL1461216",
          "CHEMBL1473059",
          "CHEMBL1485277",
          "CHEMBL1490134",
          "CHEMBL1491913",
          "CHEMBL1511981",
          "CHEMBL1575303",
          "CHEMBL1575701",
          "CHEMBL1579664",
          "CHEMBL1603949",
          "CHEMBL1605235",
          "CHEMBL1703276",
          "CHEMBL1706407",
          "CHEMBL1729254",
          "CHEMBL1981446",
          "CHEMBL1995706",
          "CHEMBL2130611"
        ],
        "number_of_missing_values": "0"
      },
      {
        "data_type": "numeric",
        "index": "1",
        "is_ignore": "false",
        "is_row_identifier": "false",
        "is_target": "false",
        "name": "AMW",
        "number_of_missing_values": "0"
      },
      {
        "data_type": "numeric",
        "index": "2",
        "is_ignore": "false",
        "is_row_identifier": "false",
        "is_target": "false",
        "name": "C.",
        "number_of_missing_values": "0"
      },
      {
        "data_type": "numeric",
        "index": "3",
        "is_ignore": "false",
        "is_row_identifier": "false",
        "is_target": "false",
        "name": "H.",
        "number_of_missing_values": "0"
      },
      {
        "data_type": "numeric",
        "index": "4",
        "is_ignore": "false",
        "is_row_identifier": "false",
        "is_target": "false",
        "name": "Me",
        "number_of_missing_values": "0"
      },
      {
        "data_type": "numeric",
        "index": "5",
        "is_ignore": "false",
        "is_row_identifier": "false",
        "is_target": "true",
        "name": "pXC50",
        "number_of_missing_values": "0"
      }
    ]
  }
}