{
  "data_set_description": {
    "collection_date": "November 2013",
    "creator": "Dr Jeremy Besnard, Dr Ivan Olier, Dr Noureddin Sadawi, Dr Larisa Soldatova, Dr Crina Grosan, Prof Ross King, Dr Richard Bickerton, Prof Andrew Hopkins and Dr Willem van Hoorn",
    "default_target_attribute": "pXC50",
    "description": "This dataset contains QSAR data (from ChEMBL version 17) showing activity values (unit is pseudo-pCI50) of several compounds on drug target ChEMBL_ID: CHEMBL1980 (TID: 11480), and it has 361 rows and 1323 features (not including molecule IDs and class feature: molecule_id and pXC50). The features represent Molecular Descriptors which were generated from SMILES strings. Missing value imputation was applied to this dataset (By choosing the Median).",
    "description_version": "1",
    "file_id": "3228570",
    "format": "ARFF",
    "id": "23563",
    "licence": "Public",
    "md5_checksum": "577f48567e45d2c0bd4806bc07d50126",
    "minio_url": "https://data.openml.org/datasets/0002/23563/dataset_23563.pq",
    "name": "QSAR-DATASET-FOR-DRUG-TARGET-CHEMBL1980",
    "original_data_url": "https://www.ebi.ac.uk/chembl/target/inspect/CHEMBL1980",
    "parquet_url": "https://data.openml.org/datasets/0002/23563/dataset_23563.pq",
    "processing_date": "2018-10-03 22:22:47",
    "row_id_attribute": "molecule_id",
    "status": "deactivated",
    "tag": [
      "MetaQSAR",
      "study_13"
    ],
    "upload_date": "2016-07-14T12:44:19",
    "url": "https://api.openml.org/data/v1/download/3228570/QSAR-DATASET-FOR-DRUG-TARGET-CHEMBL1980.arff",
    "version": "7",
    "visibility": "public"
  }
}