"molecule_id","AMW","C.","H.","Me","Mi","Mp","Mv","MW","N.","nAB","nAT","nB","nBM","nBO","nBR","nBT","nC","nCL","nCsp","nCsp2","nCsp3","nDB","nF","nH","nHet","nHM","nI","nN","nO","nP","nS","nSK","nTB","nX","O.","RBF","RBN","SCBO","Se","Si","Sp","Sv","X.","pXC50"
{1 7.726,2 41.7,3 43.3,4 1.012,5 1.134,6 0.662,7 0.64,8 463.56,9 8.3,10 17,11 60,13 20,14 37,16 63,17 25,20 18,21 7,22 3,23 1,24 26,25 9,28 5,29 3,32 34,34 1,35 5,36 0.127,37 8,38 48.5,39 60.723,40 68.027,41 39.705,42 38.429,43 1.7,44 5.676}
{0 CHEMBL242437,1 7.77,2 40.3,3 43.3,4 1.015,5 1.137,6 0.656,7 0.637,8 520.62,9 9,10 17,11 67,13 21,14 41,16 70,17 27,20 19,21 8,22 4,23 1,24 29,25 11,28 6,29 4,32 38,34 1,35 6,36 0.129,37 9,38 53.5,39 68.036,40 76.15,41 43.926,42 42.692,43 1.5,44 5.06}
{0 CHEMBL242486,1 8.626,2 43.1,3 38.5,4 1.021,5 1.127,6 0.693,7 0.674,8 560.66,9 9.2,10 23,11 65,13 27,14 45,16 70,17 28,20 22,21 6,22 4,23 1,24 25,25 12,26 1,28 6,29 4,31 1,32 40,34 1,35 6.2,36 0.129,37 9,38 60.5,39 66.345,40 73.239,41 45.051,42 43.826,43 1.5,44 5.71}
{0 CHEMBL242862,1 7.664,2 41.8,3 43.6,4 1.009,5 1.135,6 0.663,7 0.64,8 421.52,9 9.1,10 17,11 55,13 19,14 34,16 58,17 23,20 17,21 6,22 2,23 1,24 24,25 8,28 5,29 2,32 31,34 1,35 3.6,36 0.121,37 7,38 44.5,39 55.512,40 62.402,41 36.489,42 35.188,43 1.8,44 5.592}
{0 CHEMBL243116,1 8.65,2 39.4,3 40.8,4 1.022,5 1.134,6 0.682,7 0.658,8 614.16,9 9.9,10 22,11 71,13 26,14 46,16 75,17 28,18 1,20 20,21 8,22 4,23 1,24 29,25 14,26 2,28 7,29 4,31 1,32 42,34 2,35 5.6,36 0.133,37 10,38 61,39 72.538,40 80.512,41 48.438,42 46.728,43 2.8,44 6.268}
{0 CHEMBL243134,1 8.54,2 40.9,3 39.4,4 1.022,5 1.132,6 0.683,7 0.664,8 563.67,9 10.6,10 22,11 66,13 26,14 45,16 71,17 27,20 20,21 7,22 4,23 1,24 26,25 13,26 1,28 7,29 4,31 1,32 40,34 1,35 6.1,36 0.127,37 9,38 60,39 67.447,40 74.737,41 45.057,42 43.847,43 1.5,44 6.409}
{0 CHEMBL243180,1 8.602,2 45.1,3 38,4 1.017,5 1.122,6 0.702,7 0.681,8 610.72,9 8.5,10 28,11 71,13 32,14 50,16 77,17 32,20 26,21 6,22 4,23 1,24 27,25 12,26 1,28 6,29 4,31 1,32 44,34 1,35 5.6,36 0.117,37 9,38 68,39 72.229,40 79.654,41 49.813,42 48.353,43 1.4,44 6.347}
{0 CHEMBL243342,1 8.892,2 40.3,3 38.8,4 1.023,5 1.129,6 0.697,7 0.672,8 595.74,9 10.4,10 22,11 67,13 26,14 46,16 72,17 27,20 20,21 7,22 4,23 1,24 26,25 14,26 2,28 7,29 4,31 2,32 41,34 1,35 6,36 0.125,37 9,38 61,39 68.523,40 75.657,41 46.705,42 45.034,43 1.5,44 6.638}
{0 CHEMBL243343,1 8.372,2 40.6,3 40.6,4 1.019,5 1.133,6 0.679,7 0.658,8 577.7,9 10.1,10 22,11 69,13 26,14 46,16 74,17 28,20 20,21 8,22 4,23 1,24 28,25 13,26 1,28 7,29 4,31 1,32 41,34 1,35 5.8,36 0.122,37 9,38 61,39 70.331,40 78.153,41 46.818,42 45.374,43 1.4,44 6.469}
{0 CHEMBL244165,1 7.958,2 43.1,3 41.4,4 1.014,5 1.131,6 0.671,7 0.653,8 461.54,9 8.6,10 17,11 58,13 20,14 38,16 62,17 25,20 18,21 7,22 3,23 1,24 24,25 9,28 5,29 3,32 34,34 1,35 5.2,36 0.113,37 7,38 49.5,39 58.84,40 65.611,41 38.943,42 37.903,43 1.7,44 6.161}
{0 CHEMBL244589,1 7.646,2 40.9,3 43.9,4 1.011,5 1.135,6 0.659,7 0.636,8 504.62,9 9.1,10 17,11 66,13 20,14 41,16 70,17 27,20 18,21 9,22 3,23 1,24 29,25 10,28 6,29 3,32 37,34 1,35 4.5,36 0.129,37 9,38 52.5,39 66.709,40 74.94,41 43.472,42 41.978,43 1.5,44 5.684}
{0 CHEMBL244590,1 8.434,2 40.7,3 40.7,4 1.021,5 1.131,6 0.679,7 0.658,8 497.6,9 8.5,10 17,11 59,13 21,14 39,16 63,17 24,20 17,21 7,22 4,23 1,24 24,25 11,26 1,28 5,29 4,31 1,32 35,34 1,35 6.8,36 0.127,37 8,38 51.5,39 60.243,40 66.741,41 40.046,42 38.805,43 1.7,44 5.903}
{0 CHEMBL244802,1 8.229,2 39.1,3 42.2,4 1.019,5 1.135,6 0.669,7 0.646,8 526.65,9 9.4,10 17,11 64,13 21,14 41,16 68,17 25,20 17,21 8,22 4,23 1,24 27,25 12,26 1,28 6,29 4,31 1,32 37,34 1,35 6.3,36 0.132,37 9,38 53.5,39 65.229,40 72.654,41 42.813,42 41.353,43 1.6,44 6.018}
{0 CHEMBL245018,1 8.319,2 39.7,3 41.2,4 1.02,5 1.135,6 0.674,7 0.653,8 565.69,9 10.3,10 22,11 68,13 26,14 44,16 72,17 27,20 20,21 7,22 4,23 1,24 28,25 13,26 1,28 7,29 4,31 1,32 40,34 1,35 5.9,36 0.139,37 10,38 59,39 69.331,40 77.153,41 45.818,42 44.374,43 1.5,44 6.201}
{0 CHEMBL389111,1 7.915,2 43.4,3 41.5,4 1.012,5 1.132,6 0.674,7 0.654,8 419.5,9 9.4,10 17,11 53,13 19,14 35,16 57,17 23,20 17,21 6,22 2,23 1,24 22,25 8,28 5,29 2,32 31,34 1,35 3.8,36 0.105,37 6,38 45.5,39 53.629,40 59.987,41 35.728,42 34.661,43 1.9,44 5.807}
{0 CHEMBL389494,1 8.872,2 40.6,3 39.1,4 1.024,5 1.132,6 0.691,7 0.67,8 612.14,9 10.1,10 22,11 69,13 26,14 47,16 74,17 28,18 1,20 20,21 8,22 4,23 1,24 27,25 14,26 2,28 7,29 4,31 1,32 42,34 2,35 5.8,36 0.122,37 9,38 62,39 70.654,40 78.097,41 47.676,42 46.202,43 2.9,44 6.538}
{0 CHEMBL394368,1 8.51,2 41.2,3 39.7,4 1.023,5 1.13,6 0.68,7 0.663,8 578.68,9 8.8,10 22,11 68,13 26,14 46,16 73,17 28,20 20,21 8,22 4,23 1,24 27,25 13,26 1,28 6,29 5,31 1,32 41,34 1,35 7.4,36 0.123,37 9,38 61,39 69.556,40 76.864,41 46.267,42 45.068,43 1.5,44 6.102}
{0 CHEMBL394621,1 8.372,2 40.6,3 40.6,4 1.019,5 1.133,6 0.679,7 0.658,8 577.7,9 10.1,10 22,11 69,13 26,14 46,16 74,17 28,20 20,21 8,22 4,23 1,24 28,25 13,26 1,28 7,29 4,31 1,32 41,34 1,35 5.8,36 0.122,37 9,38 61,39 70.331,40 78.153,41 46.818,42 45.374,43 1.4,44 6.62}
{0 CHEMBL396498,1 7.659,2 40.4,3 43.9,4 1.011,5 1.139,6 0.658,7 0.635,8 436.54,9 10.5,10 17,11 57,13 19,14 35,16 60,17 23,20 17,21 6,22 2,23 1,24 25,25 9,28 6,29 2,32 32,34 1,35 3.5,36 0.117,37 7,38 45.5,39 57.614,40 64.9,41 37.495,42 36.209,43 1.8,44 5.248}
{0 CHEMBL397513,1 8.888,2 43.1,3 36.2,4 1.041,5 1.149,6 0.668,7 0.673,8 515.51,9 8.6,10 17,11 58,13 20,14 41,16 62,17 25,20 18,21 7,22 3,23 4,24 21,25 12,28 5,29 3,32 37,34 4,35 5.2,36 0.113,37 7,38 52.5,39 60.378,40 66.631,41 38.756,42 39.053,43 6.9,44 5.745}
{0 CHEMBL428567,1 8.625,2 41.7,3 38.3,4 1.038,5 1.151,6 0.659,7 0.66,8 517.53,9 8.3,10 17,11 60,13 20,14 40,16 63,17 25,20 18,21 7,22 3,23 4,24 23,25 12,28 5,29 3,32 37,34 4,35 5,36 0.127,37 8,38 51.5,39 62.261,40 69.046,41 39.517,42 39.579,43 6.7,44 5.638}
