{
  "data_set_description": {
    "citation": "https://archive.ics.uci.edu/ml/citation_policy.html",
    "collection_date": "1998",
    "creator": "Robert P.W. Duin",
    "default_target_attribute": "class",
    "description": "**Author**: Robert P.W. Duin, Department of Applied Physics, Delft University of Technology  \n**Source**: [UCI](https://archive.ics.uci.edu/ml/datasets/Multiple+Features) - 1998  \n**Please cite**: [UCI](https://archive.ics.uci.edu/ml/citation_policy.html)   \n\n**Multiple Features Dataset: Pixel**  \nOne of a set of 6 datasets describing features of handwritten numerals (0 - 9) extracted from a collection of Dutch utility maps. The maps were scanned in 8 bit grey value at density of 400dpi, scanned, sharpened, and thresholded. Corresponding patterns in different datasets correspond to the same original character. 200 instances per class (for a total of 2,000 instances) have been digitized in binary images.  \n\nUsing this dataset, sampled versions of the original images may be obtained (15 x 16 pixels).  \n\n### Attribute Information  \nThe mfeatures represent 240 (15 x 16) pixel averages in 2 x 3 windows. \n\n### Relevant Papers  \nA slightly different version of the database is used in  \nM. van Breukelen, R.P.W. Duin, D.M.J. Tax, and J.E. den Hartog, Handwritten digit recognition by combined classifiers, Kybernetika, vol. 34, no. 4, 1998, 381-386.\n \nThe database as is is used in:  \nA.K. Jain, R.P.W. Duin, J. Mao, Statistical Pattern Recognition: A Review, IEEE Transactions on Pattern Analysis and Machine Intelligence archive, Volume 22 Issue 1, January 2000",
    "description_version": "1",
    "file_id": "20",
    "format": "ARFF",
    "id": "20",
    "language": "English",
    "licence": "Public",
    "md5_checksum": "0bdca54aadf13d4717810feb12a27c73",
    "minio_url": "https://data.openml.org/datasets/0000/0020/dataset_20.pq",
    "name": "mfeat-pixel",
    "original_data_url": "http://archive.ics.uci.edu/ml/datasets/Multiple+Features",
    "paper_url": "https://dml.cz/handle/10338.dmlcz/135219",
    "parquet_url": "https://data.openml.org/datasets/0000/0020/dataset_20.pq",
    "processing_date": "2020-11-20 20:02:03",
    "status": "active",
    "tag": [
      "Machine Learning",
      "OpenML100",
      "study_1",
      "study_123",
      "study_14",
      "study_34",
      "study_37",
      "study_41",
      "study_7",
      "study_70",
      "study_76",
      "uci"
    ],
    "upload_date": "2014-04-06T23:20:48",
    "url": "https://api.openml.org/data/v1/download/20/mfeat-pixel.arff",
    "version": "1",
    "version_label": "1",
    "visibility": "public"
  }
}