{
  "data_qualities": {
    "quality": [
      {
        "name": "AutoCorrelation",
        "value": "0.9954977488744372"
      },
      {
        "name": "CfsSubsetEval_DecisionStumpAUC",
        "value": "0.8937422222222221"
      },
      {
        "name": "CfsSubsetEval_DecisionStumpErrRate",
        "value": "0.2375"
      },
      {
        "name": "CfsSubsetEval_DecisionStumpKappa",
        "value": "0.736111111111111"
      },
      {
        "name": "CfsSubsetEval_NaiveBayesAUC",
        "value": "0.8937422222222221"
      },
      {
        "name": "CfsSubsetEval_NaiveBayesErrRate",
        "value": "0.2375"
      },
      {
        "name": "CfsSubsetEval_NaiveBayesKappa",
        "value": "0.736111111111111"
      },
      {
        "name": "CfsSubsetEval_kNN1NAUC",
        "value": "0.8937422222222221"
      },
      {
        "name": "CfsSubsetEval_kNN1NErrRate",
        "value": "0.2375"
      },
      {
        "name": "CfsSubsetEval_kNN1NKappa",
        "value": "0.736111111111111"
      },
      {
        "name": "ClassEntropy",
        "value": "3.321928094887362"
      },
      {
        "name": "DecisionStumpAUC",
        "value": "0.7220933333333333"
      },
      {
        "name": "DecisionStumpErrRate",
        "value": "0.8065"
      },
      {
        "name": "DecisionStumpKappa",
        "value": "0.10388888888888889"
      },
      {
        "name": "Dimensionality",
        "value": "0.1205"
      },
      {
        "name": "EquivalentNumberOfAtts",
        "value": "9.54503352862591"
      },
      {
        "name": "J48.00001.AUC",
        "value": "0.8903826388888888"
      },
      {
        "name": "J48.00001.ErrRate",
        "value": "0.247"
      },
      {
        "name": "J48.00001.Kappa",
        "value": "0.7255555555555556"
      },
      {
        "name": "J48.0001.AUC",
        "value": "0.8903826388888888"
      },
      {
        "name": "J48.0001.ErrRate",
        "value": "0.247"
      },
      {
        "name": "J48.0001.Kappa",
        "value": "0.7255555555555556"
      },
      {
        "name": "J48.001.AUC",
        "value": "0.8903826388888888"
      },
      {
        "name": "J48.001.ErrRate",
        "value": "0.247"
      },
      {
        "name": "J48.001.Kappa",
        "value": "0.7255555555555556"
      },
      {
        "name": "MajorityClassPercentage",
        "value": "10.0"
      },
      {
        "name": "MajorityClassSize",
        "value": "200.0"
      },
      {
        "name": "MaxAttributeEntropy",
        "value": "2.485861365938934"
      },
      {
        "name": "MaxKurtosisOfNumericAtts",
        "value": []
      },
      {
        "name": "MaxMeansOfNumericAtts",
        "value": []
      },
      {
        "name": "MaxMutualInformation",
        "value": "0.69725435953817"
      },
      {
        "name": "MaxNominalAttDistinctValues",
        "value": "10.0"
      },
      {
        "name": "MaxSkewnessOfNumericAtts",
        "value": []
      },
      {
        "name": "MaxStdDevOfNumericAtts",
        "value": []
      },
      {
        "name": "MeanAttributeEntropy",
        "value": "1.783969683848514"
      },
      {
        "name": "MeanKurtosisOfNumericAtts",
        "value": []
      },
      {
        "name": "MeanMeansOfNumericAtts",
        "value": []
      },
      {
        "name": "MeanMutualInformation",
        "value": "0.34802686495807234"
      },
      {
        "name": "MeanNoiseToSignalRatio",
        "value": "4.1259539520417"
      },
      {
        "name": "MeanNominalAttDistinctValues",
        "value": "6.8796680497925315"
      },
      {
        "name": "MeanSkewnessOfNumericAtts",
        "value": []
      },
      {
        "name": "MeanStdDevOfNumericAtts",
        "value": []
      },
      {
        "name": "MinAttributeEntropy",
        "value": "0.5344604897233257"
      },
      {
        "name": "MinKurtosisOfNumericAtts",
        "value": []
      },
      {
        "name": "MinMeansOfNumericAtts",
        "value": []
      },
      {
        "name": "MinMutualInformation",
        "value": "0.04048954203075"
      },
      {
        "name": "MinNominalAttDistinctValues",
        "value": "5.0"
      },
      {
        "name": "MinSkewnessOfNumericAtts",
        "value": []
      },
      {
        "name": "MinStdDevOfNumericAtts",
        "value": []
      },
      {
        "name": "MinorityClassPercentage",
        "value": "10.0"
      },
      {
        "name": "MinorityClassSize",
        "value": "200.0"
      },
      {
        "name": "NaiveBayesAUC",
        "value": "0.9948102777777779"
      },
      {
        "name": "NaiveBayesErrRate",
        "value": "0.07"
      },
      {
        "name": "NaiveBayesKappa",
        "value": "0.9222222222222223"
      },
      {
        "name": "NumberOfBinaryFeatures",
        "value": "0.0"
      },
      {
        "name": "NumberOfClasses",
        "value": "10.0"
      },
      {
        "name": "NumberOfFeatures",
        "value": "241.0"
      },
      {
        "name": "NumberOfInstances",
        "value": "2000.0"
      },
      {
        "name": "NumberOfInstancesWithMissingValues",
        "value": "0.0"
      },
      {
        "name": "NumberOfMissingValues",
        "value": "0.0"
      },
      {
        "name": "NumberOfNumericFeatures",
        "value": "0.0"
      },
      {
        "name": "NumberOfSymbolicFeatures",
        "value": "241.0"
      },
      {
        "name": "PercentageOfBinaryFeatures",
        "value": "0.0"
      },
      {
        "name": "PercentageOfInstancesWithMissingValues",
        "value": "0.0"
      },
      {
        "name": "PercentageOfMissingValues",
        "value": "0.0"
      },
      {
        "name": "PercentageOfNumericFeatures",
        "value": "0.0"
      },
      {
        "name": "PercentageOfSymbolicFeatures",
        "value": "100.0"
      },
      {
        "name": "Quartile1AttributeEntropy",
        "value": "1.6279751735710573"
      },
      {
        "name": "Quartile1KurtosisOfNumericAtts",
        "value": []
      },
      {
        "name": "Quartile1MeansOfNumericAtts",
        "value": []
      },
      {
        "name": "Quartile1MutualInformation",
        "value": "0.26666342391335"
      },
      {
        "name": "Quartile1SkewnessOfNumericAtts",
        "value": []
      },
      {
        "name": "Quartile1StdDevOfNumericAtts",
        "value": []
      },
      {
        "name": "Quartile2AttributeEntropy",
        "value": "1.7885772678104699"
      },
      {
        "name": "Quartile2KurtosisOfNumericAtts",
        "value": []
      },
      {
        "name": "Quartile2MeansOfNumericAtts",
        "value": []
      },
      {
        "name": "Quartile2MutualInformation",
        "value": "0.35220018419418"
      },
      {
        "name": "Quartile2SkewnessOfNumericAtts",
        "value": []
      },
      {
        "name": "Quartile2StdDevOfNumericAtts",
        "value": []
      },
      {
        "name": "Quartile3AttributeEntropy",
        "value": "1.9614414127795166"
      },
      {
        "name": "Quartile3KurtosisOfNumericAtts",
        "value": []
      },
      {
        "name": "Quartile3MeansOfNumericAtts",
        "value": []
      },
      {
        "name": "Quartile3MutualInformation",
        "value": "0.416425330283185"
      },
      {
        "name": "Quartile3SkewnessOfNumericAtts",
        "value": []
      },
      {
        "name": "Quartile3StdDevOfNumericAtts",
        "value": []
      },
      {
        "name": "REPTreeDepth1AUC",
        "value": "0.8865322222222223"
      },
      {
        "name": "REPTreeDepth1ErrRate",
        "value": "0.293"
      },
      {
        "name": "REPTreeDepth1Kappa",
        "value": "0.6744444444444444"
      },
      {
        "name": "REPTreeDepth2AUC",
        "value": "0.8865322222222223"
      },
      {
        "name": "REPTreeDepth2ErrRate",
        "value": "0.293"
      },
      {
        "name": "REPTreeDepth2Kappa",
        "value": "0.6744444444444444"
      },
      {
        "name": "REPTreeDepth3AUC",
        "value": "0.8865322222222223"
      },
      {
        "name": "REPTreeDepth3ErrRate",
        "value": "0.293"
      },
      {
        "name": "REPTreeDepth3Kappa",
        "value": "0.6744444444444444"
      },
      {
        "name": "RandomTreeDepth1AUC",
        "value": "0.7995606944444443"
      },
      {
        "name": "RandomTreeDepth1ErrRate",
        "value": "0.409"
      },
      {
        "name": "RandomTreeDepth1Kappa",
        "value": "0.5455555555555556"
      },
      {
        "name": "RandomTreeDepth2AUC",
        "value": "0.7995606944444443"
      },
      {
        "name": "RandomTreeDepth2ErrRate",
        "value": "0.409"
      },
      {
        "name": "RandomTreeDepth2Kappa",
        "value": "0.5455555555555556"
      },
      {
        "name": "RandomTreeDepth3AUC",
        "value": "0.7995606944444443"
      },
      {
        "name": "RandomTreeDepth3ErrRate",
        "value": "0.409"
      },
      {
        "name": "RandomTreeDepth3Kappa",
        "value": "0.5455555555555556"
      },
      {
        "name": "StdvNominalAttDistinctValues",
        "value": "0.5303708350609642"
      },
      {
        "name": "kNN1NAUC",
        "value": "0.9765262499999999"
      },
      {
        "name": "kNN1NErrRate",
        "value": "0.0475"
      },
      {
        "name": "kNN1NKappa",
        "value": "0.9472222222222222"
      }
    ]
  }
}