{
  "data_set_description": {
    "creator": "L. Torgo",
    "default_target_attribute": "Se",
    "description": "**Author**: Rui Camacho (rcamacho@garfield.fe.up.pt)  \n**Source**: [Regression datasets collection Luis Torgo](http://www.dcc.fc.up.pt/~ltorgo/Regression/DataSets.html)  \n**Please cite**:   \n\nThis data set is also obtained from the task of controlling the ailerons of a F16 aircraft, although the target variable and attributes are different from the ailerons domain. The target variable here is a variation instead of an absolute value, and there was some pre-selection of the attributes.",
    "description_version": "1",
    "file_id": "52348",
    "format": "ARFF",
    "id": "198",
    "language": "English",
    "licence": "Public",
    "md5_checksum": "5092640d992fd31f2cf3f8d4fd08f8c9",
    "minio_url": "https://data.openml.org/datasets/0000/0198/dataset_198.pq",
    "name": "delta_elevators",
    "original_data_url": "http://www.dcc.fc.up.pt/~ltorgo/Regression/DataSets.html",
    "parquet_url": "https://data.openml.org/datasets/0000/0198/dataset_198.pq",
    "processing_date": "2020-11-20 19:08:34",
    "status": "active",
    "upload_date": "2014-04-23T13:16:39",
    "url": "https://api.openml.org/data/v1/download/52348/delta_elevators.arff",
    "version": "1",
    "version_label": "1",
    "visibility": "public"
  }
}