{
  "data_qualities": {
    "quality": [
      {
        "name": "AutoCorrelation",
        "value": "0.4811320754716981"
      },
      {
        "name": "CfsSubsetEval_DecisionStumpAUC",
        "value": "0.8056078642919232"
      },
      {
        "name": "CfsSubsetEval_DecisionStumpErrRate",
        "value": "0.3619047619047619"
      },
      {
        "name": "CfsSubsetEval_DecisionStumpKappa",
        "value": "0.47361477572559363"
      },
      {
        "name": "CfsSubsetEval_NaiveBayesAUC",
        "value": "0.8056078642919232"
      },
      {
        "name": "CfsSubsetEval_NaiveBayesErrRate",
        "value": "0.3619047619047619"
      },
      {
        "name": "CfsSubsetEval_NaiveBayesKappa",
        "value": "0.47361477572559363"
      },
      {
        "name": "CfsSubsetEval_kNN1NAUC",
        "value": "0.8056078642919232"
      },
      {
        "name": "CfsSubsetEval_kNN1NErrRate",
        "value": "0.3619047619047619"
      },
      {
        "name": "CfsSubsetEval_kNN1NKappa",
        "value": "0.47361477572559363"
      },
      {
        "name": "ClassEntropy",
        "value": "2.3236526486373053"
      },
      {
        "name": "DecisionStumpAUC",
        "value": "0.6675446142057514"
      },
      {
        "name": "DecisionStumpErrRate",
        "value": "0.42857142857142855"
      },
      {
        "name": "DecisionStumpKappa",
        "value": "0.3105209397344228"
      },
      {
        "name": "Dimensionality",
        "value": "0.11214953271028037"
      },
      {
        "name": "EquivalentNumberOfAtts",
        "value": "4.973866798259092"
      },
      {
        "name": "J48.00001.AUC",
        "value": "0.8029644739741332"
      },
      {
        "name": "J48.00001.ErrRate",
        "value": "0.34285714285714286"
      },
      {
        "name": "J48.00001.Kappa",
        "value": "0.5267309377738826"
      },
      {
        "name": "J48.0001.AUC",
        "value": "0.8029644739741332"
      },
      {
        "name": "J48.0001.ErrRate",
        "value": "0.34285714285714286"
      },
      {
        "name": "J48.0001.Kappa",
        "value": "0.5267309377738826"
      },
      {
        "name": "J48.001.AUC",
        "value": "0.8029644739741332"
      },
      {
        "name": "J48.001.ErrRate",
        "value": "0.34285714285714286"
      },
      {
        "name": "J48.001.Kappa",
        "value": "0.5267309377738826"
      },
      {
        "name": "MajorityClassPercentage",
        "value": "41.1214953271028"
      },
      {
        "name": "MajorityClassSize",
        "value": "44.0"
      },
      {
        "name": "MaxAttributeEntropy",
        "value": "5.574234715470477"
      },
      {
        "name": "MaxKurtosisOfNumericAtts",
        "value": []
      },
      {
        "name": "MaxMeansOfNumericAtts",
        "value": []
      },
      {
        "name": "MaxMutualInformation",
        "value": "1.54436220017699"
      },
      {
        "name": "MaxNominalAttDistinctValues",
        "value": "54.0"
      },
      {
        "name": "MaxSkewnessOfNumericAtts",
        "value": []
      },
      {
        "name": "MaxStdDevOfNumericAtts",
        "value": []
      },
      {
        "name": "MeanAttributeEntropy",
        "value": "1.6912323198964243"
      },
      {
        "name": "MeanKurtosisOfNumericAtts",
        "value": []
      },
      {
        "name": "MeanMeansOfNumericAtts",
        "value": []
      },
      {
        "name": "MeanMutualInformation",
        "value": "0.46717227116950727"
      },
      {
        "name": "MeanNoiseToSignalRatio",
        "value": "2.620147051242224"
      },
      {
        "name": "MeanNominalAttDistinctValues",
        "value": "7.666666666666667"
      },
      {
        "name": "MeanSkewnessOfNumericAtts",
        "value": []
      },
      {
        "name": "MeanStdDevOfNumericAtts",
        "value": []
      },
      {
        "name": "MinAttributeEntropy",
        "value": "0.5847281182574744"
      },
      {
        "name": "MinKurtosisOfNumericAtts",
        "value": []
      },
      {
        "name": "MinMeansOfNumericAtts",
        "value": []
      },
      {
        "name": "MinMutualInformation",
        "value": "0.14862885098635"
      },
      {
        "name": "MinNominalAttDistinctValues",
        "value": "2.0"
      },
      {
        "name": "MinSkewnessOfNumericAtts",
        "value": []
      },
      {
        "name": "MinStdDevOfNumericAtts",
        "value": []
      },
      {
        "name": "MinorityClassPercentage",
        "value": "1.8691588785046727"
      },
      {
        "name": "MinorityClassSize",
        "value": "2.0"
      },
      {
        "name": "NaiveBayesAUC",
        "value": "0.8595891153666395"
      },
      {
        "name": "NaiveBayesErrRate",
        "value": "0.37142857142857144"
      },
      {
        "name": "NaiveBayesKappa",
        "value": "0.49212451940964896"
      },
      {
        "name": "NumberOfBinaryFeatures",
        "value": "2.0"
      },
      {
        "name": "NumberOfClasses",
        "value": "7.0"
      },
      {
        "name": "NumberOfFeatures",
        "value": "12.0"
      },
      {
        "name": "NumberOfInstances",
        "value": "107.0"
      },
      {
        "name": "NumberOfInstancesWithMissingValues",
        "value": "37.0"
      },
      {
        "name": "NumberOfMissingValues",
        "value": "73.0"
      },
      {
        "name": "NumberOfNumericFeatures",
        "value": "0.0"
      },
      {
        "name": "NumberOfSymbolicFeatures",
        "value": "12.0"
      },
      {
        "name": "PercentageOfBinaryFeatures",
        "value": "16.666666666666664"
      },
      {
        "name": "PercentageOfInstancesWithMissingValues",
        "value": "34.57943925233645"
      },
      {
        "name": "PercentageOfMissingValues",
        "value": "5.685358255451713"
      },
      {
        "name": "PercentageOfNumericFeatures",
        "value": "0.0"
      },
      {
        "name": "PercentageOfSymbolicFeatures",
        "value": "100.0"
      },
      {
        "name": "Quartile1AttributeEntropy",
        "value": "1.1024597817074344"
      },
      {
        "name": "Quartile1KurtosisOfNumericAtts",
        "value": []
      },
      {
        "name": "Quartile1MeansOfNumericAtts",
        "value": []
      },
      {
        "name": "Quartile1MutualInformation",
        "value": "0.23380695589567"
      },
      {
        "name": "Quartile1SkewnessOfNumericAtts",
        "value": []
      },
      {
        "name": "Quartile1StdDevOfNumericAtts",
        "value": []
      },
      {
        "name": "Quartile2AttributeEntropy",
        "value": "1.5001062202571016"
      },
      {
        "name": "Quartile2KurtosisOfNumericAtts",
        "value": []
      },
      {
        "name": "Quartile2MeansOfNumericAtts",
        "value": []
      },
      {
        "name": "Quartile2MutualInformation",
        "value": "0.3574119645586"
      },
      {
        "name": "Quartile2SkewnessOfNumericAtts",
        "value": []
      },
      {
        "name": "Quartile2StdDevOfNumericAtts",
        "value": []
      },
      {
        "name": "Quartile3AttributeEntropy",
        "value": "1.5910363447165845"
      },
      {
        "name": "Quartile3KurtosisOfNumericAtts",
        "value": []
      },
      {
        "name": "Quartile3MeansOfNumericAtts",
        "value": []
      },
      {
        "name": "Quartile3MutualInformation",
        "value": "0.55267684135075"
      },
      {
        "name": "Quartile3SkewnessOfNumericAtts",
        "value": []
      },
      {
        "name": "Quartile3StdDevOfNumericAtts",
        "value": []
      },
      {
        "name": "REPTreeDepth1AUC",
        "value": "0.48998453256093166"
      },
      {
        "name": "REPTreeDepth1ErrRate",
        "value": "0.580952380952381"
      },
      {
        "name": "REPTreeDepth1Kappa",
        "value": "0.0"
      },
      {
        "name": "REPTreeDepth2AUC",
        "value": "0.48998453256093166"
      },
      {
        "name": "REPTreeDepth2ErrRate",
        "value": "0.580952380952381"
      },
      {
        "name": "REPTreeDepth2Kappa",
        "value": "0.0"
      },
      {
        "name": "REPTreeDepth3AUC",
        "value": "0.48998453256093166"
      },
      {
        "name": "REPTreeDepth3ErrRate",
        "value": "0.580952380952381"
      },
      {
        "name": "REPTreeDepth3Kappa",
        "value": "0.0"
      },
      {
        "name": "RandomTreeDepth1AUC",
        "value": "0.6544124675468093"
      },
      {
        "name": "RandomTreeDepth1ErrRate",
        "value": "0.5142857142857142"
      },
      {
        "name": "RandomTreeDepth1Kappa",
        "value": "0.24349566377585055"
      },
      {
        "name": "RandomTreeDepth2AUC",
        "value": "0.6544124675468093"
      },
      {
        "name": "RandomTreeDepth2ErrRate",
        "value": "0.5142857142857142"
      },
      {
        "name": "RandomTreeDepth2Kappa",
        "value": "0.24349566377585055"
      },
      {
        "name": "RandomTreeDepth3AUC",
        "value": "0.6544124675468093"
      },
      {
        "name": "RandomTreeDepth3ErrRate",
        "value": "0.5142857142857142"
      },
      {
        "name": "RandomTreeDepth3Kappa",
        "value": "0.24349566377585055"
      },
      {
        "name": "StdvNominalAttDistinctValues",
        "value": "14.63081016419139"
      },
      {
        "name": "kNN1NAUC",
        "value": "0.7992103360500448"
      },
      {
        "name": "kNN1NErrRate",
        "value": "0.38095238095238093"
      },
      {
        "name": "kNN1NKappa",
        "value": "0.4807121661721068"
      }
    ]
  }
}